Meta Marketing API Ontology
comment: Read-only ontology for Meta Marketing API (v23-v25) resources: ad accounts, campaigns, ad sets, ads, insights, and async report runs. Entities subclass the Inferal Relay ads-core spine.
license: https://creativecommons.org/licenses/by/4.0/
publisher: inferal.com
preferred namespace prefix: meta

Ad
type: Class
subclass of: Ad

Adgroup Review Feedback
type: Class

Adgroup Placement Specific Review Feedback
type: Class

Ad Label
type: Class

Ad Account
type: Class
subclass of: AdAccount

Ad Account Promotable Objects
type: Class

Agency Client Declaration
type: Class

Attribution Spec
type: Class

Business
type: Class

Managed Partner Business
type: Class

Product Catalog
type: Class

Collaborative Ads Share Settings
type: Class

Store Catalog Settings
type: Class

Page
type: Class

Ad Set
type: Class
subclass of: TargetingGroup

Day Part
type: Class

Ad Bid Adjustments
type: Class

Ad Campaign Bid Constraint
type: Class

Brand Safety Campaign Config
type: Class

Campaign
type: Class
subclass of: Campaign

Ad Campaign Group Advantage State
type: Class

Ad Study
type: Class

User
type: Class

Age Range
type: Class

Group
type: Class

Cover Photo
type: Class

Location
type: Class

User Cover Photo
type: Class

Currency
type: Class

Education Experience
type: Class

Experience
type: Class

Payment Pricepoints
type: Class

Video Upload Limits
type: Class

Ad Campaign Issues Info
type: Class

Ad Promoted Object
type: Class

Ad Place Page Set
type: Class

Product Set
type: Class

Product Set Metadata
type: Class

Ad Recommendation
type: Class

Ad Recommendation Data
type: Class

Ad Campaign Frequency Control Specs
type: Class

Ad Campaign Learning Stage Info
type: Class

Regional Regulation Identities
type: Class

Targeting
type: Class

IDName
type: Class

Catalog Based Targeting
type: Class

Connections Targeting
type: Class

Raw Custom Audience
type: Class

Targeting Dynamic Rule
type: Class

Targeting Geo Location
type: Class

Targeting Geo Location City
type: Class

Targeting Geo Location Custom Location
type: Class

Targeting Geo Location Electoral District
type: Class

Targeting Geo Location Market
type: Class

Targeting Geo Location Geo Entities
type: Class

Targeting Geo Location Location Cluster
type: Class

Targeting Geo Location Place
type: Class

Targeting Geo Location Political District
type: Class

Targeting Geo Location Region
type: Class

Targeting Geo Location Zip
type: Class

Targeting Product Audience Spec
type: Class

Targeting Product Audience Sub Spec
type: Class

Flexible Targeting
type: Class

Targeting Prospecting Audience
type: Class

Targeting Subscriber Universe
type: Class

Targeting Automation
type: Class

Targeting Relaxation
type: Class

Placement Soft Opt Out
type: Class
added in version: v24

Trending Topics Spec
type: Class
added in version: v24

Page Category
type: Class

IGUser
type: Class

Shadow IGUser Collaborative Media
type: Class

IGComment
type: Class

IGComment From User
type: Class

IGMedia
type: Class

IGMedia Boost Eligibility Info
type: Class

IGVideo Copyright Check Matches Information
type: Class

IGVideo Copyright Check Status
type: Class

Shop
type: Class

Commerce Merchant Settings
type: Class

Profile
type: Class

Profile Picture Source
type: Class

Mailing Address
type: Class

Copyright Attribution Insights
type: Class

Engagement
type: Class

Ad Video
type: Class

Audio Isrc
type: Class

Audio Asset
type: Class

Video Copyright
type: Class

Video Copyright Segment
type: Class

Video Copyright Geo Gate
type: Class

Copyright Reference Container
type: Class

Video Copyright Rule
type: Class

Video Copyright Condition Group
type: Class

Event
type: Class

Child Event
type: Class

Place
type: Class

Event Registration Setting
type: Class

Event Ticket Setting
type: Class

Music Video Copyright
type: Class

Privacy
type: Class

Video Status
type: Class

Video Copyright Check Status
type: Class

Video Status Processing Phase
type: Class

Video Status Error
type: Class

Video Status Publishing Phase
type: Class

Video Status Uploading Phase
type: Class

Has Lead Access
type: Class

Messaging Feature Status
type: Class

Page Parking
type: Class

Page Payment Options
type: Class

Page Restaurant Services
type: Class

Page Restaurant Specialties
type: Class

Page Start Info
type: Class

Voip Info
type: Class

Product Catalog Image Settings
type: Class

Product Catalog Image Settings Operation
type: Class

Managed Partner Extended Credit
type: Class

Currency Amount
type: Class

Extended Credit Allocation Config
type: Class

Extended Credit
type: Class

CRMAddress
type: Class

Business Managed Partner Eligibility
type: Class

Business Partner Premium Options
type: Class

Marketing Messages Onboarding Status
type: Class

Custom Audience Group
type: Class

Funding Source Details
type: Class

Funding Source Details Coupon
type: Class

Funding Source Details Coupon Tiering
type: Class

Extended Credit Invoice Group
type: Class

Extended Credit Email
type: Class

Delivery Check
type: Class

Delivery Check Extra Info
type: Class

Reach Frequency Spec
type: Class

Ad Account Marketing Messages Settings
type: Class
added in version: v25

Conversion Action Query
type: Class

Ad Creative
type: Class
subclass of: Creative

Ad Creative Ad Disclaimer
type: Class

Ad Asset Feed Spec
type: Class

Ad Asset Feed Additional Data
type: Class

Ad Asset Feed Spec Asset Customization Rule
type: Class

Ad Asset Feed Spec Asset Label
type: Class

Ad Asset Customization Rule Customization Spec
type: Class

Ad Asset Feed Spec Body
type: Class

Ad Asset Feed Spec Call To Action
type: Class

Ad Creative Link Data Call To Action Value
type: Class

Ad Asset Feed Spec Caption
type: Class

Ad Asset Feed Spec Carousel
type: Class

Ad Asset Feed Spec Carousel Child Attachment
type: Class

Ad Asset Feed Spec Description
type: Class

Ad Asset Feed Spec Events
type: Class

Ad Asset Feed Spec Group Rule
type: Class

Ad Asset Feed Spec Image
type: Class

Ads Image Crops
type: Class

Ad Asset Feed Spec Link Url
type: Class

Ad Asset Message Extensions
type: Class

Ad Asset Onsite Destinations
type: Class

Ad Asset Feed Spec Title
type: Class

Ad Asset Feed Spec Video
type: Class

Ad Creative Branded Content Ads
type: Class

Ad Creative Branded Content Ads Partners
type: Class

Ad Creative Link Data Call To Action
type: Class

Ad Creative Contextual Multi Ads
type: Class

Ad Creative Sourcing Spec
type: Class

Ad Creative Promotion Metadata Spec
type: Class

Ad Creative Site Links Spec
type: Class

Ad Creative Degrees Of Freedom Spec
type: Class

Ad Creative Features Spec
type: Class

Ad Creative Feature Details
type: Class

Ad Creative Feature Customizations
type: Class

Ad Creative Facebook Branded Content
type: Class

Ad Creative Instagram Branded Content
type: Class

Ad Creative Interactive Components Spec
type: Class

Ad Creative Object Story Spec
type: Class

Ad Creative Link Data
type: Class

Ad Creative Link Data App Link Spec
type: Class

Android App Link
type: Class

Ios App Link
type: Class

Ad Creative Link Data Child Attachment
type: Class

Ad Creative Place Data
type: Class

Ad Creative Collection Thumbnail Info
type: Class

Ad Customization Rule Spec
type: Class

Ad Creative Template URLSpec
type: Class

Ad Creative Link Data Image Layer Spec
type: Class

Ad Creative Link Data Image Overlay Spec
type: Class

Ad Creative Post Click Configuration
type: Class

Ad Creative Static Fallback Spec
type: Class

Ad Creative Photo Data
type: Class

Ad Creative Product Data
type: Class

Ad Creative Text Data
type: Class

Ad Creative Video Data
type: Class

Ad Creative Omnichannel Link Spec
type: Class

Ad Creative Platform Customization
type: Class

Ad Creative Portrait Customizations
type: Class

Ad Creative Recommender Settings
type: Class

Ad Creative Regional Regulation Disclaimer
type: Class

Ad Creative Destination Spec
type: Class
added in version: v24

Ad Creative Format Transformation Spec
type: Class
added in version: v24

Ad Creative Media Sourcing Spec
type: Class
added in version: v24

Ad Creative Marketing Message Structured Spec
type: Class
added in version: v25

Ad Creative Product Suggestion Settings
type: Class
added in version: v25

Ad Creative Asset Groups Spec
type: Class

Adgroup Issues Info
type: Class

Placement
type: Class

Tracking And Conversion With Defaults
type: Class

Ads Action Stats
type: Class

Ads Histogram Stats
type: Class

Ads Insights
type: Class

Bid Info Record
type: Class

Bid Info Entry
type: Class

Tos Accepted Record
type: Class

Tos Accepted Entry
type: Class

User Tos Accepted Record
type: Class

User Tos Accepted Entry
type: Class

Age Range Record
type: Class

Age Range Entry
type: Class

Account Admin Record
type: Class

Account Admin Entry
type: Class

Ad Record
type: Class

Ad Entry
type: Class

Ads Conversion Experiences Record
type: Class

Ads Conversion Experiences Entry
type: Class

B2c Record
type: Class

B2c Entry
type: Class

B2c Commerce Unified Record
type: Class

B2c Commerce Unified Entry
type: Class

Bsg Record
type: Class

Bsg Entry
type: Class

City Community Record
type: Class

City Community Entry
type: Class

Commerce Record
type: Class

Commerce Entry
type: Class

Compromise Record
type: Class

Compromise Entry
type: Class

Daily Deals Record
type: Class

Daily Deals Entry
type: Class

Daily Deals Legacy Record
type: Class

Daily Deals Legacy Entry
type: Class

Dpa Record
type: Class

Dpa Entry
type: Class

Dri Copyright Record
type: Class

Dri Copyright Entry
type: Class

Dri Counterfeit Record
type: Class

Dri Counterfeit Entry
type: Class

Facebook Record
type: Class

Facebook Entry
type: Class

Facebook Pages Live Shopping Record
type: Class

Facebook Pages Live Shopping Entry
type: Class

Independent Work Record
type: Class

Independent Work Entry
type: Class

Instagram Record
type: Class

Instagram Entry
type: Class

Instagram Shop Record
type: Class

Instagram Shop Entry
type: Class

Job Search Record
type: Class

Job Search Entry
type: Class

Lead Gen Honeypot Record
type: Class

Lead Gen Honeypot Entry
type: Class

Marketplace Record
type: Class

Marketplace Entry
type: Class

Marketplace Home Rentals Record
type: Class

Marketplace Home Rentals Entry
type: Class

Marketplace Home Sales Record
type: Class

Marketplace Home Sales Entry
type: Class

Marketplace Motors Record
type: Class

Marketplace Motors Entry
type: Class

Marketplace Shops Record
type: Class

Marketplace Shops Entry
type: Class

Max Review Placements Record
type: Class

Max Review Placements Entry
type: Class

Neighborhoods Record
type: Class

Neighborhoods Entry
type: Class

Page Admin Record
type: Class

Page Admin Entry
type: Class

Product Record
type: Class

Product Entry
type: Class

Product Service Record
type: Class

Product Service Entry
type: Class

Profile Record
type: Class

Profile Entry
type: Class

Seller Record
type: Class

Seller Entry
type: Class

Shops Record
type: Class

Shops Entry
type: Class

Traffic Quality Record
type: Class

Traffic Quality Entry
type: Class

Unified Commerce Content Record
type: Class

Unified Commerce Content Entry
type: Class

Whatsapp Record
type: Class

Whatsapp Entry
type: Class

Global Record
type: Class

Global Entry
type: Class

Bid Info Record
type: Class

Bid Info Entry
type: Class

Targeting Optimization Types Record
type: Class

Targeting Optimization Types Entry
type: Class

Available Promo Offer Ids Record
type: Class

Available Promo Offer Ids Entry
type: Class

Available Promo Offer Ids Record
type: Class

Available Promo Offer Ids Entry
type: Class

Differently Open Offerings Record
type: Class

Differently Open Offerings Entry
type: Class

Hours Record
type: Class

Hours Entry
type: Class

Priority Hours Record
type: Class

Priority Hours Entry
type: Class

AdAssetCustomizationRuleCustomizationSpecDevicePlatforms
type: ConceptScheme
comment: Values AdAssetCustomizationRuleCustomizationSpec.device_platforms accepts.
has top concept: Desktop
has top concept: Mobile

Desktop
type: Concept
in scheme: AdAssetCustomizationRuleCustomizationSpecDevicePlatforms
top concept of: AdAssetCustomizationRuleCustomizationSpecDevicePlatforms
alternative label: desktop
notation: desktop

Mobile
type: Concept
in scheme: AdAssetCustomizationRuleCustomizationSpecDevicePlatforms
top concept of: AdAssetCustomizationRuleCustomizationSpecDevicePlatforms
alternative label: mobile
notation: mobile

AdAssetFeedSpecCallToActionTypes
type: ConceptScheme
comment: Values AdAssetFeedSpec.call_to_action_types accepts.
has top concept: Add To Cart
has top concept: Apply Now
has top concept: Ask About Services
has top concept: Ask For More Info
has top concept: Audio Call
has top concept: Book AConsultation
has top concept: Book Now
has top concept: Book Travel
has top concept: Buy
has top concept: Buy Now
has top concept: Buy Tickets
has top concept: Buy Via Message
has top concept: Call
has top concept: Call Me
has top concept: Call Now
has top concept: Chat With Us
has top concept: Confirm
has top concept: Contact
has top concept: Contact Us
has top concept: Donate
has top concept: Donate Now
has top concept: Download
has top concept: Event Rsvp
has top concept: Find AGroup
has top concept: Find Your Groups
has top concept: Follow News Storyline
has top concept: Follow Page
has top concept: Follow User
has top concept: Get AQuote
has top concept: Get Directions
has top concept: Get In Touch
has top concept: Get Offer
has top concept: Get Offer View
has top concept: Get Promotions
has top concept: Get Quote
has top concept: Get Showtimes
has top concept: Get Started
has top concept: Inquire Now
has top concept: Install App
has top concept: Install Mobile App
has top concept: Join Channel
has top concept: Learn More
has top concept: Like Page
has top concept: Listen Music
has top concept: Listen Now
has top concept: Make An Appointment
has top concept: Message Page
has top concept: Mobile Download
has top concept: No Button
has top concept: Open Instant App
has top concept: Open Link
has top concept: Order Now
has top concept: Pay To Access
has top concept: Play Game
has top concept: Play Game On Facebook
has top concept: Purchase Gift Cards
has top concept: Raise Money
has top concept: Record Now
has top concept: Refer Friends
has top concept: Request Time
has top concept: Say Thanks
has top concept: See More
has top concept: Sell Now
has top concept: Send AGift
has top concept: Send Gift Money
has top concept: Send Updates
has top concept: Share
has top concept: Shop Now
has top concept: Sign Up
has top concept: Sotto Subscribe
has top concept: Start Order
has top concept: Subscribe
has top concept: Swipe Up Product
has top concept: Swipe Up Shop
has top concept: Update App
has top concept: Use App
has top concept: Use Mobile App

Add To Cart
type: Concept
in scheme: AdAssetFeedSpecCallToActionTypes
top concept of: AdAssetFeedSpecCallToActionTypes
alternative label: addToCart
notation: ADD_TO_CART

Apply Now
type: Concept
in scheme: AdAssetFeedSpecCallToActionTypes
top concept of: AdAssetFeedSpecCallToActionTypes
alternative label: applyNow
notation: APPLY_NOW

Ask About Services
type: Concept
in scheme: AdAssetFeedSpecCallToActionTypes
top concept of: AdAssetFeedSpecCallToActionTypes
alternative label: askAboutServices
notation: ASK_ABOUT_SERVICES

Ask For More Info
type: Concept
in scheme: AdAssetFeedSpecCallToActionTypes
top concept of: AdAssetFeedSpecCallToActionTypes
alternative label: askForMoreInfo
notation: ASK_FOR_MORE_INFO

Audio Call
type: Concept
in scheme: AdAssetFeedSpecCallToActionTypes
top concept of: AdAssetFeedSpecCallToActionTypes
alternative label: audioCall
notation: AUDIO_CALL

Book AConsultation
type: Concept
in scheme: AdAssetFeedSpecCallToActionTypes
top concept of: AdAssetFeedSpecCallToActionTypes
alternative label: bookAConsultation
notation: BOOK_A_CONSULTATION

Book Now
type: Concept
in scheme: AdAssetFeedSpecCallToActionTypes
top concept of: AdAssetFeedSpecCallToActionTypes
alternative label: bookNow
notation: BOOK_NOW

Book Travel
type: Concept
in scheme: AdAssetFeedSpecCallToActionTypes
top concept of: AdAssetFeedSpecCallToActionTypes
alternative label: bookTravel
notation: BOOK_TRAVEL

Buy
type: Concept
in scheme: AdAssetFeedSpecCallToActionTypes
top concept of: AdAssetFeedSpecCallToActionTypes
alternative label: buy
notation: BUY

Buy Now
type: Concept
in scheme: AdAssetFeedSpecCallToActionTypes
top concept of: AdAssetFeedSpecCallToActionTypes
alternative label: buyNow
notation: BUY_NOW

Buy Tickets
type: Concept
in scheme: AdAssetFeedSpecCallToActionTypes
top concept of: AdAssetFeedSpecCallToActionTypes
alternative label: buyTickets
notation: BUY_TICKETS

Buy Via Message
type: Concept
in scheme: AdAssetFeedSpecCallToActionTypes
top concept of: AdAssetFeedSpecCallToActionTypes
alternative label: buyViaMessage
notation: BUY_VIA_MESSAGE

Call
type: Concept
in scheme: AdAssetFeedSpecCallToActionTypes
top concept of: AdAssetFeedSpecCallToActionTypes
alternative label: call
notation: CALL

Call Me
type: Concept
in scheme: AdAssetFeedSpecCallToActionTypes
top concept of: AdAssetFeedSpecCallToActionTypes
alternative label: callMe
notation: CALL_ME

Call Now
type: Concept
in scheme: AdAssetFeedSpecCallToActionTypes
top concept of: AdAssetFeedSpecCallToActionTypes
alternative label: callNow
notation: CALL_NOW

Chat With Us
type: Concept
in scheme: AdAssetFeedSpecCallToActionTypes
top concept of: AdAssetFeedSpecCallToActionTypes
alternative label: chatWithUs
notation: CHAT_WITH_US

Confirm
type: Concept
in scheme: AdAssetFeedSpecCallToActionTypes
top concept of: AdAssetFeedSpecCallToActionTypes
alternative label: confirm
notation: CONFIRM

Contact
type: Concept
in scheme: AdAssetFeedSpecCallToActionTypes
top concept of: AdAssetFeedSpecCallToActionTypes
alternative label: contact
notation: CONTACT

Contact Us
type: Concept
in scheme: AdAssetFeedSpecCallToActionTypes
top concept of: AdAssetFeedSpecCallToActionTypes
alternative label: contactUs
notation: CONTACT_US

Donate
type: Concept
in scheme: AdAssetFeedSpecCallToActionTypes
top concept of: AdAssetFeedSpecCallToActionTypes
alternative label: donate
notation: DONATE

Donate Now
type: Concept
in scheme: AdAssetFeedSpecCallToActionTypes
top concept of: AdAssetFeedSpecCallToActionTypes
alternative label: donateNow
notation: DONATE_NOW

Download
type: Concept
in scheme: AdAssetFeedSpecCallToActionTypes
top concept of: AdAssetFeedSpecCallToActionTypes
alternative label: download
notation: DOWNLOAD

Event Rsvp
type: Concept
in scheme: AdAssetFeedSpecCallToActionTypes
top concept of: AdAssetFeedSpecCallToActionTypes
alternative label: eventRsvp
notation: EVENT_RSVP

Find AGroup
type: Concept
in scheme: AdAssetFeedSpecCallToActionTypes
top concept of: AdAssetFeedSpecCallToActionTypes
alternative label: findAGroup
notation: FIND_A_GROUP

Find Your Groups
type: Concept
in scheme: AdAssetFeedSpecCallToActionTypes
top concept of: AdAssetFeedSpecCallToActionTypes
alternative label: findYourGroups
notation: FIND_YOUR_GROUPS

Follow News Storyline
type: Concept
in scheme: AdAssetFeedSpecCallToActionTypes
top concept of: AdAssetFeedSpecCallToActionTypes
alternative label: followNewsStoryline
notation: FOLLOW_NEWS_STORYLINE

Follow Page
type: Concept
in scheme: AdAssetFeedSpecCallToActionTypes
top concept of: AdAssetFeedSpecCallToActionTypes
alternative label: followPage
notation: FOLLOW_PAGE

Follow User
type: Concept
in scheme: AdAssetFeedSpecCallToActionTypes
top concept of: AdAssetFeedSpecCallToActionTypes
alternative label: followUser
notation: FOLLOW_USER

Get AQuote
type: Concept
in scheme: AdAssetFeedSpecCallToActionTypes
top concept of: AdAssetFeedSpecCallToActionTypes
alternative label: getAQuote
notation: GET_A_QUOTE

Get Directions
type: Concept
in scheme: AdAssetFeedSpecCallToActionTypes
top concept of: AdAssetFeedSpecCallToActionTypes
alternative label: getDirections
notation: GET_DIRECTIONS

Get In Touch
type: Concept
in scheme: AdAssetFeedSpecCallToActionTypes
top concept of: AdAssetFeedSpecCallToActionTypes
alternative label: getInTouch
notation: GET_IN_TOUCH

Get Offer
type: Concept
in scheme: AdAssetFeedSpecCallToActionTypes
top concept of: AdAssetFeedSpecCallToActionTypes
alternative label: getOffer
notation: GET_OFFER

Get Offer View
type: Concept
in scheme: AdAssetFeedSpecCallToActionTypes
top concept of: AdAssetFeedSpecCallToActionTypes
alternative label: getOfferView
notation: GET_OFFER_VIEW

Get Promotions
type: Concept
in scheme: AdAssetFeedSpecCallToActionTypes
top concept of: AdAssetFeedSpecCallToActionTypes
alternative label: getPromotions
notation: GET_PROMOTIONS

Get Quote
type: Concept
in scheme: AdAssetFeedSpecCallToActionTypes
top concept of: AdAssetFeedSpecCallToActionTypes
alternative label: getQuote
notation: GET_QUOTE

Get Showtimes
type: Concept
in scheme: AdAssetFeedSpecCallToActionTypes
top concept of: AdAssetFeedSpecCallToActionTypes
alternative label: getShowtimes
notation: GET_SHOWTIMES

Get Started
type: Concept
in scheme: AdAssetFeedSpecCallToActionTypes
top concept of: AdAssetFeedSpecCallToActionTypes
alternative label: getStarted
notation: GET_STARTED

Inquire Now
type: Concept
in scheme: AdAssetFeedSpecCallToActionTypes
top concept of: AdAssetFeedSpecCallToActionTypes
alternative label: inquireNow
notation: INQUIRE_NOW

Install App
type: Concept
in scheme: AdAssetFeedSpecCallToActionTypes
top concept of: AdAssetFeedSpecCallToActionTypes
alternative label: installApp
notation: INSTALL_APP

Install Mobile App
type: Concept
in scheme: AdAssetFeedSpecCallToActionTypes
top concept of: AdAssetFeedSpecCallToActionTypes
alternative label: installMobileApp
notation: INSTALL_MOBILE_APP

Join Channel
type: Concept
in scheme: AdAssetFeedSpecCallToActionTypes
top concept of: AdAssetFeedSpecCallToActionTypes
alternative label: joinChannel
notation: JOIN_CHANNEL

Learn More
type: Concept
in scheme: AdAssetFeedSpecCallToActionTypes
top concept of: AdAssetFeedSpecCallToActionTypes
alternative label: learnMore
notation: LEARN_MORE

Like Page
type: Concept
in scheme: AdAssetFeedSpecCallToActionTypes
top concept of: AdAssetFeedSpecCallToActionTypes
alternative label: likePage
notation: LIKE_PAGE

Listen Music
type: Concept
in scheme: AdAssetFeedSpecCallToActionTypes
top concept of: AdAssetFeedSpecCallToActionTypes
alternative label: listenMusic
notation: LISTEN_MUSIC

Listen Now
type: Concept
in scheme: AdAssetFeedSpecCallToActionTypes
top concept of: AdAssetFeedSpecCallToActionTypes
alternative label: listenNow
notation: LISTEN_NOW

Make An Appointment
type: Concept
in scheme: AdAssetFeedSpecCallToActionTypes
top concept of: AdAssetFeedSpecCallToActionTypes
alternative label: makeAnAppointment
notation: MAKE_AN_APPOINTMENT

Message Page
type: Concept
in scheme: AdAssetFeedSpecCallToActionTypes
top concept of: AdAssetFeedSpecCallToActionTypes
alternative label: messagePage
notation: MESSAGE_PAGE

Mobile Download
type: Concept
in scheme: AdAssetFeedSpecCallToActionTypes
top concept of: AdAssetFeedSpecCallToActionTypes
alternative label: mobileDownload
notation: MOBILE_DOWNLOAD

No Button
type: Concept
in scheme: AdAssetFeedSpecCallToActionTypes
top concept of: AdAssetFeedSpecCallToActionTypes
alternative label: noButton
notation: NO_BUTTON

Open Instant App
type: Concept
in scheme: AdAssetFeedSpecCallToActionTypes
top concept of: AdAssetFeedSpecCallToActionTypes
alternative label: openInstantApp
notation: OPEN_INSTANT_APP

Open Link
type: Concept
in scheme: AdAssetFeedSpecCallToActionTypes
top concept of: AdAssetFeedSpecCallToActionTypes
alternative label: openLink
notation: OPEN_LINK

Order Now
type: Concept
in scheme: AdAssetFeedSpecCallToActionTypes
top concept of: AdAssetFeedSpecCallToActionTypes
alternative label: orderNow
notation: ORDER_NOW

Pay To Access
type: Concept
in scheme: AdAssetFeedSpecCallToActionTypes
top concept of: AdAssetFeedSpecCallToActionTypes
alternative label: payToAccess
notation: PAY_TO_ACCESS

Play Game
type: Concept
in scheme: AdAssetFeedSpecCallToActionTypes
top concept of: AdAssetFeedSpecCallToActionTypes
alternative label: playGame
notation: PLAY_GAME

Play Game On Facebook
type: Concept
in scheme: AdAssetFeedSpecCallToActionTypes
top concept of: AdAssetFeedSpecCallToActionTypes
alternative label: playGameOnFacebook
notation: PLAY_GAME_ON_FACEBOOK

Purchase Gift Cards
type: Concept
in scheme: AdAssetFeedSpecCallToActionTypes
top concept of: AdAssetFeedSpecCallToActionTypes
alternative label: purchaseGiftCards
notation: PURCHASE_GIFT_CARDS

Raise Money
type: Concept
in scheme: AdAssetFeedSpecCallToActionTypes
top concept of: AdAssetFeedSpecCallToActionTypes
alternative label: raiseMoney
notation: RAISE_MONEY

Record Now
type: Concept
in scheme: AdAssetFeedSpecCallToActionTypes
top concept of: AdAssetFeedSpecCallToActionTypes
alternative label: recordNow
notation: RECORD_NOW

Refer Friends
type: Concept
in scheme: AdAssetFeedSpecCallToActionTypes
top concept of: AdAssetFeedSpecCallToActionTypes
alternative label: referFriends
notation: REFER_FRIENDS

Request Time
type: Concept
in scheme: AdAssetFeedSpecCallToActionTypes
top concept of: AdAssetFeedSpecCallToActionTypes
alternative label: requestTime
notation: REQUEST_TIME

Say Thanks
type: Concept
in scheme: AdAssetFeedSpecCallToActionTypes
top concept of: AdAssetFeedSpecCallToActionTypes
alternative label: sayThanks
notation: SAY_THANKS

See More
type: Concept
in scheme: AdAssetFeedSpecCallToActionTypes
top concept of: AdAssetFeedSpecCallToActionTypes
alternative label: seeMore
notation: SEE_MORE

Sell Now
type: Concept
in scheme: AdAssetFeedSpecCallToActionTypes
top concept of: AdAssetFeedSpecCallToActionTypes
alternative label: sellNow
notation: SELL_NOW

Send AGift
type: Concept
in scheme: AdAssetFeedSpecCallToActionTypes
top concept of: AdAssetFeedSpecCallToActionTypes
alternative label: sendAGift
notation: SEND_A_GIFT

Send Gift Money
type: Concept
in scheme: AdAssetFeedSpecCallToActionTypes
top concept of: AdAssetFeedSpecCallToActionTypes
alternative label: sendGiftMoney
notation: SEND_GIFT_MONEY

Send Updates
type: Concept
in scheme: AdAssetFeedSpecCallToActionTypes
top concept of: AdAssetFeedSpecCallToActionTypes
alternative label: sendUpdates
notation: SEND_UPDATES

Share
type: Concept
in scheme: AdAssetFeedSpecCallToActionTypes
top concept of: AdAssetFeedSpecCallToActionTypes
alternative label: share
notation: SHARE

Shop Now
type: Concept
in scheme: AdAssetFeedSpecCallToActionTypes
top concept of: AdAssetFeedSpecCallToActionTypes
alternative label: shopNow
notation: SHOP_NOW

Sign Up
type: Concept
in scheme: AdAssetFeedSpecCallToActionTypes
top concept of: AdAssetFeedSpecCallToActionTypes
alternative label: signUp
notation: SIGN_UP

Sotto Subscribe
type: Concept
in scheme: AdAssetFeedSpecCallToActionTypes
top concept of: AdAssetFeedSpecCallToActionTypes
alternative label: sottoSubscribe
notation: SOTTO_SUBSCRIBE

Start Order
type: Concept
in scheme: AdAssetFeedSpecCallToActionTypes
top concept of: AdAssetFeedSpecCallToActionTypes
alternative label: startOrder
notation: START_ORDER

Subscribe
type: Concept
in scheme: AdAssetFeedSpecCallToActionTypes
top concept of: AdAssetFeedSpecCallToActionTypes
alternative label: subscribe
notation: SUBSCRIBE

Swipe Up Product
type: Concept
in scheme: AdAssetFeedSpecCallToActionTypes
top concept of: AdAssetFeedSpecCallToActionTypes
alternative label: swipeUpProduct
notation: SWIPE_UP_PRODUCT

Swipe Up Shop
type: Concept
in scheme: AdAssetFeedSpecCallToActionTypes
top concept of: AdAssetFeedSpecCallToActionTypes
alternative label: swipeUpShop
notation: SWIPE_UP_SHOP

Update App
type: Concept
in scheme: AdAssetFeedSpecCallToActionTypes
top concept of: AdAssetFeedSpecCallToActionTypes
alternative label: updateApp
notation: UPDATE_APP

Use App
type: Concept
in scheme: AdAssetFeedSpecCallToActionTypes
top concept of: AdAssetFeedSpecCallToActionTypes
alternative label: useApp
notation: USE_APP

Use Mobile App
type: Concept
in scheme: AdAssetFeedSpecCallToActionTypes
top concept of: AdAssetFeedSpecCallToActionTypes
alternative label: useMobileApp
notation: USE_MOBILE_APP

Video Annotation
type: Concept
in scheme: AdAssetFeedSpecCallToActionTypes
top concept of: AdAssetFeedSpecCallToActionTypes
alternative label: videoAnnotation
notation: VIDEO_ANNOTATION

Video Call
type: Concept
in scheme: AdAssetFeedSpecCallToActionTypes
top concept of: AdAssetFeedSpecCallToActionTypes
alternative label: videoCall
notation: VIDEO_CALL

View Cart
type: Concept
in scheme: AdAssetFeedSpecCallToActionTypes
top concept of: AdAssetFeedSpecCallToActionTypes
alternative label: viewCart
notation: VIEW_CART

View Channel
type: Concept
in scheme: AdAssetFeedSpecCallToActionTypes
top concept of: AdAssetFeedSpecCallToActionTypes
alternative label: viewChannel
notation: VIEW_CHANNEL

View In Cart
type: Concept
in scheme: AdAssetFeedSpecCallToActionTypes
top concept of: AdAssetFeedSpecCallToActionTypes
alternative label: viewInCart
notation: VIEW_IN_CART

View Product
type: Concept
in scheme: AdAssetFeedSpecCallToActionTypes
top concept of: AdAssetFeedSpecCallToActionTypes
alternative label: viewProduct
notation: VIEW_PRODUCT

Visit Pages Feed
type: Concept
in scheme: AdAssetFeedSpecCallToActionTypes
top concept of: AdAssetFeedSpecCallToActionTypes
alternative label: visitPagesFeed
notation: VISIT_PAGES_FEED

Watch Live Video
type: Concept
in scheme: AdAssetFeedSpecCallToActionTypes
top concept of: AdAssetFeedSpecCallToActionTypes
alternative label: watchLiveVideo
notation: WATCH_LIVE_VIDEO

Watch More
type: Concept
in scheme: AdAssetFeedSpecCallToActionTypes
top concept of: AdAssetFeedSpecCallToActionTypes
alternative label: watchMore
notation: WATCH_MORE

Watch Video
type: Concept
in scheme: AdAssetFeedSpecCallToActionTypes
top concept of: AdAssetFeedSpecCallToActionTypes
alternative label: watchVideo
notation: WATCH_VIDEO

Whatsapp Message
type: Concept
in scheme: AdAssetFeedSpecCallToActionTypes
top concept of: AdAssetFeedSpecCallToActionTypes
alternative label: whatsappMessage
notation: WHATSAPP_MESSAGE

Woodhenge Support
type: Concept
in scheme: AdAssetFeedSpecCallToActionTypes
top concept of: AdAssetFeedSpecCallToActionTypes
alternative label: woodhengeSupport
notation: WOODHENGE_SUPPORT

Browse Shop
type: Concept
in scheme: AdAssetFeedSpecCallToActionTypes
top concept of: AdAssetFeedSpecCallToActionTypes
alternative label: browseShop
added in version: v24
notation: BROWSE_SHOP

Find Out More
type: Concept
in scheme: AdAssetFeedSpecCallToActionTypes
top concept of: AdAssetFeedSpecCallToActionTypes
alternative label: findOutMore
added in version: v24
notation: FIND_OUT_MORE

Get Details
type: Concept
in scheme: AdAssetFeedSpecCallToActionTypes
top concept of: AdAssetFeedSpecCallToActionTypes
alternative label: getDetails
added in version: v24
notation: GET_DETAILS

See Shop
type: Concept
in scheme: AdAssetFeedSpecCallToActionTypes
top concept of: AdAssetFeedSpecCallToActionTypes
alternative label: seeShop
added in version: v24
notation: SEE_SHOP

Shop With Ai
type: Concept
in scheme: AdAssetFeedSpecCallToActionTypes
top concept of: AdAssetFeedSpecCallToActionTypes
alternative label: shopWithAi
added in version: v24
notation: SHOP_WITH_AI

Try Demo
type: Concept
in scheme: AdAssetFeedSpecCallToActionTypes
top concept of: AdAssetFeedSpecCallToActionTypes
alternative label: tryDemo
added in version: v24
notation: TRY_DEMO

Try On With Ai
type: Concept
in scheme: AdAssetFeedSpecCallToActionTypes
top concept of: AdAssetFeedSpecCallToActionTypes
alternative label: tryOnWithAi
added in version: v24
notation: TRY_ON_WITH_AI

Visit Website
type: Concept
in scheme: AdAssetFeedSpecCallToActionTypes
top concept of: AdAssetFeedSpecCallToActionTypes
alternative label: visitWebsite
added in version: v24
notation: VISIT_WEBSITE

Ask AQuestion
type: Concept
in scheme: AdAssetFeedSpecCallToActionTypes
top concept of: AdAssetFeedSpecCallToActionTypes
alternative label: askAQuestion
added in version: v25
notation: ASK_A_QUESTION

Ask Us
type: Concept
in scheme: AdAssetFeedSpecCallToActionTypes
top concept of: AdAssetFeedSpecCallToActionTypes
alternative label: askUs
added in version: v25
notation: ASK_US

Chat Now
type: Concept
in scheme: AdAssetFeedSpecCallToActionTypes
top concept of: AdAssetFeedSpecCallToActionTypes
alternative label: chatNow
added in version: v25
notation: CHAT_NOW

Start AChat
type: Concept
in scheme: AdAssetFeedSpecCallToActionTypes
top concept of: AdAssetFeedSpecCallToActionTypes
alternative label: startAChat
added in version: v25
notation: START_A_CHAT

AdBidType
type: ConceptScheme
comment: Values Ad.bid_type accepts.
has top concept: Absolute Ocpm
has top concept: Cpa
has top concept: Cpc
has top concept: Cpm
has top concept: Multi Premium

Absolute Ocpm
type: Concept
in scheme: AdBidType
top concept of: AdBidType
alternative label: absoluteOcpm
notation: ABSOLUTE_OCPM

Cpa
type: Concept
in scheme: AdBidType
top concept of: AdBidType
alternative label: cpa
notation: CPA

Cpc
type: Concept
in scheme: AdBidType
top concept of: AdBidType
alternative label: cpc
notation: CPC

Cpm
type: Concept
in scheme: AdBidType
top concept of: AdBidType
alternative label: cpm
notation: CPM

Multi Premium
type: Concept
in scheme: AdBidType
top concept of: AdBidType
alternative label: multiPremium
notation: MULTI_PREMIUM

AdConfiguredStatus
type: ConceptScheme
comment: Values Ad.configured_status accepts.
has top concept: Active
has top concept: Archived
has top concept: Deleted
has top concept: Paused

Active
type: Concept
in scheme: AdConfiguredStatus
top concept of: AdConfiguredStatus
alternative label: active
notation: ACTIVE

Archived
type: Concept
in scheme: AdConfiguredStatus
top concept of: AdConfiguredStatus
alternative label: archived
notation: ARCHIVED

Deleted
type: Concept
in scheme: AdConfiguredStatus
top concept of: AdConfiguredStatus
alternative label: deleted
notation: DELETED

Paused
type: Concept
in scheme: AdConfiguredStatus
top concept of: AdConfiguredStatus
alternative label: paused
notation: PAUSED

AdCreativeCallToActionType
type: ConceptScheme
comment: Values AdCreative.call_to_action_type accepts.
has top concept: Add To Cart
has top concept: Apply Now
has top concept: Ask About Services
has top concept: Ask For More Info
has top concept: Audio Call
has top concept: Book AConsultation
has top concept: Book Now
has top concept: Book Travel
has top concept: Buy
has top concept: Buy Now
has top concept: Buy Tickets
has top concept: Buy Via Message
has top concept: Call
has top concept: Call Me
has top concept: Call Now
has top concept: Chat With Us
has top concept: Confirm
has top concept: Contact
has top concept: Contact Us
has top concept: Donate
has top concept: Donate Now
has top concept: Download
has top concept: Event Rsvp
has top concept: Find AGroup
has top concept: Find Your Groups
has top concept: Follow News Storyline
has top concept: Follow Page
has top concept: Follow User
has top concept: Get AQuote
has top concept: Get Directions
has top concept: Get In Touch
has top concept: Get Offer
has top concept: Get Offer View
has top concept: Get Promotions
has top concept: Get Quote
has top concept: Get Showtimes
has top concept: Get Started
has top concept: Inquire Now
has top concept: Install App
has top concept: Install Mobile App
has top concept: Join Channel
has top concept: Learn More
has top concept: Like Page
has top concept: Listen Music
has top concept: Listen Now
has top concept: Make An Appointment
has top concept: Message Page
has top concept: Mobile Download
has top concept: No Button
has top concept: Open Instant App
has top concept: Open Link
has top concept: Order Now
has top concept: Pay To Access
has top concept: Play Game
has top concept: Play Game On Facebook
has top concept: Purchase Gift Cards
has top concept: Raise Money
has top concept: Record Now
has top concept: Refer Friends
has top concept: Request Time
has top concept: Say Thanks
has top concept: See More
has top concept: Sell Now
has top concept: Send AGift
has top concept: Send Gift Money
has top concept: Send Updates
has top concept: Share
has top concept: Shop Now
has top concept: Sign Up
has top concept: Sotto Subscribe
has top concept: Start Order
has top concept: Subscribe
has top concept: Swipe Up Product
has top concept: Swipe Up Shop
has top concept: Update App
has top concept: Use App
has top concept: Use Mobile App

Add To Cart
type: Concept
in scheme: AdCreativeCallToActionType
top concept of: AdCreativeCallToActionType
alternative label: addToCart
notation: ADD_TO_CART

Apply Now
type: Concept
in scheme: AdCreativeCallToActionType
top concept of: AdCreativeCallToActionType
alternative label: applyNow
notation: APPLY_NOW

Ask About Services
type: Concept
in scheme: AdCreativeCallToActionType
top concept of: AdCreativeCallToActionType
alternative label: askAboutServices
notation: ASK_ABOUT_SERVICES

Ask For More Info
type: Concept
in scheme: AdCreativeCallToActionType
top concept of: AdCreativeCallToActionType
alternative label: askForMoreInfo
notation: ASK_FOR_MORE_INFO

Audio Call
type: Concept
in scheme: AdCreativeCallToActionType
top concept of: AdCreativeCallToActionType
alternative label: audioCall
notation: AUDIO_CALL

Book AConsultation
type: Concept
in scheme: AdCreativeCallToActionType
top concept of: AdCreativeCallToActionType
alternative label: bookAConsultation
notation: BOOK_A_CONSULTATION

Book Now
type: Concept
in scheme: AdCreativeCallToActionType
top concept of: AdCreativeCallToActionType
alternative label: bookNow
notation: BOOK_NOW

Book Travel
type: Concept
in scheme: AdCreativeCallToActionType
top concept of: AdCreativeCallToActionType
alternative label: bookTravel
notation: BOOK_TRAVEL

Buy
type: Concept
in scheme: AdCreativeCallToActionType
top concept of: AdCreativeCallToActionType
alternative label: buy
notation: BUY

Buy Now
type: Concept
in scheme: AdCreativeCallToActionType
top concept of: AdCreativeCallToActionType
alternative label: buyNow
notation: BUY_NOW

Buy Tickets
type: Concept
in scheme: AdCreativeCallToActionType
top concept of: AdCreativeCallToActionType
alternative label: buyTickets
notation: BUY_TICKETS

Buy Via Message
type: Concept
in scheme: AdCreativeCallToActionType
top concept of: AdCreativeCallToActionType
alternative label: buyViaMessage
notation: BUY_VIA_MESSAGE

Call
type: Concept
in scheme: AdCreativeCallToActionType
top concept of: AdCreativeCallToActionType
alternative label: call
notation: CALL

Call Me
type: Concept
in scheme: AdCreativeCallToActionType
top concept of: AdCreativeCallToActionType
alternative label: callMe
notation: CALL_ME

Call Now
type: Concept
in scheme: AdCreativeCallToActionType
top concept of: AdCreativeCallToActionType
alternative label: callNow
notation: CALL_NOW

Chat With Us
type: Concept
in scheme: AdCreativeCallToActionType
top concept of: AdCreativeCallToActionType
alternative label: chatWithUs
notation: CHAT_WITH_US

Confirm
type: Concept
in scheme: AdCreativeCallToActionType
top concept of: AdCreativeCallToActionType
alternative label: confirm
notation: CONFIRM

Contact
type: Concept
in scheme: AdCreativeCallToActionType
top concept of: AdCreativeCallToActionType
alternative label: contact
notation: CONTACT

Contact Us
type: Concept
in scheme: AdCreativeCallToActionType
top concept of: AdCreativeCallToActionType
alternative label: contactUs
notation: CONTACT_US

Donate
type: Concept
in scheme: AdCreativeCallToActionType
top concept of: AdCreativeCallToActionType
alternative label: donate
notation: DONATE

Donate Now
type: Concept
in scheme: AdCreativeCallToActionType
top concept of: AdCreativeCallToActionType
alternative label: donateNow
notation: DONATE_NOW

Download
type: Concept
in scheme: AdCreativeCallToActionType
top concept of: AdCreativeCallToActionType
alternative label: download
notation: DOWNLOAD

Event Rsvp
type: Concept
in scheme: AdCreativeCallToActionType
top concept of: AdCreativeCallToActionType
alternative label: eventRsvp
notation: EVENT_RSVP

Find AGroup
type: Concept
in scheme: AdCreativeCallToActionType
top concept of: AdCreativeCallToActionType
alternative label: findAGroup
notation: FIND_A_GROUP

Find Your Groups
type: Concept
in scheme: AdCreativeCallToActionType
top concept of: AdCreativeCallToActionType
alternative label: findYourGroups
notation: FIND_YOUR_GROUPS

Follow News Storyline
type: Concept
in scheme: AdCreativeCallToActionType
top concept of: AdCreativeCallToActionType
alternative label: followNewsStoryline
notation: FOLLOW_NEWS_STORYLINE

Follow Page
type: Concept
in scheme: AdCreativeCallToActionType
top concept of: AdCreativeCallToActionType
alternative label: followPage
notation: FOLLOW_PAGE

Follow User
type: Concept
in scheme: AdCreativeCallToActionType
top concept of: AdCreativeCallToActionType
alternative label: followUser
notation: FOLLOW_USER

Get AQuote
type: Concept
in scheme: AdCreativeCallToActionType
top concept of: AdCreativeCallToActionType
alternative label: getAQuote
notation: GET_A_QUOTE

Get Directions
type: Concept
in scheme: AdCreativeCallToActionType
top concept of: AdCreativeCallToActionType
alternative label: getDirections
notation: GET_DIRECTIONS

Get In Touch
type: Concept
in scheme: AdCreativeCallToActionType
top concept of: AdCreativeCallToActionType
alternative label: getInTouch
notation: GET_IN_TOUCH

Get Offer
type: Concept
in scheme: AdCreativeCallToActionType
top concept of: AdCreativeCallToActionType
alternative label: getOffer
notation: GET_OFFER

Get Offer View
type: Concept
in scheme: AdCreativeCallToActionType
top concept of: AdCreativeCallToActionType
alternative label: getOfferView
notation: GET_OFFER_VIEW

Get Promotions
type: Concept
in scheme: AdCreativeCallToActionType
top concept of: AdCreativeCallToActionType
alternative label: getPromotions
notation: GET_PROMOTIONS

Get Quote
type: Concept
in scheme: AdCreativeCallToActionType
top concept of: AdCreativeCallToActionType
alternative label: getQuote
notation: GET_QUOTE

Get Showtimes
type: Concept
in scheme: AdCreativeCallToActionType
top concept of: AdCreativeCallToActionType
alternative label: getShowtimes
notation: GET_SHOWTIMES

Get Started
type: Concept
in scheme: AdCreativeCallToActionType
top concept of: AdCreativeCallToActionType
alternative label: getStarted
notation: GET_STARTED

Inquire Now
type: Concept
in scheme: AdCreativeCallToActionType
top concept of: AdCreativeCallToActionType
alternative label: inquireNow
notation: INQUIRE_NOW

Install App
type: Concept
in scheme: AdCreativeCallToActionType
top concept of: AdCreativeCallToActionType
alternative label: installApp
notation: INSTALL_APP

Install Mobile App
type: Concept
in scheme: AdCreativeCallToActionType
top concept of: AdCreativeCallToActionType
alternative label: installMobileApp
notation: INSTALL_MOBILE_APP

Join Channel
type: Concept
in scheme: AdCreativeCallToActionType
top concept of: AdCreativeCallToActionType
alternative label: joinChannel
notation: JOIN_CHANNEL

Learn More
type: Concept
in scheme: AdCreativeCallToActionType
top concept of: AdCreativeCallToActionType
alternative label: learnMore
notation: LEARN_MORE

Like Page
type: Concept
in scheme: AdCreativeCallToActionType
top concept of: AdCreativeCallToActionType
alternative label: likePage
notation: LIKE_PAGE

Listen Music
type: Concept
in scheme: AdCreativeCallToActionType
top concept of: AdCreativeCallToActionType
alternative label: listenMusic
notation: LISTEN_MUSIC

Listen Now
type: Concept
in scheme: AdCreativeCallToActionType
top concept of: AdCreativeCallToActionType
alternative label: listenNow
notation: LISTEN_NOW

Make An Appointment
type: Concept
in scheme: AdCreativeCallToActionType
top concept of: AdCreativeCallToActionType
alternative label: makeAnAppointment
notation: MAKE_AN_APPOINTMENT

Message Page
type: Concept
in scheme: AdCreativeCallToActionType
top concept of: AdCreativeCallToActionType
alternative label: messagePage
notation: MESSAGE_PAGE

Mobile Download
type: Concept
in scheme: AdCreativeCallToActionType
top concept of: AdCreativeCallToActionType
alternative label: mobileDownload
notation: MOBILE_DOWNLOAD

No Button
type: Concept
in scheme: AdCreativeCallToActionType
top concept of: AdCreativeCallToActionType
alternative label: noButton
notation: NO_BUTTON

Open Instant App
type: Concept
in scheme: AdCreativeCallToActionType
top concept of: AdCreativeCallToActionType
alternative label: openInstantApp
notation: OPEN_INSTANT_APP

Open Link
type: Concept
in scheme: AdCreativeCallToActionType
top concept of: AdCreativeCallToActionType
alternative label: openLink
notation: OPEN_LINK

Order Now
type: Concept
in scheme: AdCreativeCallToActionType
top concept of: AdCreativeCallToActionType
alternative label: orderNow
notation: ORDER_NOW

Pay To Access
type: Concept
in scheme: AdCreativeCallToActionType
top concept of: AdCreativeCallToActionType
alternative label: payToAccess
notation: PAY_TO_ACCESS

Play Game
type: Concept
in scheme: AdCreativeCallToActionType
top concept of: AdCreativeCallToActionType
alternative label: playGame
notation: PLAY_GAME

Play Game On Facebook
type: Concept
in scheme: AdCreativeCallToActionType
top concept of: AdCreativeCallToActionType
alternative label: playGameOnFacebook
notation: PLAY_GAME_ON_FACEBOOK

Purchase Gift Cards
type: Concept
in scheme: AdCreativeCallToActionType
top concept of: AdCreativeCallToActionType
alternative label: purchaseGiftCards
notation: PURCHASE_GIFT_CARDS

Raise Money
type: Concept
in scheme: AdCreativeCallToActionType
top concept of: AdCreativeCallToActionType
alternative label: raiseMoney
notation: RAISE_MONEY

Record Now
type: Concept
in scheme: AdCreativeCallToActionType
top concept of: AdCreativeCallToActionType
alternative label: recordNow
notation: RECORD_NOW

Refer Friends
type: Concept
in scheme: AdCreativeCallToActionType
top concept of: AdCreativeCallToActionType
alternative label: referFriends
notation: REFER_FRIENDS

Request Time
type: Concept
in scheme: AdCreativeCallToActionType
top concept of: AdCreativeCallToActionType
alternative label: requestTime
notation: REQUEST_TIME

Say Thanks
type: Concept
in scheme: AdCreativeCallToActionType
top concept of: AdCreativeCallToActionType
alternative label: sayThanks
notation: SAY_THANKS

See More
type: Concept
in scheme: AdCreativeCallToActionType
top concept of: AdCreativeCallToActionType
alternative label: seeMore
notation: SEE_MORE

Sell Now
type: Concept
in scheme: AdCreativeCallToActionType
top concept of: AdCreativeCallToActionType
alternative label: sellNow
notation: SELL_NOW

Send AGift
type: Concept
in scheme: AdCreativeCallToActionType
top concept of: AdCreativeCallToActionType
alternative label: sendAGift
notation: SEND_A_GIFT

Send Gift Money
type: Concept
in scheme: AdCreativeCallToActionType
top concept of: AdCreativeCallToActionType
alternative label: sendGiftMoney
notation: SEND_GIFT_MONEY

Send Updates
type: Concept
in scheme: AdCreativeCallToActionType
top concept of: AdCreativeCallToActionType
alternative label: sendUpdates
notation: SEND_UPDATES

Share
type: Concept
in scheme: AdCreativeCallToActionType
top concept of: AdCreativeCallToActionType
alternative label: share
notation: SHARE

Shop Now
type: Concept
in scheme: AdCreativeCallToActionType
top concept of: AdCreativeCallToActionType
alternative label: shopNow
notation: SHOP_NOW

Sign Up
type: Concept
in scheme: AdCreativeCallToActionType
top concept of: AdCreativeCallToActionType
alternative label: signUp
notation: SIGN_UP

Sotto Subscribe
type: Concept
in scheme: AdCreativeCallToActionType
top concept of: AdCreativeCallToActionType
alternative label: sottoSubscribe
notation: SOTTO_SUBSCRIBE

Start Order
type: Concept
in scheme: AdCreativeCallToActionType
top concept of: AdCreativeCallToActionType
alternative label: startOrder
notation: START_ORDER

Subscribe
type: Concept
in scheme: AdCreativeCallToActionType
top concept of: AdCreativeCallToActionType
alternative label: subscribe
notation: SUBSCRIBE

Swipe Up Product
type: Concept
in scheme: AdCreativeCallToActionType
top concept of: AdCreativeCallToActionType
alternative label: swipeUpProduct
notation: SWIPE_UP_PRODUCT

Swipe Up Shop
type: Concept
in scheme: AdCreativeCallToActionType
top concept of: AdCreativeCallToActionType
alternative label: swipeUpShop
notation: SWIPE_UP_SHOP

Update App
type: Concept
in scheme: AdCreativeCallToActionType
top concept of: AdCreativeCallToActionType
alternative label: updateApp
notation: UPDATE_APP

Use App
type: Concept
in scheme: AdCreativeCallToActionType
top concept of: AdCreativeCallToActionType
alternative label: useApp
notation: USE_APP

Use Mobile App
type: Concept
in scheme: AdCreativeCallToActionType
top concept of: AdCreativeCallToActionType
alternative label: useMobileApp
notation: USE_MOBILE_APP

Video Annotation
type: Concept
in scheme: AdCreativeCallToActionType
top concept of: AdCreativeCallToActionType
alternative label: videoAnnotation
notation: VIDEO_ANNOTATION

Video Call
type: Concept
in scheme: AdCreativeCallToActionType
top concept of: AdCreativeCallToActionType
alternative label: videoCall
notation: VIDEO_CALL

View Cart
type: Concept
in scheme: AdCreativeCallToActionType
top concept of: AdCreativeCallToActionType
alternative label: viewCart
notation: VIEW_CART

View Channel
type: Concept
in scheme: AdCreativeCallToActionType
top concept of: AdCreativeCallToActionType
alternative label: viewChannel
notation: VIEW_CHANNEL

View In Cart
type: Concept
in scheme: AdCreativeCallToActionType
top concept of: AdCreativeCallToActionType
alternative label: viewInCart
notation: VIEW_IN_CART

View Product
type: Concept
in scheme: AdCreativeCallToActionType
top concept of: AdCreativeCallToActionType
alternative label: viewProduct
notation: VIEW_PRODUCT

Visit Pages Feed
type: Concept
in scheme: AdCreativeCallToActionType
top concept of: AdCreativeCallToActionType
alternative label: visitPagesFeed
notation: VISIT_PAGES_FEED

Watch Live Video
type: Concept
in scheme: AdCreativeCallToActionType
top concept of: AdCreativeCallToActionType
alternative label: watchLiveVideo
notation: WATCH_LIVE_VIDEO

Watch More
type: Concept
in scheme: AdCreativeCallToActionType
top concept of: AdCreativeCallToActionType
alternative label: watchMore
notation: WATCH_MORE

Watch Video
type: Concept
in scheme: AdCreativeCallToActionType
top concept of: AdCreativeCallToActionType
alternative label: watchVideo
notation: WATCH_VIDEO

Whatsapp Message
type: Concept
in scheme: AdCreativeCallToActionType
top concept of: AdCreativeCallToActionType
alternative label: whatsappMessage
notation: WHATSAPP_MESSAGE

Woodhenge Support
type: Concept
in scheme: AdCreativeCallToActionType
top concept of: AdCreativeCallToActionType
alternative label: woodhengeSupport
notation: WOODHENGE_SUPPORT

Browse Shop
type: Concept
in scheme: AdCreativeCallToActionType
top concept of: AdCreativeCallToActionType
alternative label: browseShop
added in version: v24
notation: BROWSE_SHOP

Find Out More
type: Concept
in scheme: AdCreativeCallToActionType
top concept of: AdCreativeCallToActionType
alternative label: findOutMore
added in version: v24
notation: FIND_OUT_MORE

Get Details
type: Concept
in scheme: AdCreativeCallToActionType
top concept of: AdCreativeCallToActionType
alternative label: getDetails
added in version: v24
notation: GET_DETAILS

See Shop
type: Concept
in scheme: AdCreativeCallToActionType
top concept of: AdCreativeCallToActionType
alternative label: seeShop
added in version: v24
notation: SEE_SHOP

Shop With Ai
type: Concept
in scheme: AdCreativeCallToActionType
top concept of: AdCreativeCallToActionType
alternative label: shopWithAi
added in version: v24
notation: SHOP_WITH_AI

Try Demo
type: Concept
in scheme: AdCreativeCallToActionType
top concept of: AdCreativeCallToActionType
alternative label: tryDemo
added in version: v24
notation: TRY_DEMO

Try On With Ai
type: Concept
in scheme: AdCreativeCallToActionType
top concept of: AdCreativeCallToActionType
alternative label: tryOnWithAi
added in version: v24
notation: TRY_ON_WITH_AI

Visit Website
type: Concept
in scheme: AdCreativeCallToActionType
top concept of: AdCreativeCallToActionType
alternative label: visitWebsite
added in version: v24
notation: VISIT_WEBSITE

Ask AQuestion
type: Concept
in scheme: AdCreativeCallToActionType
top concept of: AdCreativeCallToActionType
alternative label: askAQuestion
added in version: v25
notation: ASK_A_QUESTION

Ask Us
type: Concept
in scheme: AdCreativeCallToActionType
top concept of: AdCreativeCallToActionType
alternative label: askUs
added in version: v25
notation: ASK_US

Chat Now
type: Concept
in scheme: AdCreativeCallToActionType
top concept of: AdCreativeCallToActionType
alternative label: chatNow
added in version: v25
notation: CHAT_NOW

Start AChat
type: Concept
in scheme: AdCreativeCallToActionType
top concept of: AdCreativeCallToActionType
alternative label: startAChat
added in version: v25
notation: START_A_CHAT

AdCreativeLinkDataCallToActionType
type: ConceptScheme
comment: Values AdCreativeLinkDataCallToAction.type accepts.
has top concept: Add To Cart
has top concept: Apply Now
has top concept: Ask About Services
has top concept: Ask For More Info
has top concept: Audio Call
has top concept: Book AConsultation
has top concept: Book Now
has top concept: Book Travel
has top concept: Buy
has top concept: Buy Now
has top concept: Buy Tickets
has top concept: Buy Via Message
has top concept: Call
has top concept: Call Me
has top concept: Call Now
has top concept: Chat With Us
has top concept: Confirm
has top concept: Contact
has top concept: Contact Us
has top concept: Donate
has top concept: Donate Now
has top concept: Download
has top concept: Event Rsvp
has top concept: Find AGroup
has top concept: Find Your Groups
has top concept: Follow News Storyline
has top concept: Follow Page
has top concept: Follow User
has top concept: Get AQuote
has top concept: Get Directions
has top concept: Get In Touch
has top concept: Get Offer
has top concept: Get Offer View
has top concept: Get Promotions
has top concept: Get Quote
has top concept: Get Showtimes
has top concept: Get Started
has top concept: Inquire Now
has top concept: Install App
has top concept: Install Mobile App
has top concept: Join Channel
has top concept: Learn More
has top concept: Like Page
has top concept: Listen Music
has top concept: Listen Now
has top concept: Make An Appointment
has top concept: Message Page
has top concept: Mobile Download
has top concept: No Button
has top concept: Open Instant App
has top concept: Open Link
has top concept: Order Now
has top concept: Pay To Access
has top concept: Play Game
has top concept: Play Game On Facebook
has top concept: Purchase Gift Cards
has top concept: Raise Money
has top concept: Record Now
has top concept: Refer Friends
has top concept: Request Time
has top concept: Say Thanks
has top concept: See More
has top concept: Sell Now
has top concept: Send AGift
has top concept: Send Gift Money
has top concept: Send Updates
has top concept: Share
has top concept: Shop Now
has top concept: Sign Up
has top concept: Sotto Subscribe
has top concept: Start Order
has top concept: Subscribe
has top concept: Swipe Up Product
has top concept: Swipe Up Shop
has top concept: Update App
has top concept: Use App
has top concept: Use Mobile App

Add To Cart
type: Concept
in scheme: AdCreativeLinkDataCallToActionType
top concept of: AdCreativeLinkDataCallToActionType
alternative label: addToCart
notation: ADD_TO_CART

Apply Now
type: Concept
in scheme: AdCreativeLinkDataCallToActionType
top concept of: AdCreativeLinkDataCallToActionType
alternative label: applyNow
notation: APPLY_NOW

Ask About Services
type: Concept
in scheme: AdCreativeLinkDataCallToActionType
top concept of: AdCreativeLinkDataCallToActionType
alternative label: askAboutServices
notation: ASK_ABOUT_SERVICES

Ask For More Info
type: Concept
in scheme: AdCreativeLinkDataCallToActionType
top concept of: AdCreativeLinkDataCallToActionType
alternative label: askForMoreInfo
notation: ASK_FOR_MORE_INFO

Audio Call
type: Concept
in scheme: AdCreativeLinkDataCallToActionType
top concept of: AdCreativeLinkDataCallToActionType
alternative label: audioCall
notation: AUDIO_CALL

Book AConsultation
type: Concept
in scheme: AdCreativeLinkDataCallToActionType
top concept of: AdCreativeLinkDataCallToActionType
alternative label: bookAConsultation
notation: BOOK_A_CONSULTATION

Book Now
type: Concept
in scheme: AdCreativeLinkDataCallToActionType
top concept of: AdCreativeLinkDataCallToActionType
alternative label: bookNow
notation: BOOK_NOW

Book Travel
type: Concept
in scheme: AdCreativeLinkDataCallToActionType
top concept of: AdCreativeLinkDataCallToActionType
alternative label: bookTravel
notation: BOOK_TRAVEL

Buy
type: Concept
in scheme: AdCreativeLinkDataCallToActionType
top concept of: AdCreativeLinkDataCallToActionType
alternative label: buy
notation: BUY

Buy Now
type: Concept
in scheme: AdCreativeLinkDataCallToActionType
top concept of: AdCreativeLinkDataCallToActionType
alternative label: buyNow
notation: BUY_NOW

Buy Tickets
type: Concept
in scheme: AdCreativeLinkDataCallToActionType
top concept of: AdCreativeLinkDataCallToActionType
alternative label: buyTickets
notation: BUY_TICKETS

Buy Via Message
type: Concept
in scheme: AdCreativeLinkDataCallToActionType
top concept of: AdCreativeLinkDataCallToActionType
alternative label: buyViaMessage
notation: BUY_VIA_MESSAGE

Call
type: Concept
in scheme: AdCreativeLinkDataCallToActionType
top concept of: AdCreativeLinkDataCallToActionType
alternative label: call
notation: CALL

Call Me
type: Concept
in scheme: AdCreativeLinkDataCallToActionType
top concept of: AdCreativeLinkDataCallToActionType
alternative label: callMe
notation: CALL_ME

Call Now
type: Concept
in scheme: AdCreativeLinkDataCallToActionType
top concept of: AdCreativeLinkDataCallToActionType
alternative label: callNow
notation: CALL_NOW

Chat With Us
type: Concept
in scheme: AdCreativeLinkDataCallToActionType
top concept of: AdCreativeLinkDataCallToActionType
alternative label: chatWithUs
notation: CHAT_WITH_US

Confirm
type: Concept
in scheme: AdCreativeLinkDataCallToActionType
top concept of: AdCreativeLinkDataCallToActionType
alternative label: confirm
notation: CONFIRM

Contact
type: Concept
in scheme: AdCreativeLinkDataCallToActionType
top concept of: AdCreativeLinkDataCallToActionType
alternative label: contact
notation: CONTACT

Contact Us
type: Concept
in scheme: AdCreativeLinkDataCallToActionType
top concept of: AdCreativeLinkDataCallToActionType
alternative label: contactUs
notation: CONTACT_US

Donate
type: Concept
in scheme: AdCreativeLinkDataCallToActionType
top concept of: AdCreativeLinkDataCallToActionType
alternative label: donate
notation: DONATE

Donate Now
type: Concept
in scheme: AdCreativeLinkDataCallToActionType
top concept of: AdCreativeLinkDataCallToActionType
alternative label: donateNow
notation: DONATE_NOW

Download
type: Concept
in scheme: AdCreativeLinkDataCallToActionType
top concept of: AdCreativeLinkDataCallToActionType
alternative label: download
notation: DOWNLOAD

Event Rsvp
type: Concept
in scheme: AdCreativeLinkDataCallToActionType
top concept of: AdCreativeLinkDataCallToActionType
alternative label: eventRsvp
notation: EVENT_RSVP

Find AGroup
type: Concept
in scheme: AdCreativeLinkDataCallToActionType
top concept of: AdCreativeLinkDataCallToActionType
alternative label: findAGroup
notation: FIND_A_GROUP

Find Your Groups
type: Concept
in scheme: AdCreativeLinkDataCallToActionType
top concept of: AdCreativeLinkDataCallToActionType
alternative label: findYourGroups
notation: FIND_YOUR_GROUPS

Follow News Storyline
type: Concept
in scheme: AdCreativeLinkDataCallToActionType
top concept of: AdCreativeLinkDataCallToActionType
alternative label: followNewsStoryline
notation: FOLLOW_NEWS_STORYLINE

Follow Page
type: Concept
in scheme: AdCreativeLinkDataCallToActionType
top concept of: AdCreativeLinkDataCallToActionType
alternative label: followPage
notation: FOLLOW_PAGE

Follow User
type: Concept
in scheme: AdCreativeLinkDataCallToActionType
top concept of: AdCreativeLinkDataCallToActionType
alternative label: followUser
notation: FOLLOW_USER

Get AQuote
type: Concept
in scheme: AdCreativeLinkDataCallToActionType
top concept of: AdCreativeLinkDataCallToActionType
alternative label: getAQuote
notation: GET_A_QUOTE

Get Directions
type: Concept
in scheme: AdCreativeLinkDataCallToActionType
top concept of: AdCreativeLinkDataCallToActionType
alternative label: getDirections
notation: GET_DIRECTIONS

Get In Touch
type: Concept
in scheme: AdCreativeLinkDataCallToActionType
top concept of: AdCreativeLinkDataCallToActionType
alternative label: getInTouch
notation: GET_IN_TOUCH

Get Offer
type: Concept
in scheme: AdCreativeLinkDataCallToActionType
top concept of: AdCreativeLinkDataCallToActionType
alternative label: getOffer
notation: GET_OFFER

Get Offer View
type: Concept
in scheme: AdCreativeLinkDataCallToActionType
top concept of: AdCreativeLinkDataCallToActionType
alternative label: getOfferView
notation: GET_OFFER_VIEW

Get Promotions
type: Concept
in scheme: AdCreativeLinkDataCallToActionType
top concept of: AdCreativeLinkDataCallToActionType
alternative label: getPromotions
notation: GET_PROMOTIONS

Get Quote
type: Concept
in scheme: AdCreativeLinkDataCallToActionType
top concept of: AdCreativeLinkDataCallToActionType
alternative label: getQuote
notation: GET_QUOTE

Get Showtimes
type: Concept
in scheme: AdCreativeLinkDataCallToActionType
top concept of: AdCreativeLinkDataCallToActionType
alternative label: getShowtimes
notation: GET_SHOWTIMES

Get Started
type: Concept
in scheme: AdCreativeLinkDataCallToActionType
top concept of: AdCreativeLinkDataCallToActionType
alternative label: getStarted
notation: GET_STARTED

Inquire Now
type: Concept
in scheme: AdCreativeLinkDataCallToActionType
top concept of: AdCreativeLinkDataCallToActionType
alternative label: inquireNow
notation: INQUIRE_NOW

Install App
type: Concept
in scheme: AdCreativeLinkDataCallToActionType
top concept of: AdCreativeLinkDataCallToActionType
alternative label: installApp
notation: INSTALL_APP

Install Mobile App
type: Concept
in scheme: AdCreativeLinkDataCallToActionType
top concept of: AdCreativeLinkDataCallToActionType
alternative label: installMobileApp
notation: INSTALL_MOBILE_APP

Join Channel
type: Concept
in scheme: AdCreativeLinkDataCallToActionType
top concept of: AdCreativeLinkDataCallToActionType
alternative label: joinChannel
notation: JOIN_CHANNEL

Learn More
type: Concept
in scheme: AdCreativeLinkDataCallToActionType
top concept of: AdCreativeLinkDataCallToActionType
alternative label: learnMore
notation: LEARN_MORE

Like Page
type: Concept
in scheme: AdCreativeLinkDataCallToActionType
top concept of: AdCreativeLinkDataCallToActionType
alternative label: likePage
notation: LIKE_PAGE

Listen Music
type: Concept
in scheme: AdCreativeLinkDataCallToActionType
top concept of: AdCreativeLinkDataCallToActionType
alternative label: listenMusic
notation: LISTEN_MUSIC

Listen Now
type: Concept
in scheme: AdCreativeLinkDataCallToActionType
top concept of: AdCreativeLinkDataCallToActionType
alternative label: listenNow
notation: LISTEN_NOW

Make An Appointment
type: Concept
in scheme: AdCreativeLinkDataCallToActionType
top concept of: AdCreativeLinkDataCallToActionType
alternative label: makeAnAppointment
notation: MAKE_AN_APPOINTMENT

Message Page
type: Concept
in scheme: AdCreativeLinkDataCallToActionType
top concept of: AdCreativeLinkDataCallToActionType
alternative label: messagePage
notation: MESSAGE_PAGE

Mobile Download
type: Concept
in scheme: AdCreativeLinkDataCallToActionType
top concept of: AdCreativeLinkDataCallToActionType
alternative label: mobileDownload
notation: MOBILE_DOWNLOAD

No Button
type: Concept
in scheme: AdCreativeLinkDataCallToActionType
top concept of: AdCreativeLinkDataCallToActionType
alternative label: noButton
notation: NO_BUTTON

Open Instant App
type: Concept
in scheme: AdCreativeLinkDataCallToActionType
top concept of: AdCreativeLinkDataCallToActionType
alternative label: openInstantApp
notation: OPEN_INSTANT_APP

Open Link
type: Concept
in scheme: AdCreativeLinkDataCallToActionType
top concept of: AdCreativeLinkDataCallToActionType
alternative label: openLink
notation: OPEN_LINK

Order Now
type: Concept
in scheme: AdCreativeLinkDataCallToActionType
top concept of: AdCreativeLinkDataCallToActionType
alternative label: orderNow
notation: ORDER_NOW

Pay To Access
type: Concept
in scheme: AdCreativeLinkDataCallToActionType
top concept of: AdCreativeLinkDataCallToActionType
alternative label: payToAccess
notation: PAY_TO_ACCESS

Play Game
type: Concept
in scheme: AdCreativeLinkDataCallToActionType
top concept of: AdCreativeLinkDataCallToActionType
alternative label: playGame
notation: PLAY_GAME

Play Game On Facebook
type: Concept
in scheme: AdCreativeLinkDataCallToActionType
top concept of: AdCreativeLinkDataCallToActionType
alternative label: playGameOnFacebook
notation: PLAY_GAME_ON_FACEBOOK

Purchase Gift Cards
type: Concept
in scheme: AdCreativeLinkDataCallToActionType
top concept of: AdCreativeLinkDataCallToActionType
alternative label: purchaseGiftCards
notation: PURCHASE_GIFT_CARDS

Raise Money
type: Concept
in scheme: AdCreativeLinkDataCallToActionType
top concept of: AdCreativeLinkDataCallToActionType
alternative label: raiseMoney
notation: RAISE_MONEY

Record Now
type: Concept
in scheme: AdCreativeLinkDataCallToActionType
top concept of: AdCreativeLinkDataCallToActionType
alternative label: recordNow
notation: RECORD_NOW

Refer Friends
type: Concept
in scheme: AdCreativeLinkDataCallToActionType
top concept of: AdCreativeLinkDataCallToActionType
alternative label: referFriends
notation: REFER_FRIENDS

Request Time
type: Concept
in scheme: AdCreativeLinkDataCallToActionType
top concept of: AdCreativeLinkDataCallToActionType
alternative label: requestTime
notation: REQUEST_TIME

Say Thanks
type: Concept
in scheme: AdCreativeLinkDataCallToActionType
top concept of: AdCreativeLinkDataCallToActionType
alternative label: sayThanks
notation: SAY_THANKS

See More
type: Concept
in scheme: AdCreativeLinkDataCallToActionType
top concept of: AdCreativeLinkDataCallToActionType
alternative label: seeMore
notation: SEE_MORE

Sell Now
type: Concept
in scheme: AdCreativeLinkDataCallToActionType
top concept of: AdCreativeLinkDataCallToActionType
alternative label: sellNow
notation: SELL_NOW

Send AGift
type: Concept
in scheme: AdCreativeLinkDataCallToActionType
top concept of: AdCreativeLinkDataCallToActionType
alternative label: sendAGift
notation: SEND_A_GIFT

Send Gift Money
type: Concept
in scheme: AdCreativeLinkDataCallToActionType
top concept of: AdCreativeLinkDataCallToActionType
alternative label: sendGiftMoney
notation: SEND_GIFT_MONEY

Send Updates
type: Concept
in scheme: AdCreativeLinkDataCallToActionType
top concept of: AdCreativeLinkDataCallToActionType
alternative label: sendUpdates
notation: SEND_UPDATES

Share
type: Concept
in scheme: AdCreativeLinkDataCallToActionType
top concept of: AdCreativeLinkDataCallToActionType
alternative label: share
notation: SHARE

Shop Now
type: Concept
in scheme: AdCreativeLinkDataCallToActionType
top concept of: AdCreativeLinkDataCallToActionType
alternative label: shopNow
notation: SHOP_NOW

Sign Up
type: Concept
in scheme: AdCreativeLinkDataCallToActionType
top concept of: AdCreativeLinkDataCallToActionType
alternative label: signUp
notation: SIGN_UP

Sotto Subscribe
type: Concept
in scheme: AdCreativeLinkDataCallToActionType
top concept of: AdCreativeLinkDataCallToActionType
alternative label: sottoSubscribe
notation: SOTTO_SUBSCRIBE

Start Order
type: Concept
in scheme: AdCreativeLinkDataCallToActionType
top concept of: AdCreativeLinkDataCallToActionType
alternative label: startOrder
notation: START_ORDER

Subscribe
type: Concept
in scheme: AdCreativeLinkDataCallToActionType
top concept of: AdCreativeLinkDataCallToActionType
alternative label: subscribe
notation: SUBSCRIBE

Swipe Up Product
type: Concept
in scheme: AdCreativeLinkDataCallToActionType
top concept of: AdCreativeLinkDataCallToActionType
alternative label: swipeUpProduct
notation: SWIPE_UP_PRODUCT

Swipe Up Shop
type: Concept
in scheme: AdCreativeLinkDataCallToActionType
top concept of: AdCreativeLinkDataCallToActionType
alternative label: swipeUpShop
notation: SWIPE_UP_SHOP

Update App
type: Concept
in scheme: AdCreativeLinkDataCallToActionType
top concept of: AdCreativeLinkDataCallToActionType
alternative label: updateApp
notation: UPDATE_APP

Use App
type: Concept
in scheme: AdCreativeLinkDataCallToActionType
top concept of: AdCreativeLinkDataCallToActionType
alternative label: useApp
notation: USE_APP

Use Mobile App
type: Concept
in scheme: AdCreativeLinkDataCallToActionType
top concept of: AdCreativeLinkDataCallToActionType
alternative label: useMobileApp
notation: USE_MOBILE_APP

Video Annotation
type: Concept
in scheme: AdCreativeLinkDataCallToActionType
top concept of: AdCreativeLinkDataCallToActionType
alternative label: videoAnnotation
notation: VIDEO_ANNOTATION

Video Call
type: Concept
in scheme: AdCreativeLinkDataCallToActionType
top concept of: AdCreativeLinkDataCallToActionType
alternative label: videoCall
notation: VIDEO_CALL

View Cart
type: Concept
in scheme: AdCreativeLinkDataCallToActionType
top concept of: AdCreativeLinkDataCallToActionType
alternative label: viewCart
notation: VIEW_CART

View Channel
type: Concept
in scheme: AdCreativeLinkDataCallToActionType
top concept of: AdCreativeLinkDataCallToActionType
alternative label: viewChannel
notation: VIEW_CHANNEL

View In Cart
type: Concept
in scheme: AdCreativeLinkDataCallToActionType
top concept of: AdCreativeLinkDataCallToActionType
alternative label: viewInCart
notation: VIEW_IN_CART

View Product
type: Concept
in scheme: AdCreativeLinkDataCallToActionType
top concept of: AdCreativeLinkDataCallToActionType
alternative label: viewProduct
notation: VIEW_PRODUCT

Visit Pages Feed
type: Concept
in scheme: AdCreativeLinkDataCallToActionType
top concept of: AdCreativeLinkDataCallToActionType
alternative label: visitPagesFeed
notation: VISIT_PAGES_FEED

Watch Live Video
type: Concept
in scheme: AdCreativeLinkDataCallToActionType
top concept of: AdCreativeLinkDataCallToActionType
alternative label: watchLiveVideo
notation: WATCH_LIVE_VIDEO

Watch More
type: Concept
in scheme: AdCreativeLinkDataCallToActionType
top concept of: AdCreativeLinkDataCallToActionType
alternative label: watchMore
notation: WATCH_MORE

Watch Video
type: Concept
in scheme: AdCreativeLinkDataCallToActionType
top concept of: AdCreativeLinkDataCallToActionType
alternative label: watchVideo
notation: WATCH_VIDEO

Whatsapp Message
type: Concept
in scheme: AdCreativeLinkDataCallToActionType
top concept of: AdCreativeLinkDataCallToActionType
alternative label: whatsappMessage
notation: WHATSAPP_MESSAGE

Woodhenge Support
type: Concept
in scheme: AdCreativeLinkDataCallToActionType
top concept of: AdCreativeLinkDataCallToActionType
alternative label: woodhengeSupport
notation: WOODHENGE_SUPPORT

Browse Shop
type: Concept
in scheme: AdCreativeLinkDataCallToActionType
top concept of: AdCreativeLinkDataCallToActionType
alternative label: browseShop
added in version: v24
notation: BROWSE_SHOP

Find Out More
type: Concept
in scheme: AdCreativeLinkDataCallToActionType
top concept of: AdCreativeLinkDataCallToActionType
alternative label: findOutMore
added in version: v24
notation: FIND_OUT_MORE

Get Details
type: Concept
in scheme: AdCreativeLinkDataCallToActionType
top concept of: AdCreativeLinkDataCallToActionType
alternative label: getDetails
added in version: v24
notation: GET_DETAILS

See Shop
type: Concept
in scheme: AdCreativeLinkDataCallToActionType
top concept of: AdCreativeLinkDataCallToActionType
alternative label: seeShop
added in version: v24
notation: SEE_SHOP

Shop With Ai
type: Concept
in scheme: AdCreativeLinkDataCallToActionType
top concept of: AdCreativeLinkDataCallToActionType
alternative label: shopWithAi
added in version: v24
notation: SHOP_WITH_AI

Try Demo
type: Concept
in scheme: AdCreativeLinkDataCallToActionType
top concept of: AdCreativeLinkDataCallToActionType
alternative label: tryDemo
added in version: v24
notation: TRY_DEMO

Try On With Ai
type: Concept
in scheme: AdCreativeLinkDataCallToActionType
top concept of: AdCreativeLinkDataCallToActionType
alternative label: tryOnWithAi
added in version: v24
notation: TRY_ON_WITH_AI

Visit Website
type: Concept
in scheme: AdCreativeLinkDataCallToActionType
top concept of: AdCreativeLinkDataCallToActionType
alternative label: visitWebsite
added in version: v24
notation: VISIT_WEBSITE

Ask AQuestion
type: Concept
in scheme: AdCreativeLinkDataCallToActionType
top concept of: AdCreativeLinkDataCallToActionType
alternative label: askAQuestion
added in version: v25
notation: ASK_A_QUESTION

Ask Us
type: Concept
in scheme: AdCreativeLinkDataCallToActionType
top concept of: AdCreativeLinkDataCallToActionType
alternative label: askUs
added in version: v25
notation: ASK_US

Chat Now
type: Concept
in scheme: AdCreativeLinkDataCallToActionType
top concept of: AdCreativeLinkDataCallToActionType
alternative label: chatNow
added in version: v25
notation: CHAT_NOW

Start AChat
type: Concept
in scheme: AdCreativeLinkDataCallToActionType
top concept of: AdCreativeLinkDataCallToActionType
alternative label: startAChat
added in version: v25
notation: START_A_CHAT

AdCreativeLinkDataFormatOption
type: ConceptScheme
comment: Values AdCreativeLinkData.format_option accepts.
has top concept: Carousel Ar Effects
has top concept: Carousel Images Multi Items
has top concept: Carousel Images Single Item
has top concept: Carousel Slideshows
has top concept: Collection Video
has top concept: Single Image

Carousel Ar Effects
type: Concept
in scheme: AdCreativeLinkDataFormatOption
top concept of: AdCreativeLinkDataFormatOption
alternative label: carouselArEffects
notation: carousel_ar_effects

Carousel Images Multi Items
type: Concept
in scheme: AdCreativeLinkDataFormatOption
top concept of: AdCreativeLinkDataFormatOption
alternative label: carouselImagesMultiItems
notation: carousel_images_multi_items

Carousel Images Single Item
type: Concept
in scheme: AdCreativeLinkDataFormatOption
top concept of: AdCreativeLinkDataFormatOption
alternative label: carouselImagesSingleItem
notation: carousel_images_single_item

Carousel Slideshows
type: Concept
in scheme: AdCreativeLinkDataFormatOption
top concept of: AdCreativeLinkDataFormatOption
alternative label: carouselSlideshows
notation: carousel_slideshows

Collection Video
type: Concept
in scheme: AdCreativeLinkDataFormatOption
top concept of: AdCreativeLinkDataFormatOption
alternative label: collectionVideo
notation: collection_video

Single Image
type: Concept
in scheme: AdCreativeLinkDataFormatOption
top concept of: AdCreativeLinkDataFormatOption
alternative label: singleImage
notation: single_image

AdCreativeLinkDataImageLayerSpecBlendingMode
type: ConceptScheme
comment: Values AdCreativeLinkDataImageLayerSpec.blending_mode accepts.
has top concept: Lighten
has top concept: Multiply
has top concept: Normal

Lighten
type: Concept
in scheme: AdCreativeLinkDataImageLayerSpecBlendingMode
top concept of: AdCreativeLinkDataImageLayerSpecBlendingMode
alternative label: lighten
notation: lighten

Multiply
type: Concept
in scheme: AdCreativeLinkDataImageLayerSpecBlendingMode
top concept of: AdCreativeLinkDataImageLayerSpecBlendingMode
alternative label: multiply
notation: multiply

Normal
type: Concept
in scheme: AdCreativeLinkDataImageLayerSpecBlendingMode
top concept of: AdCreativeLinkDataImageLayerSpecBlendingMode
alternative label: normal
notation: normal

AdCreativeLinkDataImageLayerSpecFrameSource
type: ConceptScheme
comment: Values AdCreativeLinkDataImageLayerSpec.frame_source accepts.
has top concept: Custom

Custom
type: Concept
in scheme: AdCreativeLinkDataImageLayerSpecFrameSource
top concept of: AdCreativeLinkDataImageLayerSpecFrameSource
alternative label: custom
notation: custom

AdCreativeLinkDataImageLayerSpecImageSource
type: ConceptScheme
comment: Values AdCreativeLinkDataImageLayerSpec.image_source accepts.
has top concept: Catalog

Catalog
type: Concept
in scheme: AdCreativeLinkDataImageLayerSpecImageSource
top concept of: AdCreativeLinkDataImageLayerSpecImageSource
alternative label: catalog
notation: catalog

AdCreativeLinkDataImageLayerSpecLayerType
type: ConceptScheme
comment: Values AdCreativeLinkDataImageLayerSpec.layer_type accepts.
has top concept: Frame Overlay
has top concept: Image
has top concept: Text Overlay

Frame Overlay
type: Concept
in scheme: AdCreativeLinkDataImageLayerSpecLayerType
top concept of: AdCreativeLinkDataImageLayerSpecLayerType
alternative label: frameOverlay
notation: frame_overlay

Image
type: Concept
in scheme: AdCreativeLinkDataImageLayerSpecLayerType
top concept of: AdCreativeLinkDataImageLayerSpecLayerType
alternative label: image
notation: image

Text Overlay
type: Concept
in scheme: AdCreativeLinkDataImageLayerSpecLayerType
top concept of: AdCreativeLinkDataImageLayerSpecLayerType
alternative label: textOverlay
notation: text_overlay

AdCreativeLinkDataImageLayerSpecOverlayPosition
type: ConceptScheme
comment: Values AdCreativeLinkDataImageLayerSpec.overlay_position accepts.
has top concept: Bottom
has top concept: Bottom Left
has top concept: Bottom Right
has top concept: Center
has top concept: Left
has top concept: Right
has top concept: Top
has top concept: Top Left
has top concept: Top Right

Bottom
type: Concept
in scheme: AdCreativeLinkDataImageLayerSpecOverlayPosition
top concept of: AdCreativeLinkDataImageLayerSpecOverlayPosition
alternative label: bottom
notation: bottom

Bottom Left
type: Concept
in scheme: AdCreativeLinkDataImageLayerSpecOverlayPosition
top concept of: AdCreativeLinkDataImageLayerSpecOverlayPosition
alternative label: bottomLeft
notation: bottom_left

Bottom Right
type: Concept
in scheme: AdCreativeLinkDataImageLayerSpecOverlayPosition
top concept of: AdCreativeLinkDataImageLayerSpecOverlayPosition
alternative label: bottomRight
notation: bottom_right

Center
type: Concept
in scheme: AdCreativeLinkDataImageLayerSpecOverlayPosition
top concept of: AdCreativeLinkDataImageLayerSpecOverlayPosition
alternative label: center
notation: center

Left
type: Concept
in scheme: AdCreativeLinkDataImageLayerSpecOverlayPosition
top concept of: AdCreativeLinkDataImageLayerSpecOverlayPosition
alternative label: left
notation: left

Right
type: Concept
in scheme: AdCreativeLinkDataImageLayerSpecOverlayPosition
top concept of: AdCreativeLinkDataImageLayerSpecOverlayPosition
alternative label: right
notation: right

Top
type: Concept
in scheme: AdCreativeLinkDataImageLayerSpecOverlayPosition
top concept of: AdCreativeLinkDataImageLayerSpecOverlayPosition
alternative label: top
notation: top

Top Left
type: Concept
in scheme: AdCreativeLinkDataImageLayerSpecOverlayPosition
top concept of: AdCreativeLinkDataImageLayerSpecOverlayPosition
alternative label: topLeft
notation: top_left

Top Right
type: Concept
in scheme: AdCreativeLinkDataImageLayerSpecOverlayPosition
top concept of: AdCreativeLinkDataImageLayerSpecOverlayPosition
alternative label: topRight
notation: top_right

AdCreativeLinkDataImageLayerSpecOverlayShape
type: ConceptScheme
comment: Values AdCreativeLinkDataImageLayerSpec.overlay_shape accepts.
has top concept: Circle
has top concept: None
has top concept: Pill
has top concept: Rectangle
has top concept: Triangle

Circle
type: Concept
in scheme: AdCreativeLinkDataImageLayerSpecOverlayShape
top concept of: AdCreativeLinkDataImageLayerSpecOverlayShape
alternative label: circle
notation: circle

None
type: Concept
in scheme: AdCreativeLinkDataImageLayerSpecOverlayShape
top concept of: AdCreativeLinkDataImageLayerSpecOverlayShape
alternative label: none
notation: none

Pill
type: Concept
in scheme: AdCreativeLinkDataImageLayerSpecOverlayShape
top concept of: AdCreativeLinkDataImageLayerSpecOverlayShape
alternative label: pill
notation: pill

Rectangle
type: Concept
in scheme: AdCreativeLinkDataImageLayerSpecOverlayShape
top concept of: AdCreativeLinkDataImageLayerSpecOverlayShape
alternative label: rectangle
notation: rectangle

Triangle
type: Concept
in scheme: AdCreativeLinkDataImageLayerSpecOverlayShape
top concept of: AdCreativeLinkDataImageLayerSpecOverlayShape
alternative label: triangle
notation: triangle

AdCreativeLinkDataImageLayerSpecTextFont
type: ConceptScheme
comment: Values AdCreativeLinkDataImageLayerSpec.text_font accepts.
has top concept: Droid Serif Regular
has top concept: Lato Regular
has top concept: Noto Sans Regular
has top concept: Nunito Sans Bold
has top concept: Open Sans Bold
has top concept: Open Sans Condensed Bold
has top concept: Pt Serif Bold
has top concept: Roboto Condensed Regular
has top concept: Roboto Medium

Droid Serif Regular
type: Concept
in scheme: AdCreativeLinkDataImageLayerSpecTextFont
top concept of: AdCreativeLinkDataImageLayerSpecTextFont
alternative label: droidSerifRegular
notation: droid_serif_regular

Lato Regular
type: Concept
in scheme: AdCreativeLinkDataImageLayerSpecTextFont
top concept of: AdCreativeLinkDataImageLayerSpecTextFont
alternative label: latoRegular
notation: lato_regular

Noto Sans Regular
type: Concept
in scheme: AdCreativeLinkDataImageLayerSpecTextFont
top concept of: AdCreativeLinkDataImageLayerSpecTextFont
alternative label: notoSansRegular
notation: noto_sans_regular

Nunito Sans Bold
type: Concept
in scheme: AdCreativeLinkDataImageLayerSpecTextFont
top concept of: AdCreativeLinkDataImageLayerSpecTextFont
alternative label: nunitoSansBold
notation: nunito_sans_bold

Open Sans Bold
type: Concept
in scheme: AdCreativeLinkDataImageLayerSpecTextFont
top concept of: AdCreativeLinkDataImageLayerSpecTextFont
alternative label: openSansBold
notation: open_sans_bold

Open Sans Condensed Bold
type: Concept
in scheme: AdCreativeLinkDataImageLayerSpecTextFont
top concept of: AdCreativeLinkDataImageLayerSpecTextFont
alternative label: openSansCondensedBold
notation: open_sans_condensed_bold

Pt Serif Bold
type: Concept
in scheme: AdCreativeLinkDataImageLayerSpecTextFont
top concept of: AdCreativeLinkDataImageLayerSpecTextFont
alternative label: ptSerifBold
notation: pt_serif_bold

Roboto Condensed Regular
type: Concept
in scheme: AdCreativeLinkDataImageLayerSpecTextFont
top concept of: AdCreativeLinkDataImageLayerSpecTextFont
alternative label: robotoCondensedRegular
notation: roboto_condensed_regular

Roboto Medium
type: Concept
in scheme: AdCreativeLinkDataImageLayerSpecTextFont
top concept of: AdCreativeLinkDataImageLayerSpecTextFont
alternative label: robotoMedium
notation: roboto_medium

AdCreativeLinkDataImageOverlaySpecCustomTextType
type: ConceptScheme
comment: Values AdCreativeLinkDataImageOverlaySpec.custom_text_type accepts.
has top concept: Free Shipping
has top concept: Popular
has top concept: Sale

Free Shipping
type: Concept
in scheme: AdCreativeLinkDataImageOverlaySpecCustomTextType
top concept of: AdCreativeLinkDataImageOverlaySpecCustomTextType
alternative label: freeShipping
notation: free_shipping

Popular
type: Concept
in scheme: AdCreativeLinkDataImageOverlaySpecCustomTextType
top concept of: AdCreativeLinkDataImageOverlaySpecCustomTextType
alternative label: popular
notation: popular

Sale
type: Concept
in scheme: AdCreativeLinkDataImageOverlaySpecCustomTextType
top concept of: AdCreativeLinkDataImageOverlaySpecCustomTextType
alternative label: sale
notation: sale

AdCreativeLinkDataImageOverlaySpecOverlayTemplate
type: ConceptScheme
comment: Values AdCreativeLinkDataImageOverlaySpec.overlay_template accepts.
has top concept: Circle With Text
has top concept: Pill With Text
has top concept: Triangle With Text

Circle With Text
type: Concept
in scheme: AdCreativeLinkDataImageOverlaySpecOverlayTemplate
top concept of: AdCreativeLinkDataImageOverlaySpecOverlayTemplate
alternative label: circleWithText
notation: circle_with_text

Pill With Text
type: Concept
in scheme: AdCreativeLinkDataImageOverlaySpecOverlayTemplate
top concept of: AdCreativeLinkDataImageOverlaySpecOverlayTemplate
alternative label: pillWithText
notation: pill_with_text

Triangle With Text
type: Concept
in scheme: AdCreativeLinkDataImageOverlaySpecOverlayTemplate
top concept of: AdCreativeLinkDataImageOverlaySpecOverlayTemplate
alternative label: triangleWithText
notation: triangle_with_text

AdCreativeLinkDataImageOverlaySpecPosition
type: ConceptScheme
comment: Values AdCreativeLinkDataImageOverlaySpec.position accepts.
has top concept: Bottom Left
has top concept: Bottom Right
has top concept: Top Left
has top concept: Top Right

Bottom Left
type: Concept
in scheme: AdCreativeLinkDataImageOverlaySpecPosition
top concept of: AdCreativeLinkDataImageOverlaySpecPosition
alternative label: bottomLeft
notation: bottom_left

Bottom Right
type: Concept
in scheme: AdCreativeLinkDataImageOverlaySpecPosition
top concept of: AdCreativeLinkDataImageOverlaySpecPosition
alternative label: bottomRight
notation: bottom_right

Top Left
type: Concept
in scheme: AdCreativeLinkDataImageOverlaySpecPosition
top concept of: AdCreativeLinkDataImageOverlaySpecPosition
alternative label: topLeft
notation: top_left

Top Right
type: Concept
in scheme: AdCreativeLinkDataImageOverlaySpecPosition
top concept of: AdCreativeLinkDataImageOverlaySpecPosition
alternative label: topRight
notation: top_right

AdCreativeLinkDataImageOverlaySpecTextFont
type: ConceptScheme
comment: Values AdCreativeLinkDataImageOverlaySpec.text_font accepts.
has top concept: Droid Serif Regular
has top concept: Dynads Hybrid Bold
has top concept: Lato Regular
has top concept: Noto Sans Regular
has top concept: Nunito Sans Bold
has top concept: Open Sans Bold
has top concept: Open Sans Condensed Bold
has top concept: Pt Serif Bold
has top concept: Roboto Condensed Regular
has top concept: Roboto Medium

Droid Serif Regular
type: Concept
in scheme: AdCreativeLinkDataImageOverlaySpecTextFont
top concept of: AdCreativeLinkDataImageOverlaySpecTextFont
alternative label: droidSerifRegular
notation: droid_serif_regular

Dynads Hybrid Bold
type: Concept
in scheme: AdCreativeLinkDataImageOverlaySpecTextFont
top concept of: AdCreativeLinkDataImageOverlaySpecTextFont
alternative label: dynadsHybridBold
notation: dynads_hybrid_bold

Lato Regular
type: Concept
in scheme: AdCreativeLinkDataImageOverlaySpecTextFont
top concept of: AdCreativeLinkDataImageOverlaySpecTextFont
alternative label: latoRegular
notation: lato_regular

Noto Sans Regular
type: Concept
in scheme: AdCreativeLinkDataImageOverlaySpecTextFont
top concept of: AdCreativeLinkDataImageOverlaySpecTextFont
alternative label: notoSansRegular
notation: noto_sans_regular

Nunito Sans Bold
type: Concept
in scheme: AdCreativeLinkDataImageOverlaySpecTextFont
top concept of: AdCreativeLinkDataImageOverlaySpecTextFont
alternative label: nunitoSansBold
notation: nunito_sans_bold

Open Sans Bold
type: Concept
in scheme: AdCreativeLinkDataImageOverlaySpecTextFont
top concept of: AdCreativeLinkDataImageOverlaySpecTextFont
alternative label: openSansBold
notation: open_sans_bold

Open Sans Condensed Bold
type: Concept
in scheme: AdCreativeLinkDataImageOverlaySpecTextFont
top concept of: AdCreativeLinkDataImageOverlaySpecTextFont
alternative label: openSansCondensedBold
notation: open_sans_condensed_bold

Pt Serif Bold
type: Concept
in scheme: AdCreativeLinkDataImageOverlaySpecTextFont
top concept of: AdCreativeLinkDataImageOverlaySpecTextFont
alternative label: ptSerifBold
notation: pt_serif_bold

Roboto Condensed Regular
type: Concept
in scheme: AdCreativeLinkDataImageOverlaySpecTextFont
top concept of: AdCreativeLinkDataImageOverlaySpecTextFont
alternative label: robotoCondensedRegular
notation: roboto_condensed_regular

Roboto Medium
type: Concept
in scheme: AdCreativeLinkDataImageOverlaySpecTextFont
top concept of: AdCreativeLinkDataImageOverlaySpecTextFont
alternative label: robotoMedium
notation: roboto_medium

AdCreativeLinkDataImageOverlaySpecTextType
type: ConceptScheme
comment: Values AdCreativeLinkDataImageOverlaySpec.text_type accepts.
has top concept: Automated Personalize
has top concept: Custom
has top concept: Disclaimer
has top concept: From Price
has top concept: Guest Rating
has top concept: Percentage Off
has top concept: Price
has top concept: Star Rating
has top concept: Strikethrough Price
has top concept: Sustainable

Automated Personalize
type: Concept
in scheme: AdCreativeLinkDataImageOverlaySpecTextType
top concept of: AdCreativeLinkDataImageOverlaySpecTextType
alternative label: automatedPersonalize
notation: automated_personalize

Custom
type: Concept
in scheme: AdCreativeLinkDataImageOverlaySpecTextType
top concept of: AdCreativeLinkDataImageOverlaySpecTextType
alternative label: custom
notation: custom

Disclaimer
type: Concept
in scheme: AdCreativeLinkDataImageOverlaySpecTextType
top concept of: AdCreativeLinkDataImageOverlaySpecTextType
alternative label: disclaimer
notation: disclaimer

From Price
type: Concept
in scheme: AdCreativeLinkDataImageOverlaySpecTextType
top concept of: AdCreativeLinkDataImageOverlaySpecTextType
alternative label: fromPrice
notation: from_price

Guest Rating
type: Concept
in scheme: AdCreativeLinkDataImageOverlaySpecTextType
top concept of: AdCreativeLinkDataImageOverlaySpecTextType
alternative label: guestRating
notation: guest_rating

Percentage Off
type: Concept
in scheme: AdCreativeLinkDataImageOverlaySpecTextType
top concept of: AdCreativeLinkDataImageOverlaySpecTextType
alternative label: percentageOff
notation: percentage_off

Price
type: Concept
in scheme: AdCreativeLinkDataImageOverlaySpecTextType
top concept of: AdCreativeLinkDataImageOverlaySpecTextType
alternative label: price
notation: price

Star Rating
type: Concept
in scheme: AdCreativeLinkDataImageOverlaySpecTextType
top concept of: AdCreativeLinkDataImageOverlaySpecTextType
alternative label: starRating
notation: star_rating

Strikethrough Price
type: Concept
in scheme: AdCreativeLinkDataImageOverlaySpecTextType
top concept of: AdCreativeLinkDataImageOverlaySpecTextType
alternative label: strikethroughPrice
notation: strikethrough_price

Sustainable
type: Concept
in scheme: AdCreativeLinkDataImageOverlaySpecTextType
top concept of: AdCreativeLinkDataImageOverlaySpecTextType
alternative label: sustainable
notation: sustainable

AdCreativeLinkDataImageOverlaySpecThemeColor
type: ConceptScheme
comment: Values AdCreativeLinkDataImageOverlaySpec.theme_color accepts.
has top concept: Background000000Text Ffffff
has top concept: Background0090ff Text Ffffff
has top concept: Background00af4c Text Ffffff
has top concept: Background595959Text Ffffff
has top concept: Background755dde Text Ffffff
has top concept: Background E50900Text Ffffff
has top concept: Background F23474Text Ffffff
has top concept: Background F78400Text Ffffff
has top concept: Background Ffffff Text000000
has top concept: Background Ffffff Text007ad0
has top concept: Background Ffffff Text009c2a
has top concept: Background Ffffff Text646464
has top concept: Background Ffffff Text755dde
has top concept: Background Ffffff Text C91b00
has top concept: Background Ffffff Text F23474
has top concept: Background Ffffff Text F78400

Background000000Text Ffffff
type: Concept
in scheme: AdCreativeLinkDataImageOverlaySpecThemeColor
top concept of: AdCreativeLinkDataImageOverlaySpecThemeColor
alternative label: background000000TextFfffff
notation: background_000000_text_ffffff

Background0090ff Text Ffffff
type: Concept
in scheme: AdCreativeLinkDataImageOverlaySpecThemeColor
top concept of: AdCreativeLinkDataImageOverlaySpecThemeColor
alternative label: background0090ffTextFfffff
notation: background_0090ff_text_ffffff

Background00af4c Text Ffffff
type: Concept
in scheme: AdCreativeLinkDataImageOverlaySpecThemeColor
top concept of: AdCreativeLinkDataImageOverlaySpecThemeColor
alternative label: background00af4cTextFfffff
notation: background_00af4c_text_ffffff

Background595959Text Ffffff
type: Concept
in scheme: AdCreativeLinkDataImageOverlaySpecThemeColor
top concept of: AdCreativeLinkDataImageOverlaySpecThemeColor
alternative label: background595959TextFfffff
notation: background_595959_text_ffffff

Background755dde Text Ffffff
type: Concept
in scheme: AdCreativeLinkDataImageOverlaySpecThemeColor
top concept of: AdCreativeLinkDataImageOverlaySpecThemeColor
alternative label: background755ddeTextFfffff
notation: background_755dde_text_ffffff

Background E50900Text Ffffff
type: Concept
in scheme: AdCreativeLinkDataImageOverlaySpecThemeColor
top concept of: AdCreativeLinkDataImageOverlaySpecThemeColor
alternative label: backgroundE50900TextFfffff
notation: background_e50900_text_ffffff

Background F23474Text Ffffff
type: Concept
in scheme: AdCreativeLinkDataImageOverlaySpecThemeColor
top concept of: AdCreativeLinkDataImageOverlaySpecThemeColor
alternative label: backgroundF23474TextFfffff
notation: background_f23474_text_ffffff

Background F78400Text Ffffff
type: Concept
in scheme: AdCreativeLinkDataImageOverlaySpecThemeColor
top concept of: AdCreativeLinkDataImageOverlaySpecThemeColor
alternative label: backgroundF78400TextFfffff
notation: background_f78400_text_ffffff

Background Ffffff Text000000
type: Concept
in scheme: AdCreativeLinkDataImageOverlaySpecThemeColor
top concept of: AdCreativeLinkDataImageOverlaySpecThemeColor
alternative label: backgroundFfffffText000000
notation: background_ffffff_text_000000

Background Ffffff Text007ad0
type: Concept
in scheme: AdCreativeLinkDataImageOverlaySpecThemeColor
top concept of: AdCreativeLinkDataImageOverlaySpecThemeColor
alternative label: backgroundFfffffText007ad0
notation: background_ffffff_text_007ad0

Background Ffffff Text009c2a
type: Concept
in scheme: AdCreativeLinkDataImageOverlaySpecThemeColor
top concept of: AdCreativeLinkDataImageOverlaySpecThemeColor
alternative label: backgroundFfffffText009c2a
notation: background_ffffff_text_009c2a

Background Ffffff Text646464
type: Concept
in scheme: AdCreativeLinkDataImageOverlaySpecThemeColor
top concept of: AdCreativeLinkDataImageOverlaySpecThemeColor
alternative label: backgroundFfffffText646464
notation: background_ffffff_text_646464

Background Ffffff Text755dde
type: Concept
in scheme: AdCreativeLinkDataImageOverlaySpecThemeColor
top concept of: AdCreativeLinkDataImageOverlaySpecThemeColor
alternative label: backgroundFfffffText755dde
notation: background_ffffff_text_755dde

Background Ffffff Text C91b00
type: Concept
in scheme: AdCreativeLinkDataImageOverlaySpecThemeColor
top concept of: AdCreativeLinkDataImageOverlaySpecThemeColor
alternative label: backgroundFfffffTextC91b00
notation: background_ffffff_text_c91b00

Background Ffffff Text F23474
type: Concept
in scheme: AdCreativeLinkDataImageOverlaySpecThemeColor
top concept of: AdCreativeLinkDataImageOverlaySpecThemeColor
alternative label: backgroundFfffffTextF23474
notation: background_ffffff_text_f23474

Background Ffffff Text F78400
type: Concept
in scheme: AdCreativeLinkDataImageOverlaySpecThemeColor
top concept of: AdCreativeLinkDataImageOverlaySpecThemeColor
alternative label: backgroundFfffffTextF78400
notation: background_ffffff_text_f78400

AdCreativeObjectType
type: ConceptScheme
comment: Values AdCreative.object_type accepts.
has top concept: Application
has top concept: Domain
has top concept: Event
has top concept: Invalid
has top concept: Offer
has top concept: Page
has top concept: Photo
has top concept: Post Deleted
has top concept: Privacy Check Fail
has top concept: Share
has top concept: Status
has top concept: Store Item
has top concept: Video

Application
type: Concept
in scheme: AdCreativeObjectType
top concept of: AdCreativeObjectType
alternative label: application
notation: APPLICATION

Domain
type: Concept
in scheme: AdCreativeObjectType
top concept of: AdCreativeObjectType
alternative label: domain
notation: DOMAIN

Event
type: Concept
in scheme: AdCreativeObjectType
top concept of: AdCreativeObjectType
alternative label: event
notation: EVENT

Invalid
type: Concept
in scheme: AdCreativeObjectType
top concept of: AdCreativeObjectType
alternative label: invalid
notation: INVALID

Offer
type: Concept
in scheme: AdCreativeObjectType
top concept of: AdCreativeObjectType
alternative label: offer
notation: OFFER

Page
type: Concept
in scheme: AdCreativeObjectType
top concept of: AdCreativeObjectType
alternative label: page
notation: PAGE

Photo
type: Concept
in scheme: AdCreativeObjectType
top concept of: AdCreativeObjectType
alternative label: photo
notation: PHOTO

Post Deleted
type: Concept
in scheme: AdCreativeObjectType
top concept of: AdCreativeObjectType
alternative label: postDeleted
notation: POST_DELETED

Privacy Check Fail
type: Concept
in scheme: AdCreativeObjectType
top concept of: AdCreativeObjectType
alternative label: privacyCheckFail
notation: PRIVACY_CHECK_FAIL

Share
type: Concept
in scheme: AdCreativeObjectType
top concept of: AdCreativeObjectType
alternative label: share
notation: SHARE

Status
type: Concept
in scheme: AdCreativeObjectType
top concept of: AdCreativeObjectType
alternative label: status
notation: STATUS

Store Item
type: Concept
in scheme: AdCreativeObjectType
top concept of: AdCreativeObjectType
alternative label: storeItem
notation: STORE_ITEM

Video
type: Concept
in scheme: AdCreativeObjectType
top concept of: AdCreativeObjectType
alternative label: video
notation: VIDEO

AdCreativeStatus
type: ConceptScheme
comment: Values AdCreative.status accepts.
has top concept: Active
has top concept: Deleted
has top concept: In Process
has top concept: With Issues

Active
type: Concept
in scheme: AdCreativeStatus
top concept of: AdCreativeStatus
alternative label: active
notation: ACTIVE

Deleted
type: Concept
in scheme: AdCreativeStatus
top concept of: AdCreativeStatus
alternative label: deleted
notation: DELETED

In Process
type: Concept
in scheme: AdCreativeStatus
top concept of: AdCreativeStatus
alternative label: inProcess
notation: IN_PROCESS

With Issues
type: Concept
in scheme: AdCreativeStatus
top concept of: AdCreativeStatus
alternative label: withIssues
notation: WITH_ISSUES

AdEffectiveStatus
type: ConceptScheme
comment: Values Ad.effective_status accepts.
has top concept: Active
has top concept: Adset Paused
has top concept: Archived
has top concept: Campaign Paused
has top concept: Deleted
has top concept: Disapproved
has top concept: In Process
has top concept: Paused
has top concept: Pending Billing Info
has top concept: Pending Review
has top concept: Preapproved
has top concept: With Issues

Active
type: Concept
in scheme: AdEffectiveStatus
top concept of: AdEffectiveStatus
alternative label: active
notation: ACTIVE

Adset Paused
type: Concept
in scheme: AdEffectiveStatus
top concept of: AdEffectiveStatus
alternative label: adsetPaused
notation: ADSET_PAUSED

Archived
type: Concept
in scheme: AdEffectiveStatus
top concept of: AdEffectiveStatus
alternative label: archived
notation: ARCHIVED

Campaign Paused
type: Concept
in scheme: AdEffectiveStatus
top concept of: AdEffectiveStatus
alternative label: campaignPaused
notation: CAMPAIGN_PAUSED

Deleted
type: Concept
in scheme: AdEffectiveStatus
top concept of: AdEffectiveStatus
alternative label: deleted
notation: DELETED

Disapproved
type: Concept
in scheme: AdEffectiveStatus
top concept of: AdEffectiveStatus
alternative label: disapproved
notation: DISAPPROVED

In Process
type: Concept
in scheme: AdEffectiveStatus
top concept of: AdEffectiveStatus
alternative label: inProcess
notation: IN_PROCESS

Paused
type: Concept
in scheme: AdEffectiveStatus
top concept of: AdEffectiveStatus
alternative label: paused
notation: PAUSED

Pending Billing Info
type: Concept
in scheme: AdEffectiveStatus
top concept of: AdEffectiveStatus
alternative label: pendingBillingInfo
notation: PENDING_BILLING_INFO

Pending Review
type: Concept
in scheme: AdEffectiveStatus
top concept of: AdEffectiveStatus
alternative label: pendingReview
notation: PENDING_REVIEW

Preapproved
type: Concept
in scheme: AdEffectiveStatus
top concept of: AdEffectiveStatus
alternative label: preapproved
notation: PREAPPROVED

With Issues
type: Concept
in scheme: AdEffectiveStatus
top concept of: AdEffectiveStatus
alternative label: withIssues
notation: WITH_ISSUES

AdPromotedObjectCustomEventType
type: ConceptScheme
comment: Values AdPromotedObject.custom_event_type accepts.
has top concept: Achievement Unlocked
has top concept: Add Payment Info
has top concept: Add To Cart
has top concept: Add To Wishlist
has top concept: Ad Impression
has top concept: Complete Registration
has top concept: Contact
has top concept: Content View
has top concept: Customize Product
has top concept: D2Retention
has top concept: D7Retention
has top concept: Donate
has top concept: Find Location
has top concept: Initiated Checkout
has top concept: Lead
has top concept: Level Achieved
has top concept: Listing Interaction
has top concept: Messaging Conversation Started7d
has top concept: Other
has top concept: Purchase
has top concept: Rate
has top concept: Schedule
has top concept: Search
has top concept: Service Booking Request
has top concept: Spent Credits
has top concept: Start Trial
has top concept: Submit Application
has top concept: Subscribe
has top concept: Tutorial Completion

Achievement Unlocked
type: Concept
in scheme: AdPromotedObjectCustomEventType
top concept of: AdPromotedObjectCustomEventType
alternative label: achievementUnlocked
notation: ACHIEVEMENT_UNLOCKED

Add Payment Info
type: Concept
in scheme: AdPromotedObjectCustomEventType
top concept of: AdPromotedObjectCustomEventType
alternative label: addPaymentInfo
notation: ADD_PAYMENT_INFO

Add To Cart
type: Concept
in scheme: AdPromotedObjectCustomEventType
top concept of: AdPromotedObjectCustomEventType
alternative label: addToCart
notation: ADD_TO_CART

Add To Wishlist
type: Concept
in scheme: AdPromotedObjectCustomEventType
top concept of: AdPromotedObjectCustomEventType
alternative label: addToWishlist
notation: ADD_TO_WISHLIST

Ad Impression
type: Concept
in scheme: AdPromotedObjectCustomEventType
top concept of: AdPromotedObjectCustomEventType
alternative label: adImpression
notation: AD_IMPRESSION

Complete Registration
type: Concept
in scheme: AdPromotedObjectCustomEventType
top concept of: AdPromotedObjectCustomEventType
alternative label: completeRegistration
notation: COMPLETE_REGISTRATION

Contact
type: Concept
in scheme: AdPromotedObjectCustomEventType
top concept of: AdPromotedObjectCustomEventType
alternative label: contact
notation: CONTACT

Content View
type: Concept
in scheme: AdPromotedObjectCustomEventType
top concept of: AdPromotedObjectCustomEventType
alternative label: contentView
notation: CONTENT_VIEW

Customize Product
type: Concept
in scheme: AdPromotedObjectCustomEventType
top concept of: AdPromotedObjectCustomEventType
alternative label: customizeProduct
notation: CUSTOMIZE_PRODUCT

D2Retention
type: Concept
in scheme: AdPromotedObjectCustomEventType
top concept of: AdPromotedObjectCustomEventType
alternative label: d2Retention
notation: D2_RETENTION

D7Retention
type: Concept
in scheme: AdPromotedObjectCustomEventType
top concept of: AdPromotedObjectCustomEventType
alternative label: d7Retention
notation: D7_RETENTION

Donate
type: Concept
in scheme: AdPromotedObjectCustomEventType
top concept of: AdPromotedObjectCustomEventType
alternative label: donate
notation: DONATE

Find Location
type: Concept
in scheme: AdPromotedObjectCustomEventType
top concept of: AdPromotedObjectCustomEventType
alternative label: findLocation
notation: FIND_LOCATION

Initiated Checkout
type: Concept
in scheme: AdPromotedObjectCustomEventType
top concept of: AdPromotedObjectCustomEventType
alternative label: initiatedCheckout
notation: INITIATED_CHECKOUT

Lead
type: Concept
in scheme: AdPromotedObjectCustomEventType
top concept of: AdPromotedObjectCustomEventType
alternative label: lead
notation: LEAD

Level Achieved
type: Concept
in scheme: AdPromotedObjectCustomEventType
top concept of: AdPromotedObjectCustomEventType
alternative label: levelAchieved
notation: LEVEL_ACHIEVED

Listing Interaction
type: Concept
in scheme: AdPromotedObjectCustomEventType
top concept of: AdPromotedObjectCustomEventType
alternative label: listingInteraction
notation: LISTING_INTERACTION

Messaging Conversation Started7d
type: Concept
in scheme: AdPromotedObjectCustomEventType
top concept of: AdPromotedObjectCustomEventType
alternative label: messagingConversationStarted7d
notation: MESSAGING_CONVERSATION_STARTED_7D

Other
type: Concept
in scheme: AdPromotedObjectCustomEventType
top concept of: AdPromotedObjectCustomEventType
alternative label: other
notation: OTHER

Purchase
type: Concept
in scheme: AdPromotedObjectCustomEventType
top concept of: AdPromotedObjectCustomEventType
alternative label: purchase
notation: PURCHASE

Rate
type: Concept
in scheme: AdPromotedObjectCustomEventType
top concept of: AdPromotedObjectCustomEventType
alternative label: rate
notation: RATE

Schedule
type: Concept
in scheme: AdPromotedObjectCustomEventType
top concept of: AdPromotedObjectCustomEventType
alternative label: schedule
notation: SCHEDULE

Search
type: Concept
in scheme: AdPromotedObjectCustomEventType
top concept of: AdPromotedObjectCustomEventType
alternative label: search
notation: SEARCH

Service Booking Request
type: Concept
in scheme: AdPromotedObjectCustomEventType
top concept of: AdPromotedObjectCustomEventType
alternative label: serviceBookingRequest
notation: SERVICE_BOOKING_REQUEST

Spent Credits
type: Concept
in scheme: AdPromotedObjectCustomEventType
top concept of: AdPromotedObjectCustomEventType
alternative label: spentCredits
notation: SPENT_CREDITS

Start Trial
type: Concept
in scheme: AdPromotedObjectCustomEventType
top concept of: AdPromotedObjectCustomEventType
alternative label: startTrial
notation: START_TRIAL

Submit Application
type: Concept
in scheme: AdPromotedObjectCustomEventType
top concept of: AdPromotedObjectCustomEventType
alternative label: submitApplication
notation: SUBMIT_APPLICATION

Subscribe
type: Concept
in scheme: AdPromotedObjectCustomEventType
top concept of: AdPromotedObjectCustomEventType
alternative label: subscribe
notation: SUBSCRIBE

Tutorial Completion
type: Concept
in scheme: AdPromotedObjectCustomEventType
top concept of: AdPromotedObjectCustomEventType
alternative label: tutorialCompletion
notation: TUTORIAL_COMPLETION

AdPromotedObjectFullFunnelObjective
type: ConceptScheme
comment: Values AdPromotedObject.full_funnel_objective accepts.
has top concept: App Installs
has top concept: Brand Awareness
has top concept: Event Responses
has top concept: Lead Generation
has top concept: Link Clicks
has top concept: Local Awareness
has top concept: Messages
has top concept: Offer Claims
has top concept: Outcome App Promotion
has top concept: Outcome Awareness
has top concept: Outcome Engagement
has top concept: Outcome Leads
has top concept: Outcome Sales
has top concept: Outcome Traffic
has top concept: Page Likes
has top concept: Post Engagement
has top concept: Product Catalog Sales
has top concept: Reach
has top concept: Store Visits
has top concept: Video Views
has top concept: Website Conversions

App Installs
type: Concept
in scheme: AdPromotedObjectFullFunnelObjective
top concept of: AdPromotedObjectFullFunnelObjective
alternative label: appInstalls
notation: APP_INSTALLS

Brand Awareness
type: Concept
in scheme: AdPromotedObjectFullFunnelObjective
top concept of: AdPromotedObjectFullFunnelObjective
alternative label: brandAwareness
notation: BRAND_AWARENESS

Event Responses
type: Concept
in scheme: AdPromotedObjectFullFunnelObjective
top concept of: AdPromotedObjectFullFunnelObjective
alternative label: eventResponses
notation: EVENT_RESPONSES

Lead Generation
type: Concept
in scheme: AdPromotedObjectFullFunnelObjective
top concept of: AdPromotedObjectFullFunnelObjective
alternative label: leadGeneration
notation: LEAD_GENERATION

Link Clicks
type: Concept
in scheme: AdPromotedObjectFullFunnelObjective
top concept of: AdPromotedObjectFullFunnelObjective
alternative label: linkClicks
notation: LINK_CLICKS

Local Awareness
type: Concept
in scheme: AdPromotedObjectFullFunnelObjective
top concept of: AdPromotedObjectFullFunnelObjective
alternative label: localAwareness
notation: LOCAL_AWARENESS

Messages
type: Concept
in scheme: AdPromotedObjectFullFunnelObjective
top concept of: AdPromotedObjectFullFunnelObjective
alternative label: messages
notation: MESSAGES

Offer Claims
type: Concept
in scheme: AdPromotedObjectFullFunnelObjective
top concept of: AdPromotedObjectFullFunnelObjective
alternative label: offerClaims
notation: OFFER_CLAIMS

Outcome App Promotion
type: Concept
in scheme: AdPromotedObjectFullFunnelObjective
top concept of: AdPromotedObjectFullFunnelObjective
alternative label: outcomeAppPromotion
notation: OUTCOME_APP_PROMOTION

Outcome Awareness
type: Concept
in scheme: AdPromotedObjectFullFunnelObjective
top concept of: AdPromotedObjectFullFunnelObjective
alternative label: outcomeAwareness
notation: OUTCOME_AWARENESS

Outcome Engagement
type: Concept
in scheme: AdPromotedObjectFullFunnelObjective
top concept of: AdPromotedObjectFullFunnelObjective
alternative label: outcomeEngagement
notation: OUTCOME_ENGAGEMENT

Outcome Leads
type: Concept
in scheme: AdPromotedObjectFullFunnelObjective
top concept of: AdPromotedObjectFullFunnelObjective
alternative label: outcomeLeads
notation: OUTCOME_LEADS

Outcome Sales
type: Concept
in scheme: AdPromotedObjectFullFunnelObjective
top concept of: AdPromotedObjectFullFunnelObjective
alternative label: outcomeSales
notation: OUTCOME_SALES

Outcome Traffic
type: Concept
in scheme: AdPromotedObjectFullFunnelObjective
top concept of: AdPromotedObjectFullFunnelObjective
alternative label: outcomeTraffic
notation: OUTCOME_TRAFFIC

Page Likes
type: Concept
in scheme: AdPromotedObjectFullFunnelObjective
top concept of: AdPromotedObjectFullFunnelObjective
alternative label: pageLikes
notation: PAGE_LIKES

Post Engagement
type: Concept
in scheme: AdPromotedObjectFullFunnelObjective
top concept of: AdPromotedObjectFullFunnelObjective
alternative label: postEngagement
notation: POST_ENGAGEMENT

Product Catalog Sales
type: Concept
in scheme: AdPromotedObjectFullFunnelObjective
top concept of: AdPromotedObjectFullFunnelObjective
alternative label: productCatalogSales
notation: PRODUCT_CATALOG_SALES

Reach
type: Concept
in scheme: AdPromotedObjectFullFunnelObjective
top concept of: AdPromotedObjectFullFunnelObjective
alternative label: reach
notation: REACH

Store Visits
type: Concept
in scheme: AdPromotedObjectFullFunnelObjective
top concept of: AdPromotedObjectFullFunnelObjective
alternative label: storeVisits
notation: STORE_VISITS

Video Views
type: Concept
in scheme: AdPromotedObjectFullFunnelObjective
top concept of: AdPromotedObjectFullFunnelObjective
alternative label: videoViews
notation: VIDEO_VIEWS

Website Conversions
type: Concept
in scheme: AdPromotedObjectFullFunnelObjective
top concept of: AdPromotedObjectFullFunnelObjective
alternative label: websiteConversions
notation: WEBSITE_CONVERSIONS

AdPromotedObjectLeadAdsCustomEventType
type: ConceptScheme
comment: Values AdPromotedObject.lead_ads_custom_event_type accepts.
has top concept: Achievement Unlocked
has top concept: Add Payment Info
has top concept: Add To Cart
has top concept: Add To Wishlist
has top concept: Ad Impression
has top concept: Complete Registration
has top concept: Contact
has top concept: Content View
has top concept: Customize Product
has top concept: D2Retention
has top concept: D7Retention
has top concept: Donate
has top concept: Find Location
has top concept: Initiated Checkout
has top concept: Lead
has top concept: Level Achieved
has top concept: Listing Interaction
has top concept: Messaging Conversation Started7d
has top concept: Other
has top concept: Purchase
has top concept: Rate
has top concept: Schedule
has top concept: Search
has top concept: Service Booking Request
has top concept: Spent Credits
has top concept: Start Trial
has top concept: Submit Application
has top concept: Subscribe
has top concept: Tutorial Completion

Achievement Unlocked
type: Concept
in scheme: AdPromotedObjectLeadAdsCustomEventType
top concept of: AdPromotedObjectLeadAdsCustomEventType
alternative label: achievementUnlocked
notation: ACHIEVEMENT_UNLOCKED

Add Payment Info
type: Concept
in scheme: AdPromotedObjectLeadAdsCustomEventType
top concept of: AdPromotedObjectLeadAdsCustomEventType
alternative label: addPaymentInfo
notation: ADD_PAYMENT_INFO

Add To Cart
type: Concept
in scheme: AdPromotedObjectLeadAdsCustomEventType
top concept of: AdPromotedObjectLeadAdsCustomEventType
alternative label: addToCart
notation: ADD_TO_CART

Add To Wishlist
type: Concept
in scheme: AdPromotedObjectLeadAdsCustomEventType
top concept of: AdPromotedObjectLeadAdsCustomEventType
alternative label: addToWishlist
notation: ADD_TO_WISHLIST

Ad Impression
type: Concept
in scheme: AdPromotedObjectLeadAdsCustomEventType
top concept of: AdPromotedObjectLeadAdsCustomEventType
alternative label: adImpression
notation: AD_IMPRESSION

Complete Registration
type: Concept
in scheme: AdPromotedObjectLeadAdsCustomEventType
top concept of: AdPromotedObjectLeadAdsCustomEventType
alternative label: completeRegistration
notation: COMPLETE_REGISTRATION

Contact
type: Concept
in scheme: AdPromotedObjectLeadAdsCustomEventType
top concept of: AdPromotedObjectLeadAdsCustomEventType
alternative label: contact
notation: CONTACT

Content View
type: Concept
in scheme: AdPromotedObjectLeadAdsCustomEventType
top concept of: AdPromotedObjectLeadAdsCustomEventType
alternative label: contentView
notation: CONTENT_VIEW

Customize Product
type: Concept
in scheme: AdPromotedObjectLeadAdsCustomEventType
top concept of: AdPromotedObjectLeadAdsCustomEventType
alternative label: customizeProduct
notation: CUSTOMIZE_PRODUCT

D2Retention
type: Concept
in scheme: AdPromotedObjectLeadAdsCustomEventType
top concept of: AdPromotedObjectLeadAdsCustomEventType
alternative label: d2Retention
notation: D2_RETENTION

D7Retention
type: Concept
in scheme: AdPromotedObjectLeadAdsCustomEventType
top concept of: AdPromotedObjectLeadAdsCustomEventType
alternative label: d7Retention
notation: D7_RETENTION

Donate
type: Concept
in scheme: AdPromotedObjectLeadAdsCustomEventType
top concept of: AdPromotedObjectLeadAdsCustomEventType
alternative label: donate
notation: DONATE

Find Location
type: Concept
in scheme: AdPromotedObjectLeadAdsCustomEventType
top concept of: AdPromotedObjectLeadAdsCustomEventType
alternative label: findLocation
notation: FIND_LOCATION

Initiated Checkout
type: Concept
in scheme: AdPromotedObjectLeadAdsCustomEventType
top concept of: AdPromotedObjectLeadAdsCustomEventType
alternative label: initiatedCheckout
notation: INITIATED_CHECKOUT

Lead
type: Concept
in scheme: AdPromotedObjectLeadAdsCustomEventType
top concept of: AdPromotedObjectLeadAdsCustomEventType
alternative label: lead
notation: LEAD

Level Achieved
type: Concept
in scheme: AdPromotedObjectLeadAdsCustomEventType
top concept of: AdPromotedObjectLeadAdsCustomEventType
alternative label: levelAchieved
notation: LEVEL_ACHIEVED

Listing Interaction
type: Concept
in scheme: AdPromotedObjectLeadAdsCustomEventType
top concept of: AdPromotedObjectLeadAdsCustomEventType
alternative label: listingInteraction
notation: LISTING_INTERACTION

Messaging Conversation Started7d
type: Concept
in scheme: AdPromotedObjectLeadAdsCustomEventType
top concept of: AdPromotedObjectLeadAdsCustomEventType
alternative label: messagingConversationStarted7d
notation: MESSAGING_CONVERSATION_STARTED_7D

Other
type: Concept
in scheme: AdPromotedObjectLeadAdsCustomEventType
top concept of: AdPromotedObjectLeadAdsCustomEventType
alternative label: other
notation: OTHER

Purchase
type: Concept
in scheme: AdPromotedObjectLeadAdsCustomEventType
top concept of: AdPromotedObjectLeadAdsCustomEventType
alternative label: purchase
notation: PURCHASE

Rate
type: Concept
in scheme: AdPromotedObjectLeadAdsCustomEventType
top concept of: AdPromotedObjectLeadAdsCustomEventType
alternative label: rate
notation: RATE

Schedule
type: Concept
in scheme: AdPromotedObjectLeadAdsCustomEventType
top concept of: AdPromotedObjectLeadAdsCustomEventType
alternative label: schedule
notation: SCHEDULE

Search
type: Concept
in scheme: AdPromotedObjectLeadAdsCustomEventType
top concept of: AdPromotedObjectLeadAdsCustomEventType
alternative label: search
notation: SEARCH

Service Booking Request
type: Concept
in scheme: AdPromotedObjectLeadAdsCustomEventType
top concept of: AdPromotedObjectLeadAdsCustomEventType
alternative label: serviceBookingRequest
notation: SERVICE_BOOKING_REQUEST

Spent Credits
type: Concept
in scheme: AdPromotedObjectLeadAdsCustomEventType
top concept of: AdPromotedObjectLeadAdsCustomEventType
alternative label: spentCredits
notation: SPENT_CREDITS

Start Trial
type: Concept
in scheme: AdPromotedObjectLeadAdsCustomEventType
top concept of: AdPromotedObjectLeadAdsCustomEventType
alternative label: startTrial
notation: START_TRIAL

Submit Application
type: Concept
in scheme: AdPromotedObjectLeadAdsCustomEventType
top concept of: AdPromotedObjectLeadAdsCustomEventType
alternative label: submitApplication
notation: SUBMIT_APPLICATION

Subscribe
type: Concept
in scheme: AdPromotedObjectLeadAdsCustomEventType
top concept of: AdPromotedObjectLeadAdsCustomEventType
alternative label: subscribe
notation: SUBSCRIBE

Tutorial Completion
type: Concept
in scheme: AdPromotedObjectLeadAdsCustomEventType
top concept of: AdPromotedObjectLeadAdsCustomEventType
alternative label: tutorialCompletion
notation: TUTORIAL_COMPLETION

AdRecommendationConfidence
type: ConceptScheme
comment: Values AdRecommendation.confidence accepts.
has top concept: High
has top concept: Low
has top concept: Medium

High
type: Concept
in scheme: AdRecommendationConfidence
top concept of: AdRecommendationConfidence
alternative label: high
notation: HIGH

Low
type: Concept
in scheme: AdRecommendationConfidence
top concept of: AdRecommendationConfidence
alternative label: low
notation: LOW

Medium
type: Concept
in scheme: AdRecommendationConfidence
top concept of: AdRecommendationConfidence
alternative label: medium
notation: MEDIUM

AdRecommendationImportance
type: ConceptScheme
comment: Values AdRecommendation.importance accepts.
has top concept: High
has top concept: Low
has top concept: Medium

High
type: Concept
in scheme: AdRecommendationImportance
top concept of: AdRecommendationImportance
alternative label: high
notation: HIGH

Low
type: Concept
in scheme: AdRecommendationImportance
top concept of: AdRecommendationImportance
alternative label: low
notation: LOW

Medium
type: Concept
in scheme: AdRecommendationImportance
top concept of: AdRecommendationImportance
alternative label: medium
notation: MEDIUM

AdSetBidStrategy
type: ConceptScheme
comment: Values AdSet.bid_strategy accepts.
has top concept: Cost Cap
has top concept: Lowest Cost Without Cap
has top concept: Lowest Cost With Bid Cap
has top concept: Lowest Cost With Min Roas

Cost Cap
type: Concept
in scheme: AdSetBidStrategy
top concept of: AdSetBidStrategy
alternative label: costCap
notation: COST_CAP

Lowest Cost Without Cap
type: Concept
in scheme: AdSetBidStrategy
top concept of: AdSetBidStrategy
alternative label: lowestCostWithoutCap
notation: LOWEST_COST_WITHOUT_CAP

Lowest Cost With Bid Cap
type: Concept
in scheme: AdSetBidStrategy
top concept of: AdSetBidStrategy
alternative label: lowestCostWithBidCap
notation: LOWEST_COST_WITH_BID_CAP

Lowest Cost With Min Roas
type: Concept
in scheme: AdSetBidStrategy
top concept of: AdSetBidStrategy
alternative label: lowestCostWithMinRoas
notation: LOWEST_COST_WITH_MIN_ROAS

AdSetBillingEvent
type: ConceptScheme
comment: Values AdSet.billing_event accepts.
has top concept: App Installs
has top concept: Clicks
has top concept: Impressions
has top concept: Link Clicks
has top concept: Listing Interaction
has top concept: None
has top concept: Offer Claims
has top concept: Page Likes
has top concept: Post Engagement
has top concept: Purchase
has top concept: Thruplay

App Installs
type: Concept
in scheme: AdSetBillingEvent
top concept of: AdSetBillingEvent
alternative label: appInstalls
notation: APP_INSTALLS

Clicks
type: Concept
in scheme: AdSetBillingEvent
top concept of: AdSetBillingEvent
alternative label: clicks
notation: CLICKS

Impressions
type: Concept
in scheme: AdSetBillingEvent
top concept of: AdSetBillingEvent
alternative label: impressions
notation: IMPRESSIONS

Link Clicks
type: Concept
in scheme: AdSetBillingEvent
top concept of: AdSetBillingEvent
alternative label: linkClicks
notation: LINK_CLICKS

Listing Interaction
type: Concept
in scheme: AdSetBillingEvent
top concept of: AdSetBillingEvent
alternative label: listingInteraction
notation: LISTING_INTERACTION

None
type: Concept
in scheme: AdSetBillingEvent
top concept of: AdSetBillingEvent
alternative label: none
notation: NONE

Offer Claims
type: Concept
in scheme: AdSetBillingEvent
top concept of: AdSetBillingEvent
alternative label: offerClaims
notation: OFFER_CLAIMS

Page Likes
type: Concept
in scheme: AdSetBillingEvent
top concept of: AdSetBillingEvent
alternative label: pageLikes
notation: PAGE_LIKES

Post Engagement
type: Concept
in scheme: AdSetBillingEvent
top concept of: AdSetBillingEvent
alternative label: postEngagement
notation: POST_ENGAGEMENT

Purchase
type: Concept
in scheme: AdSetBillingEvent
top concept of: AdSetBillingEvent
alternative label: purchase
notation: PURCHASE

Thruplay
type: Concept
in scheme: AdSetBillingEvent
top concept of: AdSetBillingEvent
alternative label: thruplay
notation: THRUPLAY

AdSetConfiguredStatus
type: ConceptScheme
comment: Values AdSet.configured_status accepts.
has top concept: Active
has top concept: Archived
has top concept: Deleted
has top concept: Paused

Active
type: Concept
in scheme: AdSetConfiguredStatus
top concept of: AdSetConfiguredStatus
alternative label: active
notation: ACTIVE

Archived
type: Concept
in scheme: AdSetConfiguredStatus
top concept of: AdSetConfiguredStatus
alternative label: archived
notation: ARCHIVED

Deleted
type: Concept
in scheme: AdSetConfiguredStatus
top concept of: AdSetConfiguredStatus
alternative label: deleted
notation: DELETED

Paused
type: Concept
in scheme: AdSetConfiguredStatus
top concept of: AdSetConfiguredStatus
alternative label: paused
notation: PAUSED

AdSetEffectiveStatus
type: ConceptScheme
comment: Values AdSet.effective_status accepts.
has top concept: Active
has top concept: Archived
has top concept: Campaign Paused
has top concept: Deleted
has top concept: In Process
has top concept: Paused
has top concept: With Issues

Active
type: Concept
in scheme: AdSetEffectiveStatus
top concept of: AdSetEffectiveStatus
alternative label: active
notation: ACTIVE

Archived
type: Concept
in scheme: AdSetEffectiveStatus
top concept of: AdSetEffectiveStatus
alternative label: archived
notation: ARCHIVED

Campaign Paused
type: Concept
in scheme: AdSetEffectiveStatus
top concept of: AdSetEffectiveStatus
alternative label: campaignPaused
notation: CAMPAIGN_PAUSED

Deleted
type: Concept
in scheme: AdSetEffectiveStatus
top concept of: AdSetEffectiveStatus
alternative label: deleted
notation: DELETED

In Process
type: Concept
in scheme: AdSetEffectiveStatus
top concept of: AdSetEffectiveStatus
alternative label: inProcess
notation: IN_PROCESS

Paused
type: Concept
in scheme: AdSetEffectiveStatus
top concept of: AdSetEffectiveStatus
alternative label: paused
notation: PAUSED

With Issues
type: Concept
in scheme: AdSetEffectiveStatus
top concept of: AdSetEffectiveStatus
alternative label: withIssues
notation: WITH_ISSUES

AdSetOptimizationGoal
type: ConceptScheme
comment: Values AdSet.optimization_goal accepts.
has top concept: Advertiser Siloed Value
has top concept: Ad Recall Lift
has top concept: App Installs
has top concept: App Installs And Offsite Conversions
has top concept: Conversations
has top concept: Derived Events
has top concept: Engaged Users
has top concept: Event Responses
has top concept: Impressions
has top concept: In App Value
has top concept: Landing Page Views
has top concept: Lead Generation
has top concept: Link Clicks
has top concept: Meaningful Call Attempt
has top concept: Messaging Appointment Conversion
has top concept: Messaging Purchase Conversion
has top concept: None
has top concept: Offsite Conversions
has top concept: Page Likes
has top concept: Post Engagement
has top concept: Profile And Page Engagement
has top concept: Profile Visit
has top concept: Quality Call
has top concept: Quality Lead
has top concept: Reach
has top concept: Reminders Set
has top concept: Subscribers
has top concept: Thruplay
has top concept: Value
has top concept: Visit Instagram Profile
has top concept: Automatic Objective
has top concept: Engaged Page Views

Advertiser Siloed Value
type: Concept
in scheme: AdSetOptimizationGoal
top concept of: AdSetOptimizationGoal
alternative label: advertiserSiloedValue
notation: ADVERTISER_SILOED_VALUE

Ad Recall Lift
type: Concept
in scheme: AdSetOptimizationGoal
top concept of: AdSetOptimizationGoal
alternative label: adRecallLift
notation: AD_RECALL_LIFT

App Installs
type: Concept
in scheme: AdSetOptimizationGoal
top concept of: AdSetOptimizationGoal
alternative label: appInstalls
notation: APP_INSTALLS

App Installs And Offsite Conversions
type: Concept
in scheme: AdSetOptimizationGoal
top concept of: AdSetOptimizationGoal
alternative label: appInstallsAndOffsiteConversions
notation: APP_INSTALLS_AND_OFFSITE_CONVERSIONS

Conversations
type: Concept
in scheme: AdSetOptimizationGoal
top concept of: AdSetOptimizationGoal
alternative label: conversations
notation: CONVERSATIONS

Derived Events
type: Concept
in scheme: AdSetOptimizationGoal
top concept of: AdSetOptimizationGoal
alternative label: derivedEvents
notation: DERIVED_EVENTS

Engaged Users
type: Concept
in scheme: AdSetOptimizationGoal
top concept of: AdSetOptimizationGoal
alternative label: engagedUsers
notation: ENGAGED_USERS

Event Responses
type: Concept
in scheme: AdSetOptimizationGoal
top concept of: AdSetOptimizationGoal
alternative label: eventResponses
notation: EVENT_RESPONSES

Impressions
type: Concept
in scheme: AdSetOptimizationGoal
top concept of: AdSetOptimizationGoal
alternative label: impressions
notation: IMPRESSIONS

In App Value
type: Concept
in scheme: AdSetOptimizationGoal
top concept of: AdSetOptimizationGoal
alternative label: inAppValue
notation: IN_APP_VALUE

Landing Page Views
type: Concept
in scheme: AdSetOptimizationGoal
top concept of: AdSetOptimizationGoal
alternative label: landingPageViews
notation: LANDING_PAGE_VIEWS

Lead Generation
type: Concept
in scheme: AdSetOptimizationGoal
top concept of: AdSetOptimizationGoal
alternative label: leadGeneration
notation: LEAD_GENERATION

Link Clicks
type: Concept
in scheme: AdSetOptimizationGoal
top concept of: AdSetOptimizationGoal
alternative label: linkClicks
notation: LINK_CLICKS

Meaningful Call Attempt
type: Concept
in scheme: AdSetOptimizationGoal
top concept of: AdSetOptimizationGoal
alternative label: meaningfulCallAttempt
notation: MEANINGFUL_CALL_ATTEMPT

Messaging Appointment Conversion
type: Concept
in scheme: AdSetOptimizationGoal
top concept of: AdSetOptimizationGoal
alternative label: messagingAppointmentConversion
notation: MESSAGING_APPOINTMENT_CONVERSION

Messaging Purchase Conversion
type: Concept
in scheme: AdSetOptimizationGoal
top concept of: AdSetOptimizationGoal
alternative label: messagingPurchaseConversion
notation: MESSAGING_PURCHASE_CONVERSION

None
type: Concept
in scheme: AdSetOptimizationGoal
top concept of: AdSetOptimizationGoal
alternative label: none
notation: NONE

Offsite Conversions
type: Concept
in scheme: AdSetOptimizationGoal
top concept of: AdSetOptimizationGoal
alternative label: offsiteConversions
notation: OFFSITE_CONVERSIONS

Page Likes
type: Concept
in scheme: AdSetOptimizationGoal
top concept of: AdSetOptimizationGoal
alternative label: pageLikes
notation: PAGE_LIKES

Post Engagement
type: Concept
in scheme: AdSetOptimizationGoal
top concept of: AdSetOptimizationGoal
alternative label: postEngagement
notation: POST_ENGAGEMENT

Profile And Page Engagement
type: Concept
in scheme: AdSetOptimizationGoal
top concept of: AdSetOptimizationGoal
alternative label: profileAndPageEngagement
notation: PROFILE_AND_PAGE_ENGAGEMENT

Profile Visit
type: Concept
in scheme: AdSetOptimizationGoal
top concept of: AdSetOptimizationGoal
alternative label: profileVisit
notation: PROFILE_VISIT

Quality Call
type: Concept
in scheme: AdSetOptimizationGoal
top concept of: AdSetOptimizationGoal
alternative label: qualityCall
notation: QUALITY_CALL

Quality Lead
type: Concept
in scheme: AdSetOptimizationGoal
top concept of: AdSetOptimizationGoal
alternative label: qualityLead
notation: QUALITY_LEAD

Reach
type: Concept
in scheme: AdSetOptimizationGoal
top concept of: AdSetOptimizationGoal
alternative label: reach
notation: REACH

Reminders Set
type: Concept
in scheme: AdSetOptimizationGoal
top concept of: AdSetOptimizationGoal
alternative label: remindersSet
notation: REMINDERS_SET

Subscribers
type: Concept
in scheme: AdSetOptimizationGoal
top concept of: AdSetOptimizationGoal
alternative label: subscribers
notation: SUBSCRIBERS

Thruplay
type: Concept
in scheme: AdSetOptimizationGoal
top concept of: AdSetOptimizationGoal
alternative label: thruplay
notation: THRUPLAY

Value
type: Concept
in scheme: AdSetOptimizationGoal
top concept of: AdSetOptimizationGoal
alternative label: value
notation: VALUE

Visit Instagram Profile
type: Concept
in scheme: AdSetOptimizationGoal
top concept of: AdSetOptimizationGoal
alternative label: visitInstagramProfile
notation: VISIT_INSTAGRAM_PROFILE

Automatic Objective
type: Concept
in scheme: AdSetOptimizationGoal
top concept of: AdSetOptimizationGoal
alternative label: automaticObjective
added in version: v24
notation: AUTOMATIC_OBJECTIVE

Engaged Page Views
type: Concept
in scheme: AdSetOptimizationGoal
top concept of: AdSetOptimizationGoal
alternative label: engagedPageViews
added in version: v25
notation: ENGAGED_PAGE_VIEWS

AdSetStatus
type: ConceptScheme
comment: Values AdSet.status accepts.
has top concept: Active
has top concept: Archived
has top concept: Deleted
has top concept: Paused

Active
type: Concept
in scheme: AdSetStatus
top concept of: AdSetStatus
alternative label: active
notation: ACTIVE

Archived
type: Concept
in scheme: AdSetStatus
top concept of: AdSetStatus
alternative label: archived
notation: ARCHIVED

Deleted
type: Concept
in scheme: AdSetStatus
top concept of: AdSetStatus
alternative label: deleted
notation: DELETED

Paused
type: Concept
in scheme: AdSetStatus
top concept of: AdSetStatus
alternative label: paused
notation: PAUSED

AdStatus
type: ConceptScheme
comment: Values Ad.status accepts.
has top concept: Active
has top concept: Archived
has top concept: Deleted
has top concept: Paused

Active
type: Concept
in scheme: AdStatus
top concept of: AdStatus
alternative label: active
notation: ACTIVE

Archived
type: Concept
in scheme: AdStatus
top concept of: AdStatus
alternative label: archived
notation: ARCHIVED

Deleted
type: Concept
in scheme: AdStatus
top concept of: AdStatus
alternative label: deleted
notation: DELETED

Paused
type: Concept
in scheme: AdStatus
top concept of: AdStatus
alternative label: paused
notation: PAUSED

BusinessVerificationStatus
type: ConceptScheme
comment: Values Business.verification_status accepts.
has top concept: Expired
has top concept: Failed
has top concept: Ineligible
has top concept: Not Verified
has top concept: Pending
has top concept: Pending Need More Info
has top concept: Pending Submission
has top concept: Rejected
has top concept: Revoked
has top concept: Verified

Expired
type: Concept
in scheme: BusinessVerificationStatus
top concept of: BusinessVerificationStatus
alternative label: expired
notation: expired

Failed
type: Concept
in scheme: BusinessVerificationStatus
top concept of: BusinessVerificationStatus
alternative label: failed
notation: failed

Ineligible
type: Concept
in scheme: BusinessVerificationStatus
top concept of: BusinessVerificationStatus
alternative label: ineligible
notation: ineligible

Not Verified
type: Concept
in scheme: BusinessVerificationStatus
top concept of: BusinessVerificationStatus
alternative label: notVerified
notation: not_verified

Pending
type: Concept
in scheme: BusinessVerificationStatus
top concept of: BusinessVerificationStatus
alternative label: pending
notation: pending

Pending Need More Info
type: Concept
in scheme: BusinessVerificationStatus
top concept of: BusinessVerificationStatus
alternative label: pendingNeedMoreInfo
notation: pending_need_more_info

Pending Submission
type: Concept
in scheme: BusinessVerificationStatus
top concept of: BusinessVerificationStatus
alternative label: pendingSubmission
notation: pending_submission

Rejected
type: Concept
in scheme: BusinessVerificationStatus
top concept of: BusinessVerificationStatus
alternative label: rejected
notation: rejected

Revoked
type: Concept
in scheme: BusinessVerificationStatus
top concept of: BusinessVerificationStatus
alternative label: revoked
notation: revoked

Verified
type: Concept
in scheme: BusinessVerificationStatus
top concept of: BusinessVerificationStatus
alternative label: verified
notation: verified

BusinessWhatsappBusinessManagerMessagingLimit
type: ConceptScheme
comment: Values Business.whatsapp_business_manager_messaging_limit accepts.
has top concept: Tier100k
has top concept: Tier10k
has top concept: Tier250
has top concept: Tier2k
has top concept: Tier Unlimited
has top concept: Untiered

Tier100k
type: Concept
in scheme: BusinessWhatsappBusinessManagerMessagingLimit
top concept of: BusinessWhatsappBusinessManagerMessagingLimit
alternative label: tier100k
notation: TIER_100K

Tier10k
type: Concept
in scheme: BusinessWhatsappBusinessManagerMessagingLimit
top concept of: BusinessWhatsappBusinessManagerMessagingLimit
alternative label: tier10k
notation: TIER_10K

Tier250
type: Concept
in scheme: BusinessWhatsappBusinessManagerMessagingLimit
top concept of: BusinessWhatsappBusinessManagerMessagingLimit
alternative label: tier250
notation: TIER_250

Tier2k
type: Concept
in scheme: BusinessWhatsappBusinessManagerMessagingLimit
top concept of: BusinessWhatsappBusinessManagerMessagingLimit
alternative label: tier2k
notation: TIER_2K

Tier Unlimited
type: Concept
in scheme: BusinessWhatsappBusinessManagerMessagingLimit
top concept of: BusinessWhatsappBusinessManagerMessagingLimit
alternative label: tierUnlimited
notation: TIER_UNLIMITED

Untiered
type: Concept
in scheme: BusinessWhatsappBusinessManagerMessagingLimit
top concept of: BusinessWhatsappBusinessManagerMessagingLimit
alternative label: untiered
notation: UNTIERED

CampaignBidStrategy
type: ConceptScheme
comment: Values Campaign.bid_strategy accepts.
has top concept: Cost Cap
has top concept: Lowest Cost Without Cap
has top concept: Lowest Cost With Bid Cap
has top concept: Lowest Cost With Min Roas

Cost Cap
type: Concept
in scheme: CampaignBidStrategy
top concept of: CampaignBidStrategy
alternative label: costCap
notation: COST_CAP

Lowest Cost Without Cap
type: Concept
in scheme: CampaignBidStrategy
top concept of: CampaignBidStrategy
alternative label: lowestCostWithoutCap
notation: LOWEST_COST_WITHOUT_CAP

Lowest Cost With Bid Cap
type: Concept
in scheme: CampaignBidStrategy
top concept of: CampaignBidStrategy
alternative label: lowestCostWithBidCap
notation: LOWEST_COST_WITH_BID_CAP

Lowest Cost With Min Roas
type: Concept
in scheme: CampaignBidStrategy
top concept of: CampaignBidStrategy
alternative label: lowestCostWithMinRoas
notation: LOWEST_COST_WITH_MIN_ROAS

CampaignConfiguredStatus
type: ConceptScheme
comment: Values Campaign.configured_status accepts.
has top concept: Active
has top concept: Archived
has top concept: Deleted
has top concept: Paused

Active
type: Concept
in scheme: CampaignConfiguredStatus
top concept of: CampaignConfiguredStatus
alternative label: active
notation: ACTIVE

Archived
type: Concept
in scheme: CampaignConfiguredStatus
top concept of: CampaignConfiguredStatus
alternative label: archived
notation: ARCHIVED

Deleted
type: Concept
in scheme: CampaignConfiguredStatus
top concept of: CampaignConfiguredStatus
alternative label: deleted
notation: DELETED

Paused
type: Concept
in scheme: CampaignConfiguredStatus
top concept of: CampaignConfiguredStatus
alternative label: paused
notation: PAUSED

CampaignEffectiveStatus
type: ConceptScheme
comment: Values Campaign.effective_status accepts.
has top concept: Active
has top concept: Archived
has top concept: Deleted
has top concept: In Process
has top concept: Paused
has top concept: With Issues

Active
type: Concept
in scheme: CampaignEffectiveStatus
top concept of: CampaignEffectiveStatus
alternative label: active
notation: ACTIVE

Archived
type: Concept
in scheme: CampaignEffectiveStatus
top concept of: CampaignEffectiveStatus
alternative label: archived
notation: ARCHIVED

Deleted
type: Concept
in scheme: CampaignEffectiveStatus
top concept of: CampaignEffectiveStatus
alternative label: deleted
notation: DELETED

In Process
type: Concept
in scheme: CampaignEffectiveStatus
top concept of: CampaignEffectiveStatus
alternative label: inProcess
notation: IN_PROCESS

Paused
type: Concept
in scheme: CampaignEffectiveStatus
top concept of: CampaignEffectiveStatus
alternative label: paused
notation: PAUSED

With Issues
type: Concept
in scheme: CampaignEffectiveStatus
top concept of: CampaignEffectiveStatus
alternative label: withIssues
notation: WITH_ISSUES

CampaignStatus
type: ConceptScheme
comment: Values Campaign.status accepts.
has top concept: Active
has top concept: Archived
has top concept: Deleted
has top concept: Paused

Active
type: Concept
in scheme: CampaignStatus
top concept of: CampaignStatus
alternative label: active
notation: ACTIVE

Archived
type: Concept
in scheme: CampaignStatus
top concept of: CampaignStatus
alternative label: archived
notation: ARCHIVED

Deleted
type: Concept
in scheme: CampaignStatus
top concept of: CampaignStatus
alternative label: deleted
notation: DELETED

Paused
type: Concept
in scheme: CampaignStatus
top concept of: CampaignStatus
alternative label: paused
notation: PAUSED

EventCategory
type: ConceptScheme
comment: Values Event.category accepts.
has top concept: Classic Literature
has top concept: Comedy
has top concept: Crafts
has top concept: Dance
has top concept: Drinks
has top concept: Fitness And Workouts
has top concept: Foods
has top concept: Games
has top concept: Gardening
has top concept: Healthy Living And Self Care
has top concept: Health And Medical
has top concept: Home And Garden
has top concept: Music And Audio
has top concept: Parties
has top concept: Professional Networking
has top concept: Religions
has top concept: Shopping Event
has top concept: Social Issues
has top concept: Sports
has top concept: Theater
has top concept: Tv And Movies
has top concept: Visual Arts

Classic Literature
type: Concept
in scheme: EventCategory
top concept of: EventCategory
alternative label: classicLiterature
notation: CLASSIC_LITERATURE

Comedy
type: Concept
in scheme: EventCategory
top concept of: EventCategory
alternative label: comedy
notation: COMEDY

Crafts
type: Concept
in scheme: EventCategory
top concept of: EventCategory
alternative label: crafts
notation: CRAFTS

Dance
type: Concept
in scheme: EventCategory
top concept of: EventCategory
alternative label: dance
notation: DANCE

Drinks
type: Concept
in scheme: EventCategory
top concept of: EventCategory
alternative label: drinks
notation: DRINKS

Fitness And Workouts
type: Concept
in scheme: EventCategory
top concept of: EventCategory
alternative label: fitnessAndWorkouts
notation: FITNESS_AND_WORKOUTS

Foods
type: Concept
in scheme: EventCategory
top concept of: EventCategory
alternative label: foods
notation: FOODS

Games
type: Concept
in scheme: EventCategory
top concept of: EventCategory
alternative label: games
notation: GAMES

Gardening
type: Concept
in scheme: EventCategory
top concept of: EventCategory
alternative label: gardening
notation: GARDENING

Healthy Living And Self Care
type: Concept
in scheme: EventCategory
top concept of: EventCategory
alternative label: healthyLivingAndSelfCare
notation: HEALTHY_LIVING_AND_SELF_CARE

Health And Medical
type: Concept
in scheme: EventCategory
top concept of: EventCategory
alternative label: healthAndMedical
notation: HEALTH_AND_MEDICAL

Home And Garden
type: Concept
in scheme: EventCategory
top concept of: EventCategory
alternative label: homeAndGarden
notation: HOME_AND_GARDEN

Music And Audio
type: Concept
in scheme: EventCategory
top concept of: EventCategory
alternative label: musicAndAudio
notation: MUSIC_AND_AUDIO

Parties
type: Concept
in scheme: EventCategory
top concept of: EventCategory
alternative label: parties
notation: PARTIES

Professional Networking
type: Concept
in scheme: EventCategory
top concept of: EventCategory
alternative label: professionalNetworking
notation: PROFESSIONAL_NETWORKING

Religions
type: Concept
in scheme: EventCategory
top concept of: EventCategory
alternative label: religions
notation: RELIGIONS

Shopping Event
type: Concept
in scheme: EventCategory
top concept of: EventCategory
alternative label: shoppingEvent
notation: SHOPPING_EVENT

Social Issues
type: Concept
in scheme: EventCategory
top concept of: EventCategory
alternative label: socialIssues
notation: SOCIAL_ISSUES

Sports
type: Concept
in scheme: EventCategory
top concept of: EventCategory
alternative label: sports
notation: SPORTS

Theater
type: Concept
in scheme: EventCategory
top concept of: EventCategory
alternative label: theater
notation: THEATER

Tv And Movies
type: Concept
in scheme: EventCategory
top concept of: EventCategory
alternative label: tvAndMovies
notation: TV_AND_MOVIES

Visual Arts
type: Concept
in scheme: EventCategory
top concept of: EventCategory
alternative label: visualArts
notation: VISUAL_ARTS

EventOnlineEventFormat
type: ConceptScheme
comment: Values Event.online_event_format accepts.
has top concept: Fb Live
has top concept: Horizon Event
has top concept: Messenger Room
has top concept: None
has top concept: Other
has top concept: Third Party

Fb Live
type: Concept
in scheme: EventOnlineEventFormat
top concept of: EventOnlineEventFormat
alternative label: fbLive
notation: fb_live

Horizon Event
type: Concept
in scheme: EventOnlineEventFormat
top concept of: EventOnlineEventFormat
alternative label: horizonEvent
notation: horizon_event

Messenger Room
type: Concept
in scheme: EventOnlineEventFormat
top concept of: EventOnlineEventFormat
alternative label: messengerRoom
notation: messenger_room

None
type: Concept
in scheme: EventOnlineEventFormat
top concept of: EventOnlineEventFormat
alternative label: none
notation: none

Other
type: Concept
in scheme: EventOnlineEventFormat
top concept of: EventOnlineEventFormat
alternative label: other
notation: other

Third Party
type: Concept
in scheme: EventOnlineEventFormat
top concept of: EventOnlineEventFormat
alternative label: thirdParty
notation: third_party

EventType
type: ConceptScheme
comment: Values Event.type accepts.
has top concept: Community
has top concept: Friends
has top concept: Group
has top concept: Messenger Community
has top concept: Private
has top concept: Public
has top concept: Work Company

Community
type: Concept
in scheme: EventType
top concept of: EventType
alternative label: community
notation: community

Friends
type: Concept
in scheme: EventType
top concept of: EventType
alternative label: friends
notation: friends

Group
type: Concept
in scheme: EventType
top concept of: EventType
alternative label: group
notation: group

Messenger Community
type: Concept
in scheme: EventType
top concept of: EventType
alternative label: messengerCommunity
notation: messenger_community

Private
type: Concept
in scheme: EventType
top concept of: EventType
alternative label: private
notation: private

Public
type: Concept
in scheme: EventType
top concept of: EventType
alternative label: public
notation: public

Work Company
type: Concept
in scheme: EventType
top concept of: EventType
alternative label: workCompany
notation: work_company

PlacementDevicePlatforms
type: ConceptScheme
comment: Values Placement.device_platforms accepts.
has top concept: Desktop
has top concept: Mobile

Desktop
type: Concept
in scheme: PlacementDevicePlatforms
top concept of: PlacementDevicePlatforms
alternative label: desktop
notation: desktop

Mobile
type: Concept
in scheme: PlacementDevicePlatforms
top concept of: PlacementDevicePlatforms
alternative label: mobile
notation: mobile

PlacementEffectiveDevicePlatforms
type: ConceptScheme
comment: Values Placement.effective_device_platforms accepts.
has top concept: Desktop
has top concept: Mobile

Desktop
type: Concept
in scheme: PlacementEffectiveDevicePlatforms
top concept of: PlacementEffectiveDevicePlatforms
alternative label: desktop
notation: desktop

Mobile
type: Concept
in scheme: PlacementEffectiveDevicePlatforms
top concept of: PlacementEffectiveDevicePlatforms
alternative label: mobile
notation: mobile

ProfileProfileType
type: ConceptScheme
comment: Values Profile.profile_type accepts.
has top concept: Application
has top concept: Event
has top concept: Group
has top concept: Page
has top concept: User

Application
type: Concept
in scheme: ProfileProfileType
top concept of: ProfileProfileType
alternative label: application
notation: application

Event
type: Concept
in scheme: ProfileProfileType
top concept of: ProfileProfileType
alternative label: event
notation: event

Group
type: Concept
in scheme: ProfileProfileType
top concept of: ProfileProfileType
alternative label: group
notation: group

Page
type: Concept
in scheme: ProfileProfileType
top concept of: ProfileProfileType
alternative label: page
notation: page

User
type: Concept
in scheme: ProfileProfileType
top concept of: ProfileProfileType
alternative label: user
notation: user

TargetingDevicePlatforms
type: ConceptScheme
comment: Values Targeting.device_platforms accepts.
has top concept: Desktop
has top concept: Mobile

Desktop
type: Concept
in scheme: TargetingDevicePlatforms
top concept of: TargetingDevicePlatforms
alternative label: desktop
notation: desktop

Mobile
type: Concept
in scheme: TargetingDevicePlatforms
top concept of: TargetingDevicePlatforms
alternative label: mobile
notation: mobile

TargetingEffectiveDevicePlatforms
type: ConceptScheme
comment: Values Targeting.effective_device_platforms accepts.
has top concept: Desktop
has top concept: Mobile

Desktop
type: Concept
in scheme: TargetingEffectiveDevicePlatforms
top concept of: TargetingEffectiveDevicePlatforms
alternative label: desktop
notation: desktop

Mobile
type: Concept
in scheme: TargetingEffectiveDevicePlatforms
top concept of: TargetingEffectiveDevicePlatforms
alternative label: mobile
notation: mobile

100x100
type: Property
comment: Query alias: 1 model declares 100x100.

100x72
type: Property
comment: Query alias: 1 model declares 100x72.

191x100
type: Property
comment: Query alias: 1 model declares 191x100.

300x400
type: Property
comment: Query alias: 1 model declares 300x400.

400x150
type: Property
comment: Query alias: 1 model declares 400x150.

400x500
type: Property
comment: Query alias: 1 model declares 400x500.

600x360
type: Property
comment: Query alias: 1 model declares 600x360.

90x160
type: Property
comment: Query alias: 1 model declares 90x160.

about
type: Property
comment: Query alias: 2 models declare about.

access token
type: Property
comment: Query alias: 1 model declares accessToken.

account
type: Property
comment: Query alias: 1 model declares account.

account admin
type: Property
comment: Query alias: 1 model declares accountAdmin.

account currency
type: Property
comment: Query alias: 1 model declares accountCurrency.

account id
type: Property
comment: Query alias: 7 models declare accountId.

account name
type: Property
comment: Query alias: 1 model declares accountName.

account status
type: Property
comment: Query alias: 1 model declares accountStatus.

acting business id
type: Property
comment: Query alias: 1 model declares actingBusinessId.

action
type: Property
comment: Query alias: 1 model declares action.

action brand
type: Property
comment: Query alias: 2 models declare actionBrand.

action canvas component id
type: Property
comment: Query alias: 2 models declare actionCanvasComponentId.

action canvas component name
type: Property
comment: Query alias: 2 models declare actionCanvasComponentName.

action carousel card id
type: Property
comment: Query alias: 2 models declare actionCarouselCardId.

action carousel card name
type: Property
comment: Query alias: 2 models declare actionCarouselCardName.

action category
type: Property
comment: Query alias: 2 models declare actionCategory.

action converted product id
type: Property
comment: Query alias: 2 models declare actionConvertedProductId.

action destination
type: Property
comment: Query alias: 2 models declare actionDestination.

action device
type: Property
comment: Query alias: 2 models declare actionDevice.

action event channel
type: Property
comment: Query alias: 2 models declare actionEventChannel.

action link click destination
type: Property
comment: Query alias: 2 models declare actionLinkClickDestination.

action location code
type: Property
comment: Query alias: 2 models declare actionLocationCode.

action reaction
type: Property
comment: Query alias: 2 models declare actionReaction.

actions
type: Property
comment: Query alias: 1 model declares actions.

action target id
type: Property
comment: Query alias: 2 models declare actionTargetId.

action values
type: Property
comment: Query alias: 1 model declares actionValues.

action video asset id
type: Property
comment: Query alias: 2 models declare actionVideoAssetId.

action video sound
type: Property
comment: Query alias: 2 models declare actionVideoSound.

action video type
type: Property
comment: Query alias: 2 models declare actionVideoType.

actor id
type: Property
comment: Query alias: 1 model declares actorId.

ad
type: Property
comment: Query alias: 1 model declares ad.

ad account
type: Property
comment: Query alias: 1 model declares adAccount.

ad account promotable objects
type: Property
comment: Query alias: 1 model declares adAccountPromotableObjects.

ad account to collaborative ads share settings
type: Property
comment: Query alias: 1 model declares adAccountToCollaborativeAdsShareSettings.

ad active time
type: Property
comment: Query alias: 1 model declares adActiveTime.

adapt to placement
type: Property
comment: Query alias: 1 model declares adaptToPlacement.

ad breaks
type: Property
comment: Query alias: 1 model declares adBreaks.

ad campaign
type: Property
comment: Query alias: 1 model declares adCampaign.

ad click actions
type: Property
comment: Query alias: 1 model declares adClickActions.

ad context
type: Property
comment: Query alias: 1 model declares adContext.

ad disclaimer spec
type: Property
comment: Query alias: 1 model declares adDisclaimerSpec.

additional data
type: Property
comment: Query alias: 1 model declares additionalData.

additional image index
type: Property
comment: Query alias: 2 models declare additionalImageIndex.

address string
type: Property
comment: Query alias: 2 models declare addressString.

add text overlay
type: Property
comment: Query alias: 1 model declares addTextOverlay.

ad extensions relevancy spec
type: Property
comment: Query alias: 1 model declares adExtensionsRelevancySpec.

ad format
type: Property
comment: Query alias: 1 model declares adFormat.

ad formats
type: Property
comment: Query alias: 1 model declares adFormats.

adgroup id
type: Property
comment: Query alias: 1 model declares adgroupId.

ad group id
type: Property
comment: Query alias: 1 model declares adGroupId.

adgroup ids
type: Property
comment: Query alias: 1 model declares adgroupIds.

ad handle type
type: Property
comment: Query alias: 1 model declares adHandleType.

ad id
type: Property
comment: Query alias: 1 model declares adId.

ad impression actions
type: Property
comment: Query alias: 1 model declares adImpressionActions.

admin creator
type: Property
comment: Query alias: 1 model declares adminCreator.

ad name
type: Property
comment: Query alias: 1 model declares adName.

ad review feedback
type: Property
comment: Query alias: 1 model declares adReviewFeedback.

ad schedule end time
type: Property
comment: Query alias: 1 model declares adScheduleEndTime.

ad schedule start time
type: Property
comment: Query alias: 1 model declares adScheduleStartTime.

ads conversion experiences
type: Property
comment: Query alias: 1 model declares adsConversionExperiences.

adset
type: Property
comment: Query alias: 1 model declares adset.

adset end
type: Property
comment: Query alias: 1 model declares adsetEnd.

adset id
type: Property
comment: Query alias: 2 models declare adsetId.

adset name
type: Property
comment: Query alias: 1 model declares adsetName.

adset schedule
type: Property
comment: Query alias: 1 model declares adsetSchedule.

adset start
type: Property
comment: Query alias: 1 model declares adsetStart.

ads with benefits
type: Property
comment: Query alias: 1 model declares adsWithBenefits.

advanced actions28d view
type: Property
comment: Query alias: 1 model declares advancedActions28dView.

advanced reach1d lookback
type: Property
comment: Query alias: 1 model declares advancedReach1dLookback.

advanced reach28d lookback
type: Property
comment: Query alias: 1 model declares advancedReach28dLookback.

advanced reach7d lookback
type: Property
comment: Query alias: 1 model declares advancedReach7dLookback.

advantage audience
type: Property
comment: Query alias: 1 model declares advantageAudience.

advantage audience state
type: Property
comment: Query alias: 1 model declares advantageAudienceState.

advantage budget state
type: Property
comment: Query alias: 1 model declares advantageBudgetState.

advantage placement state
type: Property
comment: Query alias: 1 model declares advantagePlacementState.

advantage plus creative
type: Property
comment: Query alias: 1 model declares advantagePlusCreative.

advantage state
type: Property
comment: Query alias: 1 model declares advantageState.

advantage state info
type: Property
comment: Query alias: 1 model declares advantageStateInfo.

affiliation
type: Property
comment: Query alias: 1 model declares affiliation.

age
type: Property
comment: Query alias: 1 model declares age.

age max
type: Property
comment: Query alias: 2 models declare ageMax.

age min
type: Property
comment: Query alias: 2 models declare ageMin.

agency business
type: Property
comment: Query alias: 1 model declares agencyBusiness.

agency client declaration
type: Property
comment: Query alias: 1 model declares agencyClientDeclaration.

agency collaborative ads share settings
type: Property
comment: Query alias: 1 model declares agencyCollaborativeAdsShareSettings.

agency representing client
type: Property
comment: Query alias: 1 model declares agencyRepresentingClient.

age targeting
type: Property
comment: Query alias: 1 model declares ageTargeting.

all capabilities
type: Property
comment: Query alias: 1 model declares allCapabilities.

all ddex featured artists
type: Property
comment: Query alias: 1 model declares allDdexFeaturedArtists.

all ddex main artists
type: Property
comment: Query alias: 1 model declares allDdexMainArtists.

all kg featured artists
type: Property
comment: Query alias: 1 model declares allKgFeaturedArtists.

all kg main artists
type: Property
comment: Query alias: 1 model declares allKgMainArtists.

allocated amount
type: Property
comment: Query alias: 1 model declares allocatedAmount.

allow
type: Property
comment: Query alias: 1 model declares allow.

alternate auto targeting option
type: Property
comment: Query alias: 1 model declares alternateAutoTargetingOption.

alt text
type: Property
comment: Query alias: 1 model declares altText.

amex
type: Property
comment: Query alias: 1 model declares amex.

amount in hundredths
type: Property
comment: Query alias: 1 model declares amountInHundredths.

amount spent
type: Property
comment: Query alias: 1 model declares amountSpent.

anchor event attribution setting
type: Property
comment: Query alias: 1 model declares anchorEventAttributionSetting.

anchor event attribution window days
type: Property
comment: Query alias: 1 model declares anchorEventAttributionWindowDays.

anchor events performance indicator
type: Property
comment: Query alias: 1 model declares anchorEventsPerformanceIndicator.

android url
type: Property
comment: Query alias: 3 models declare androidUrl.

api enum
type: Property
comment: Query alias: 1 model declares apiEnum.

app
type: Property
comment: Query alias: 1 model declares app.

app destination
type: Property
comment: Query alias: 1 model declares appDestination.

app has leads permission
type: Property
comment: Query alias: 1 model declares appHasLeadsPermission.

app highlights
type: Property
comment: Query alias: 1 model declares appHighlights.

app id
type: Property
comment: Query alias: 1 model declares appId.

app install state
type: Property
comment: Query alias: 1 model declares appInstallState.

application id
type: Property
comment: Query alias: 1 model declares applicationId.

app link
type: Property
comment: Query alias: 1 model declares appLink.

app link spec
type: Property
comment: Query alias: 1 model declares appLinkSpec.

applink treatment
type: Property
comment: Query alias: 1 model declares applinkTreatment.

app name
type: Property
comment: Query alias: 2 models declare appName.

app product page id
type: Property
comment: Query alias: 1 model declares appProductPageId.

app store id
type: Property
comment: Query alias: 1 model declares appStoreId.

archived
type: Property
comment: Query alias: 1 model declares archived.

artist profile picture url
type: Property
comment: Query alias: 1 model declares artistProfilePictureUrl.

artists we like
type: Property
comment: Query alias: 1 model declares artistsWeLike.

aspect ratio config
type: Property
comment: Query alias: 1 model declares aspectRatioConfig.

asset customization
type: Property
comment: Query alias: 1 model declares assetCustomization.

asset customization rules
type: Property
comment: Query alias: 1 model declares assetCustomizationRules.

asset feed id
type: Property
comment: Query alias: 1 model declares assetFeedId.

asset feed spec
type: Property
comment: Query alias: 1 model declares assetFeedSpec.

associated product set id
type: Property
comment: Query alias: 1 model declares associatedProductSetId.

attachment style
type: Property
comment: Query alias: 1 model declares attachmentStyle.

attending count
type: Property
comment: Query alias: 1 model declares attendingCount.

attire
type: Property
comment: Query alias: 1 model declares attire.

attribution setting
type: Property
comment: Query alias: 1 model declares attributionSetting.

attribution spec
type: Property
comment: Query alias: 2 models declare attributionSpec.

attribution windows
type: Property
comment: Query alias: 1 model declares attributionWindows.

auction bid
type: Property
comment: Query alias: 1 model declares auctionBid.

auction competitiveness
type: Property
comment: Query alias: 1 model declares auctionCompetitiveness.

auction max competitor bid
type: Property
comment: Query alias: 1 model declares auctionMaxCompetitorBid.

audience network positions
type: Property
comment: Query alias: 4 models declare audienceNetworkPositions.

audience type param name
type: Property
comment: Query alias: 1 model declares audienceTypeParamName.

audio
type: Property
comment: Query alias: 1 model declares audio.

audio cluster id
type: Property
comment: Query alias: 1 model declares audioClusterId.

audio id
type: Property
comment: Query alias: 1 model declares audioId.

audio isrc
type: Property
comment: Query alias: 1 model declares audioIsrc.

audios
type: Property
comment: Query alias: 1 model declares audios.

australia finserv
type: Property
comment: Query alias: 1 model declares australiaFinserv.

australia finserv beneficiary
type: Property
comment: Query alias: 1 model declares australiaFinservBeneficiary.

australia finserv payer
type: Property
comment: Query alias: 1 model declares australiaFinservPayer.

authorization category
type: Property
comment: Query alias: 1 model declares authorizationCategory.

auto creation url
type: Property
comment: Query alias: 1 model declares autoCreationUrl.

auto enroll
type: Property
comment: Query alias: 1 model declares autoEnroll.

automated adgroup creation
type: Property
comment: Query alias: 1 model declares automatedAdgroupCreation.

automated product tags
type: Property
comment: Query alias: 2 models declare automatedProductTags.

automatic manual state
type: Property
comment: Query alias: 1 model declares automaticManualState.

auto optimization
type: Property
comment: Query alias: 1 model declares autoOptimization.

auto promotion tag
type: Property
comment: Query alias: 1 model declares autoPromotionTag.

autoreply
type: Property
comment: Query alias: 1 model declares autoreply.

autotranslate
type: Property
comment: Query alias: 1 model declares autotranslate.

auto update
type: Property
comment: Query alias: 1 model declares autoUpdate.

available promo offer ids
type: Property
comment: Query alias: 1 model declares availablePromoOfferIds.

average purchases conversion value
type: Property
comment: Query alias: 1 model declares averagePurchasesConversionValue.

awards
type: Property
comment: Query alias: 1 model declares awards.

b2c
type: Property
comment: Query alias: 1 model declares b2c.

b2c commerce unified
type: Property
comment: Query alias: 1 model declares b2cCommerceUnified.

backdated time
type: Property
comment: Query alias: 1 model declares backdatedTime.

backdated time granularity
type: Property
comment: Query alias: 1 model declares backdatedTimeGranularity.

background color
type: Property
comment: Query alias: 1 model declares backgroundColor.

band interests
type: Property
comment: Query alias: 1 model declares bandInterests.

band members
type: Property
comment: Query alias: 1 model declares bandMembers.

behaviors
type: Property
comment: Query alias: 2 models declare behaviors.

best page
type: Property
comment: Query alias: 1 model declares bestPage.

bid adjustments
type: Property
comment: Query alias: 1 model declares bidAdjustments.

bid constraints
type: Property
comment: Query alias: 1 model declares bidConstraints.

bid strategy
type: Property
comment: Query alias: 2 models declare bidStrategy.

bid type
type: Property
comment: Query alias: 1 model declares bidType.

billing event
type: Property
comment: Query alias: 1 model declares billingEvent.

bill to address
type: Property
comment: Query alias: 1 model declares billToAddress.

bio
type: Property
comment: Query alias: 1 model declares bio.

biography
type: Property
comment: Query alias: 1 model declares biography.

birthday
type: Property
comment: Query alias: 2 models declare birthday.

biz ai
type: Property
comment: Query alias: 1 model declares bizAi.

blame field
type: Property
comment: Query alias: 1 model declares blameField.

blending mode
type: Property
comment: Query alias: 1 model declares blendingMode.

block offline analytics
type: Property
comment: Query alias: 1 model declares blockOfflineAnalytics.

body
type: Property
comment: Query alias: 1 model declares body.

body label
type: Property
comment: Query alias: 3 models declare bodyLabel.

booking agent
type: Property
comment: Query alias: 1 model declares bookingAgent.

boosted object id
type: Property
comment: Query alias: 1 model declares boostedObjectId.

boosted product set id
type: Property
comment: Query alias: 2 models declare boostedProductSetId.

boost ineligible reason
type: Property
comment: Query alias: 1 model declares boostIneligibleReason.

bottom
type: Property
comment: Query alias: 1 model declares bottom.

brand
type: Property
comment: Query alias: 1 model declares brand.

branded content
type: Property
comment: Query alias: 1 model declares brandedContent.

branded content shared to sponsor status
type: Property
comment: Query alias: 3 models declare brandedContentSharedToSponsorStatus.

branded content sponsor page id
type: Property
comment: Query alias: 4 models declare brandedContentSponsorPageId.

brand lift studies
type: Property
comment: Query alias: 1 model declares brandLiftStudies.

brand page id
type: Property
comment: Query alias: 1 model declares brandPageId.

brand safety config
type: Property
comment: Query alias: 1 model declares brandSafetyConfig.

brand safety content filter levels
type: Property
comment: Query alias: 2 models declare brandSafetyContentFilterLevels.

breakfast
type: Property
comment: Query alias: 1 model declares breakfast.

breaking news usage
type: Property
comment: Query alias: 1 model declares breakingNewsUsage.

bsg
type: Property
comment: Query alias: 1 model declares bsg.

budget rebalance flag
type: Property
comment: Query alias: 1 model declares budgetRebalanceFlag.

budget remaining
type: Property
comment: Query alias: 2 models declare budgetRemaining.

built
type: Property
comment: Query alias: 1 model declares built.

bundle folder id
type: Property
comment: Query alias: 1 model declares bundleFolderId.

business city
type: Property
comment: Query alias: 1 model declares businessCity.

business country code
type: Property
comment: Query alias: 1 model declares businessCountryCode.

business discovery
type: Property
comment: Query alias: 1 model declares businessDiscovery.

business name
type: Property
comment: Query alias: 1 model declares businessName.

business state
type: Property
comment: Query alias: 1 model declares businessState.

business street
type: Property
comment: Query alias: 1 model declares businessStreet.

business street2
type: Property
comment: Query alias: 1 model declares businessStreet2.

business zip
type: Property
comment: Query alias: 1 model declares businessZip.

buttons
type: Property
comment: Query alias: 1 model declares buttons.

buying type
type: Property
comment: Query alias: 2 models declare buyingType.

bytes transferred
type: Property
comment: Query alias: 1 model declares bytesTransferred.

cache key
type: Property
comment: Query alias: 1 model declares cacheKey.

call ads configuration
type: Property
comment: Query alias: 1 model declares callAdsConfiguration.

call to action
type: Property
comment: Query alias: 5 models declare callToAction.

call to action label
type: Property
comment: Query alias: 1 model declares callToActionLabel.

call to actions
type: Property
comment: Query alias: 1 model declares callToActions.

call to action type
type: Property
comment: Query alias: 1 model declares callToActionType.

call to action type label
type: Property
comment: Query alias: 2 models declare callToActionTypeLabel.

call to action types
type: Property
comment: Query alias: 1 model declares callToActionTypes.

campaign
type: Property
comment: Query alias: 2 models declare campaign.

campaign active time
type: Property
comment: Query alias: 1 model declares campaignActiveTime.

campaign attribution
type: Property
comment: Query alias: 1 model declares campaignAttribution.

campaign group active time
type: Property
comment: Query alias: 1 model declares campaignGroupActiveTime.

campaign group id
type: Property
comment: Query alias: 1 model declares campaignGroupId.

campaign id
type: Property
comment: Query alias: 4 models declare campaignId.

campaign name
type: Property
comment: Query alias: 1 model declares campaignName.

can access lead
type: Property
comment: Query alias: 1 model declares canAccessLead.

canceled time
type: Property
comment: Query alias: 1 model declares canceledTime.

can checkin
type: Property
comment: Query alias: 1 model declares canCheckin.

can create brand lift study
type: Property
comment: Query alias: 2 models declare canCreateBrandLiftStudy.

can guests invite
type: Property
comment: Query alias: 1 model declares canGuestsInvite.

canonical audio asset
type: Property
comment: Query alias: 1 model declares canonicalAudioAsset.

can post
type: Property
comment: Query alias: 2 models declare canPost.

can use spend cap
type: Property
comment: Query alias: 1 model declares canUseSpendCap.

canvas avg view percent
type: Property
comment: Query alias: 1 model declares canvasAvgViewPercent.

canvas avg view time
type: Property
comment: Query alias: 1 model declares canvasAvgViewTime.

capabilities
type: Property
comment: Query alias: 1 model declares capabilities.

caption
type: Property
comment: Query alias: 6 models declare caption.

caption ids
type: Property
comment: Query alias: 1 model declares captionIds.

caption label
type: Property
comment: Query alias: 3 models declare captionLabel.

captions
type: Property
comment: Query alias: 1 model declares captions.

carousel ad
type: Property
comment: Query alias: 1 model declares carouselAd.

carousel delivery mode
type: Property
comment: Query alias: 1 model declares carouselDeliveryMode.

carousel label
type: Property
comment: Query alias: 1 model declares carouselLabel.

carousels
type: Property
comment: Query alias: 1 model declares carousels.

carousel see more url
type: Property
comment: Query alias: 1 model declares carouselSeeMoreUrl.

carousel to video
type: Property
comment: Query alias: 1 model declares carouselToVideo.

cash only
type: Property
comment: Query alias: 1 model declares cashOnly.

cas segment
type: Property
comment: Query alias: 1 model declares casSegment.

catalog based targeting
type: Property
comment: Query alias: 1 model declares catalogBasedTargeting.

catalog feed tag
type: Property
comment: Query alias: 1 model declares catalogFeedTag.

catalog feed tag name
type: Property
comment: Query alias: 1 model declares catalogFeedTagName.

catalog segment
type: Property
comment: Query alias: 1 model declares catalogSegment.

catalog segment actions
type: Property
comment: Query alias: 1 model declares catalogSegmentActions.

catalog segment value
type: Property
comment: Query alias: 1 model declares catalogSegmentValue.

catalog segment value mobile purchase roas
type: Property
comment: Query alias: 1 model declares catalogSegmentValueMobilePurchaseRoas.

catalog segment value omni purchase roas
type: Property
comment: Query alias: 1 model declares catalogSegmentValueOmniPurchaseRoas.

catalog segment value website purchase roas
type: Property
comment: Query alias: 1 model declares catalogSegmentValueWebsitePurchaseRoas.

catalog store
type: Property
comment: Query alias: 1 model declares catalogStore.

categorization criteria
type: Property
comment: Query alias: 1 model declares categorizationCriteria.

category
type: Property
comment: Query alias: 2 models declare category.

category list
type: Property
comment: Query alias: 1 model declares categoryList.

category media source
type: Property
comment: Query alias: 1 model declares categoryMediaSource.

catering
type: Property
comment: Query alias: 1 model declares catering.

checkins
type: Property
comment: Query alias: 1 model declares checkins.

check name
type: Property
comment: Query alias: 1 model declares checkName.

checkout config
type: Property
comment: Query alias: 1 model declares checkoutConfig.

child ad account id
type: Property
comment: Query alias: 1 model declares childAdAccountId.

child bm id
type: Property
comment: Query alias: 1 model declares childBmId.

city
type: Property
comment: Query alias: 3 models declare city.

city community
type: Property
comment: Query alias: 1 model declares cityCommunity.

city id
type: Property
comment: Query alias: 1 model declares cityId.

city page
type: Property
comment: Query alias: 1 model declares cityPage.

class
type: Property
comment: Query alias: 1 model declares class.

classes
type: Property
comment: Query alias: 1 model declares classes.

clicks
type: Property
comment: Query alias: 1 model declares clicks.

client based in france
type: Property
comment: Query alias: 1 model declares clientBasedInFrance.

client business
type: Property
comment: Query alias: 1 model declares clientBusiness.

client business id
type: Property
comment: Query alias: 1 model declares clientBusinessId.

client city
type: Property
comment: Query alias: 1 model declares clientCity.

client country code
type: Property
comment: Query alias: 1 model declares clientCountryCode.

client email address
type: Property
comment: Query alias: 1 model declares clientEmailAddress.

client name
type: Property
comment: Query alias: 1 model declares clientName.

client postal code
type: Property
comment: Query alias: 1 model declares clientPostalCode.

client province
type: Property
comment: Query alias: 1 model declares clientProvince.

client street
type: Property
comment: Query alias: 1 model declares clientStreet.

client street2
type: Property
comment: Query alias: 1 model declares clientStreet2.

cnpj tax id
type: Property
comment: Query alias: 1 model declares cnpjTaxId.

code
type: Property
comment: Query alias: 2 models declare code.

coffee
type: Property
comment: Query alias: 1 model declares coffee.

collaborative ads lsb image bank id
type: Property
comment: Query alias: 1 model declares collaborativeAdsLsbImageBankId.

collaborative ads managed partner business info
type: Property
comment: Query alias: 1 model declares collaborativeAdsManagedPartnerBusinessInfo.

collaborative ads managed partner eligibility
type: Property
comment: Query alias: 1 model declares collaborativeAdsManagedPartnerEligibility.

collaborative ads partner premium options
type: Property
comment: Query alias: 1 model declares collaborativeAdsPartnerPremiumOptions.

collaborative media search
type: Property
comment: Query alias: 1 model declares collaborativeMediaSearch.

collection thumbnails
type: Property
comment: Query alias: 2 models declare collectionThumbnails.

college years
type: Property
comment: Query alias: 2 models declare collegeYears.

comment moderation filter
type: Property
comment: Query alias: 1 model declares commentModerationFilter.

comments count
type: Property
comment: Query alias: 2 models declare commentsCount.

commerce
type: Property
comment: Query alias: 1 model declares commerce.

commerce merchant settings
type: Property
comment: Query alias: 2 models declare commerceMerchantSettings.

community
type: Property
comment: Query alias: 1 model declares community.

company overview
type: Property
comment: Query alias: 1 model declares companyOverview.

components
type: Property
comment: Query alias: 1 model declares components.

compromise
type: Property
comment: Query alias: 1 model declares compromise.

concentration
type: Property
comment: Query alias: 1 model declares concentration.

condition groups
type: Property
comment: Query alias: 1 model declares conditionGroups.

conditions
type: Property
comment: Query alias: 1 model declares conditions.

confidence
type: Property
comment: Query alias: 1 model declares confidence.

config
type: Property
comment: Query alias: 1 model declares config.

configured status
type: Property
comment: Query alias: 3 models declare configuredStatus.

connected instagram account
type: Property
comment: Query alias: 1 model declares connectedInstagramAccount.

connected page backed instagram account
type: Property
comment: Query alias: 1 model declares connectedPageBackedInstagramAccount.

contact address
type: Property
comment: Query alias: 1 model declares contactAddress.

contact email
type: Property
comment: Query alias: 1 model declares contactEmail.

content
type: Property
comment: Query alias: 1 model declares content.

content category
type: Property
comment: Query alias: 2 models declare contentCategory.

content protect protection disabled reason
type: Property
comment: Query alias: 1 model declares contentProtectProtectionDisabledReason.

content search input
type: Property
comment: Query alias: 1 model declares contentSearchInput.

content tags
type: Property
comment: Query alias: 1 model declares contentTags.

content type
type: Property
comment: Query alias: 1 model declares contentType.

contextual multi ads
type: Property
comment: Query alias: 1 model declares contextualMultiAds.

contextual targeting categories
type: Property
comment: Query alias: 1 model declares contextualTargetingCategories.

conversation template id
type: Property
comment: Query alias: 1 model declares conversationTemplateId.

conversion domain
type: Property
comment: Query alias: 1 model declares conversionDomain.

conversion goal id
type: Property
comment: Query alias: 1 model declares conversionGoalId.

conversion id
type: Property
comment: Query alias: 1 model declares conversionId.

conversion lead rate
type: Property
comment: Query alias: 1 model declares conversionLeadRate.

conversion leads
type: Property
comment: Query alias: 1 model declares conversionLeads.

conversion rate ranking
type: Property
comment: Query alias: 1 model declares conversionRateRanking.

conversion specs
type: Property
comment: Query alias: 1 model declares conversionSpecs.

conversion values
type: Property
comment: Query alias: 1 model declares conversionValues.

converted product app custom event fb mobile purchase
type: Property
comment: Query alias: 1 model declares convertedProductAppCustomEventFbMobilePurchase.

converted product app custom event fb mobile purchase value
type: Property
comment: Query alias: 1 model declares convertedProductAppCustomEventFbMobilePurchaseValue.

converted product offline purchase
type: Property
comment: Query alias: 1 model declares convertedProductOfflinePurchase.

converted product offline purchase value
type: Property
comment: Query alias: 1 model declares convertedProductOfflinePurchaseValue.

converted product omni purchase
type: Property
comment: Query alias: 1 model declares convertedProductOmniPurchase.

converted product omni purchase values
type: Property
comment: Query alias: 1 model declares convertedProductOmniPurchaseValues.

converted product quantity
type: Property
comment: Query alias: 1 model declares convertedProductQuantity.

converted product value
type: Property
comment: Query alias: 1 model declares convertedProductValue.

converted product website pixel purchase
type: Property
comment: Query alias: 1 model declares convertedProductWebsitePixelPurchase.

converted product website pixel purchase value
type: Property
comment: Query alias: 1 model declares convertedProductWebsitePixelPurchaseValue.

converted promoted product app custom event fb mobile purchase
type: Property
comment: Query alias: 1 model declares convertedPromotedProductAppCustomEventFbMobilePurchase.

converted promoted product app custom event fb mobile purchase value
type: Property
comment: Query alias: 1 model declares convertedPromotedProductAppCustomEventFbMobilePurchaseValue.

converted promoted product offline purchase
type: Property
comment: Query alias: 1 model declares convertedPromotedProductOfflinePurchase.

converted promoted product offline purchase value
type: Property
comment: Query alias: 1 model declares convertedPromotedProductOfflinePurchaseValue.

converted promoted product omni purchase
type: Property
comment: Query alias: 1 model declares convertedPromotedProductOmniPurchase.

converted promoted product omni purchase values
type: Property
comment: Query alias: 1 model declares convertedPromotedProductOmniPurchaseValues.

converted promoted product quantity
type: Property
comment: Query alias: 1 model declares convertedPromotedProductQuantity.

converted promoted product value
type: Property
comment: Query alias: 1 model declares convertedPromotedProductValue.

converted promoted product website pixel purchase
type: Property
comment: Query alias: 1 model declares convertedPromotedProductWebsitePixelPurchase.

converted promoted product website pixel purchase value
type: Property
comment: Query alias: 1 model declares convertedPromotedProductWebsitePixelPurchaseValue.

cooldown start time
type: Property
comment: Query alias: 1 model declares cooldownStartTime.

copyright
type: Property
comment: Query alias: 1 model declares copyright.

copyright attribution insights
type: Property
comment: Query alias: 1 model declares copyrightAttributionInsights.

copyright check status
type: Property
comment: Query alias: 1 model declares copyrightCheckStatus.

copyright content id
type: Property
comment: Query alias: 1 model declares copyrightContentId.

copyright creation time
type: Property
comment: Query alias: 1 model declares copyrightCreationTime.

copyright matches
type: Property
comment: Query alias: 1 model declares copyrightMatches.

copyright monitoring status
type: Property
comment: Query alias: 1 model declares copyrightMonitoringStatus.

copyrights
type: Property
comment: Query alias: 1 model declares copyrights.

copyright whitelisted ig partners
type: Property
comment: Query alias: 1 model declares copyrightWhitelistedIgPartners.

cost per15sec video view
type: Property
comment: Query alias: 1 model declares costPer15SecVideoView.

cost per2sec continuous video view
type: Property
comment: Query alias: 1 model declares costPer2SecContinuousVideoView.

cost per action type
type: Property
comment: Query alias: 1 model declares costPerActionType.

cost per ad click
type: Property
comment: Query alias: 1 model declares costPerAdClick.

cost per conversion
type: Property
comment: Query alias: 1 model declares costPerConversion.

cost per conversion lead
type: Property
comment: Query alias: 1 model declares costPerConversionLead.

cost per dda countby convs
type: Property
comment: Query alias: 1 model declares costPerDdaCountbyConvs.

cost per estimated ad recallers
type: Property
comment: Query alias: 1 model declares costPerEstimatedAdRecallers.

cost per inline link click
type: Property
comment: Query alias: 1 model declares costPerInlineLinkClick.

cost per inline post engagement
type: Property
comment: Query alias: 1 model declares costPerInlinePostEngagement.

cost per objective result
type: Property
comment: Query alias: 1 model declares costPerObjectiveResult.

cost per one thousand ad impression
type: Property
comment: Query alias: 1 model declares costPerOneThousandAdImpression.

cost per outbound click
type: Property
comment: Query alias: 1 model declares costPerOutboundClick.

cost per result
type: Property
comment: Query alias: 1 model declares costPerResult.

cost per thruplay
type: Property
comment: Query alias: 1 model declares costPerThruplay.

cost per unique action type
type: Property
comment: Query alias: 1 model declares costPerUniqueActionType.

cost per unique click
type: Property
comment: Query alias: 1 model declares costPerUniqueClick.

cost per unique conversion
type: Property
comment: Query alias: 1 model declares costPerUniqueConversion.

cost per unique inline link click
type: Property
comment: Query alias: 1 model declares costPerUniqueInlineLinkClick.

cost per unique outbound click
type: Property
comment: Query alias: 1 model declares costPerUniqueOutboundClick.

count
type: Property
comment: Query alias: 1 model declares count.

countries
type: Property
comment: Query alias: 4 models declare countries.

country
type: Property
comment: Query alias: 13 models declare country.

country code
type: Property
comment: Query alias: 1 model declares countryCode.

country group
type: Property
comment: Query alias: 1 model declares countryGroup.

country groups
type: Property
comment: Query alias: 2 models declare countryGroups.

country page likes
type: Property
comment: Query alias: 1 model declares countryPageLikes.

count string
type: Property
comment: Query alias: 1 model declares countString.

count string with like
type: Property
comment: Query alias: 1 model declares countStringWithLike.

count string without like
type: Property
comment: Query alias: 1 model declares countStringWithoutLike.

coupon
type: Property
comment: Query alias: 1 model declares coupon.

coupon id
type: Property
comment: Query alias: 1 model declares couponId.

coupons
type: Property
comment: Query alias: 1 model declares coupons.

coupon tiering
type: Property
comment: Query alias: 1 model declares couponTiering.

coupon tiering new
type: Property
comment: Query alias: 1 model declares couponTieringNew.

coupon tiering reactivation
type: Property
comment: Query alias: 1 model declares couponTieringReactivation.

cover id
type: Property
comment: Query alias: 1 model declares coverId.

cover image source
type: Property
comment: Query alias: 1 model declares coverImageSource.

cover image url
type: Property
comment: Query alias: 1 model declares coverImageUrl.

cpc
type: Property
comment: Query alias: 1 model declares cpc.

cpm
type: Property
comment: Query alias: 1 model declares cpm.

cpp
type: Property
comment: Query alias: 1 model declares cpp.

created date
type: Property
comment: Query alias: 1 model declares createdDate.

creation time
type: Property
comment: Query alias: 1 model declares creationTime.

creative asset groups spec
type: Property
comment: Query alias: 1 model declares creativeAssetGroupsSpec.

creative audience pairing
type: Property
comment: Query alias: 1 model declares creativeAudiencePairing.

creative diversity label
type: Property
comment: Query alias: 1 model declares creativeDiversityLabel.

creative diversity score
type: Property
comment: Query alias: 1 model declares creativeDiversityScore.

creative features spec
type: Property
comment: Query alias: 1 model declares creativeFeaturesSpec.

creative media type
type: Property
comment: Query alias: 1 model declares creativeMediaType.

creative sequence
type: Property
comment: Query alias: 1 model declares creativeSequence.

creative sequence repetition pattern
type: Property
comment: Query alias: 1 model declares creativeSequenceRepetitionPattern.

creative sourcing spec
type: Property
comment: Query alias: 1 model declares creativeSourcingSpec.

creative stickers
type: Property
comment: Query alias: 1 model declares creativeStickers.

creator
type: Property
comment: Query alias: 2 models declare creator.

creator ad permission type
type: Property
comment: Query alias: 1 model declares creatorAdPermissionType.

creator user
type: Property
comment: Query alias: 1 model declares creatorUser.

credit available
type: Property
comment: Query alias: 1 model declares creditAvailable.

credit type
type: Property
comment: Query alias: 1 model declares creditType.

ctr
type: Property
comment: Query alias: 1 model declares ctr.

ctwa consent data
type: Property
comment: Query alias: 1 model declares ctwaConsentData.

culinary team
type: Property
comment: Query alias: 1 model declares culinaryTeam.

currency amount
type: Property
comment: Query alias: 1 model declares currencyAmount.

currency offset
type: Property
comment: Query alias: 1 model declares currencyOffset.

current budget prediction
type: Property
comment: Query alias: 1 model declares currentBudgetPrediction.

current live viewer count
type: Property
comment: Query alias: 1 model declares currentLiveViewerCount.

current location
type: Property
comment: Query alias: 1 model declares currentLocation.

custom attribution source ids
type: Property
comment: Query alias: 1 model declares customAttributionSourceIds.

custom audience
type: Property
comment: Query alias: 1 model declares customAudience.

custom audience info
type: Property
comment: Query alias: 1 model declares customAudienceInfo.

custom conversion
type: Property
comment: Query alias: 1 model declares customConversion.

custom conversion id
type: Property
comment: Query alias: 1 model declares customConversionId.

customer po number
type: Property
comment: Query alias: 1 model declares customerPoNumber.

custom event str
type: Property
comment: Query alias: 1 model declares customEventStr.

custom event type
type: Property
comment: Query alias: 1 model declares customEventType.

customization rules spec
type: Property
comment: Query alias: 2 models declare customizationRulesSpec.

customize product recommendation
type: Property
comment: Query alias: 1 model declares customizeProductRecommendation.

custom labels
type: Property
comment: Query alias: 1 model declares customLabels.

custom locations
type: Property
comment: Query alias: 1 model declares customLocations.

custom text type
type: Property
comment: Query alias: 1 model declares customTextType.

custom tracking
type: Property
comment: Query alias: 1 model declares customTracking.

custom type
type: Property
comment: Query alias: 1 model declares customType.

cv transformation
type: Property
comment: Query alias: 1 model declares cvTransformation.

da display settings
type: Property
comment: Query alias: 1 model declares daDisplaySettings.

daily budget
type: Property
comment: Query alias: 2 models declare dailyBudget.

daily deals
type: Property
comment: Query alias: 1 model declares dailyDeals.

daily deals legacy
type: Property
comment: Query alias: 1 model declares dailyDealsLegacy.

daily min spend target
type: Property
comment: Query alias: 1 model declares dailyMinSpendTarget.

daily spend cap
type: Property
comment: Query alias: 1 model declares dailySpendCap.

dataset
type: Property
comment: Query alias: 1 model declares dataset.

dataset split
type: Property
comment: Query alias: 1 model declares datasetSplit.

dataset split id
type: Property
comment: Query alias: 1 model declares datasetSplitId.

dataset split ids
type: Property
comment: Query alias: 1 model declares datasetSplitIds.

data source
type: Property
comment: Query alias: 1 model declares dataSource.

date
type: Property
comment: Query alias: 1 model declares date.

date start
type: Property
comment: Query alias: 1 model declares dateStart.

date stop
type: Property
comment: Query alias: 1 model declares dateStop.

days
type: Property
comment: Query alias: 1 model declares days.

dda countby convs
type: Property
comment: Query alias: 1 model declares ddaCountbyConvs.

dda results
type: Property
comment: Query alias: 1 model declares ddaResults.

declined count
type: Property
comment: Query alias: 1 model declares declinedCount.

deeplink url
type: Property
comment: Query alias: 1 model declares deeplinkUrl.

default conversion
type: Property
comment: Query alias: 1 model declares defaultConversion.

default creation data
type: Property
comment: Query alias: 1 model declares defaultCreationData.

default dsa beneficiary
type: Property
comment: Query alias: 1 model declares defaultDsaBeneficiary.

default dsa payor
type: Property
comment: Query alias: 1 model declares defaultDsaPayor.

default image url
type: Property
comment: Query alias: 1 model declares defaultImageUrl.

default tracking
type: Property
comment: Query alias: 1 model declares defaultTracking.

degree
type: Property
comment: Query alias: 1 model declares degree.

degrees of freedom spec
type: Property
comment: Query alias: 1 model declares degreesOfFreedomSpec.

degrees of freedom type
type: Property
comment: Query alias: 1 model declares degreesOfFreedomType.

deliver dynamic partner content
type: Property
comment: Query alias: 1 model declares deliverDynamicPartnerContent.

delivery
type: Property
comment: Query alias: 1 model declares delivery.

delivery and pickup option info
type: Property
comment: Query alias: 1 model declares deliveryAndPickupOptionInfo.

demolink hash
type: Property
comment: Query alias: 1 model declares demolinkHash.

deny
type: Property
comment: Query alias: 1 model declares deny.

deprecation code
type: Property
comment: Query alias: 1 model declares deprecationCode.

description
type: Property
comment: Query alias: 14 models declare description.

description automation
type: Property
comment: Query alias: 1 model declares descriptionAutomation.

description html
type: Property
comment: Query alias: 1 model declares descriptionHtml.

description label
type: Property
comment: Query alias: 3 models declare descriptionLabel.

destinations
type: Property
comment: Query alias: 1 model declares destinations.

destination screenshot spec
type: Property
comment: Query alias: 1 model declares destinationScreenshotSpec.

destination set id
type: Property
comment: Query alias: 1 model declares destinationSetId.

destination spec
type: Property
comment: Query alias: 1 model declares destinationSpec.

destination type
type: Property
comment: Query alias: 2 models declare destinationType.

details page product id
type: Property
comment: Query alias: 1 model declares detailsPageProductId.

device platforms
type: Property
comment: Query alias: 3 models declare devicePlatforms.

dha optimization
type: Property
comment: Query alias: 1 model declares dhaOptimization.

differently open offerings
type: Property
comment: Query alias: 1 model declares differentlyOpenOfferings.

dinner
type: Property
comment: Query alias: 1 model declares dinner.

directed by
type: Property
comment: Query alias: 1 model declares directedBy.

direct install devices
type: Property
comment: Query alias: 1 model declares directInstallDevices.

disable protection by content protect status
type: Property
comment: Query alias: 1 model declares disableProtectionByContentProtectStatus.

disable reason
type: Property
comment: Query alias: 1 model declares disableReason.

discount code enabled
type: Property
comment: Query alias: 1 model declares discountCodeEnabled.

discover
type: Property
comment: Query alias: 1 model declares discover.

display amount
type: Property
comment: Query alias: 1 model declares displayAmount.

display artist
type: Property
comment: Query alias: 1 model declares displayArtist.

displayed matches count
type: Property
comment: Query alias: 1 model declares displayedMatchesCount.

displayed message response time
type: Property
comment: Query alias: 1 model declares displayedMessageResponseTime.

display name
type: Property
comment: Query alias: 1 model declares displayName.

display sequence
type: Property
comment: Query alias: 1 model declares displaySequence.

display string
type: Property
comment: Query alias: 1 model declares displayString.

display subtext
type: Property
comment: Query alias: 1 model declares displaySubtext.

display url
type: Property
comment: Query alias: 1 model declares displayUrl.

distance unit
type: Property
comment: Query alias: 3 models declare distanceUnit.

does viewer have page permission link ig
type: Property
comment: Query alias: 1 model declares doesViewerHavePagePermissionLinkIg.

download hd url
type: Property
comment: Query alias: 2 models declare downloadHdUrl.

download sd url
type: Property
comment: Query alias: 1 model declares downloadSdUrl.

dpa
type: Property
comment: Query alias: 1 model declares dpa.

dri copyright
type: Property
comment: Query alias: 1 model declares driCopyright.

dri counterfeit
type: Property
comment: Query alias: 1 model declares driCounterfeit.

drinks
type: Property
comment: Query alias: 1 model declares drinks.

dsa beneficiary
type: Property
comment: Query alias: 1 model declares dsaBeneficiary.

dsa payor
type: Property
comment: Query alias: 1 model declares dsaPayor.

duplication source
type: Property
comment: Query alias: 1 model declares duplicationSource.

duration in ms
type: Property
comment: Query alias: 1 model declares durationInMs.

duration in sec
type: Property
comment: Query alias: 2 models declare durationInSec.

dynamic ad voice
type: Property
comment: Query alias: 1 model declares dynamicAdVoice.

dynamic audience ids
type: Property
comment: Query alias: 1 model declares dynamicAudienceIds.

dynamic cta text
type: Property
comment: Query alias: 1 model declares dynamicCtaText.

dynamic lp conversions threshold
type: Property
comment: Query alias: 1 model declares dynamicLpConversionsThreshold.

dynamic lp days threshold
type: Property
comment: Query alias: 1 model declares dynamicLpDaysThreshold.

dynamic lp status
type: Property
comment: Query alias: 1 model declares dynamicLpStatus.

dynamic partner content
type: Property
comment: Query alias: 1 model declares dynamicPartnerContent.

dynamic site links spec
type: Property
comment: Query alias: 1 model declares dynamicSiteLinksSpec.

education
type: Property
comment: Query alias: 1 model declares education.

education majors
type: Property
comment: Query alias: 2 models declare educationMajors.

education schools
type: Property
comment: Query alias: 2 models declare educationSchools.

education statuses
type: Property
comment: Query alias: 2 models declare educationStatuses.

effective audience network positions
type: Property
comment: Query alias: 2 models declare effectiveAudienceNetworkPositions.

effective authorization category
type: Property
comment: Query alias: 1 model declares effectiveAuthorizationCategory.

effective brand safety content filter levels
type: Property
comment: Query alias: 1 model declares effectiveBrandSafetyContentFilterLevels.

effective device platforms
type: Property
comment: Query alias: 2 models declare effectiveDevicePlatforms.

effective facebook positions
type: Property
comment: Query alias: 2 models declare effectiveFacebookPositions.

effective instagram media id
type: Property
comment: Query alias: 1 model declares effectiveInstagramMediaId.

effective instagram positions
type: Property
comment: Query alias: 2 models declare effectiveInstagramPositions.

effective messenger positions
type: Property
comment: Query alias: 2 models declare effectiveMessengerPositions.

effective object story id
type: Property
comment: Query alias: 1 model declares effectiveObjectStoryId.

effective oculus positions
type: Property
comment: Query alias: 1 model declares effectiveOculusPositions.

effective publisher platforms
type: Property
comment: Query alias: 2 models declare effectivePublisherPlatforms.

effective status
type: Property
comment: Query alias: 3 models declare effectiveStatus.

effective threads positions
type: Property
comment: Query alias: 2 models declare effectiveThreadsPositions.

effective whatsapp positions
type: Property
comment: Query alias: 2 models declare effectiveWhatsappPositions.

electoral district
type: Property
comment: Query alias: 1 model declares electoralDistrict.

electoral districts
type: Property
comment: Query alias: 1 model declares electoralDistricts.

element child index
type: Property
comment: Query alias: 1 model declares elementChildIndex.

element crops
type: Property
comment: Query alias: 1 model declares elementCrops.

element id
type: Property
comment: Query alias: 1 model declares elementId.

eligible to boost
type: Property
comment: Query alias: 1 model declares eligibleToBoost.

emails
type: Property
comment: Query alias: 2 models declare emails.

embeddable
type: Property
comment: Query alias: 1 model declares embeddable.

embed html
type: Property
comment: Query alias: 1 model declares embedHtml.

enable basket insight
type: Property
comment: Query alias: 1 model declares enableBasketInsight.

enabled
type: Property
comment: Query alias: 1 model declares enabled.

enable direct install
type: Property
comment: Query alias: 1 model declares enableDirectInstall.

enabled lead access manager
type: Property
comment: Query alias: 1 model declares enabledLeadAccessManager.

enable extended audience retargeting
type: Property
comment: Query alias: 1 model declares enableExtendedAudienceRetargeting.

enable launch instant app
type: Property
comment: Query alias: 1 model declares enableLaunchInstantApp.

enable ncs testimonials
type: Property
comment: Query alias: 1 model declares enableNcsTestimonials.

enable social feedback preservation
type: Property
comment: Query alias: 1 model declares enableSocialFeedbackPreservation.

end advertiser
type: Property
comment: Query alias: 1 model declares endAdvertiser.

end advertiser name
type: Property
comment: Query alias: 1 model declares endAdvertiserName.

end date
type: Property
comment: Query alias: 1 model declares endDate.

end minute
type: Property
comment: Query alias: 1 model declares endMinute.

engagement
type: Property
comment: Query alias: 1 model declares engagement.

engagement audience
type: Property
comment: Query alias: 1 model declares engagementAudience.

engagement rate ranking
type: Property
comment: Query alias: 1 model declares engagementRateRanking.

engagement specs
type: Property
comment: Query alias: 1 model declares engagementSpecs.

enhance cta
type: Property
comment: Query alias: 1 model declares enhanceCta.

enroll status
type: Property
comment: Query alias: 2 models declare enrollStatus.

error code
type: Property
comment: Query alias: 2 models declare errorCode.

error message
type: Property
comment: Query alias: 2 models declare errorMessage.

errors
type: Property
comment: Query alias: 3 models declare errors.

error summary
type: Property
comment: Query alias: 2 models declare errorSummary.

error type
type: Property
comment: Query alias: 2 models declare errorType.

estimated ad recallers
type: Property
comment: Query alias: 1 model declares estimatedAdRecallers.

estimated ad recallers lower bound
type: Property
comment: Query alias: 1 model declares estimatedAdRecallersLowerBound.

estimated ad recallers upper bound
type: Property
comment: Query alias: 1 model declares estimatedAdRecallersUpperBound.

estimated ad recall rate
type: Property
comment: Query alias: 1 model declares estimatedAdRecallRate.

estimated ad recall rate lower bound
type: Property
comment: Query alias: 1 model declares estimatedAdRecallRateLowerBound.

estimated ad recall rate upper bound
type: Property
comment: Query alias: 1 model declares estimatedAdRecallRateUpperBound.

ethnic affinity
type: Property
comment: Query alias: 2 models declare ethnicAffinity.

event creator
type: Property
comment: Query alias: 1 model declares eventCreator.

event id
type: Property
comment: Query alias: 3 models declare eventId.

events
type: Property
comment: Query alias: 1 model declares events.

event times
type: Property
comment: Query alias: 1 model declares eventTimes.

event type
type: Property
comment: Query alias: 2 models declare eventType.

excluded brand safety content types
type: Property
comment: Query alias: 1 model declares excludedBrandSafetyContentTypes.

excluded connections
type: Property
comment: Query alias: 1 model declares excludedConnections.

excluded countries
type: Property
comment: Query alias: 1 model declares excludedCountries.

excluded custom audiences
type: Property
comment: Query alias: 1 model declares excludedCustomAudiences.

excluded dynamic audience ids
type: Property
comment: Query alias: 1 model declares excludedDynamicAudienceIds.

excluded engagement specs
type: Property
comment: Query alias: 1 model declares excludedEngagementSpecs.

excluded geo locations
type: Property
comment: Query alias: 1 model declares excludedGeoLocations.

excluded mobile device model
type: Property
comment: Query alias: 1 model declares excludedMobileDeviceModel.

excluded ownership segments
type: Property
comment: Query alias: 1 model declares excludedOwnershipSegments.

excluded product audience specs
type: Property
comment: Query alias: 1 model declares excludedProductAudienceSpecs.

excluded publisher categories
type: Property
comment: Query alias: 1 model declares excludedPublisherCategories.

excluded publisher list ids
type: Property
comment: Query alias: 1 model declares excludedPublisherListIds.

excluded user device
type: Property
comment: Query alias: 1 model declares excludedUserDevice.

exclude reached since
type: Property
comment: Query alias: 1 model declares excludeReachedSince.

existing customer budget percentage
type: Property
comment: Query alias: 1 model declares existingCustomerBudgetPercentage.

existing customers
type: Property
comment: Query alias: 1 model declares existingCustomers.

existing customer tag
type: Property
comment: Query alias: 1 model declares existingCustomerTag.

expired funding source details
type: Property
comment: Query alias: 1 model declares expiredFundingSourceDetails.

extended credit
type: Property
comment: Query alias: 1 model declares extendedCredit.

extended credit invoice group
type: Property
comment: Query alias: 1 model declares extendedCreditInvoiceGroup.

extended updated time
type: Property
comment: Query alias: 1 model declares extendedUpdatedTime.

external url
type: Property
comment: Query alias: 1 model declares externalUrl.

extra info
type: Property
comment: Query alias: 1 model declares extraInfo.

facebook
type: Property
comment: Query alias: 1 model declares facebook.

facebook boost post access token
type: Property
comment: Query alias: 1 model declares facebookBoostPostAccessToken.

facebook branded content
type: Property
comment: Query alias: 1 model declares facebookBrandedContent.

facebook channel
type: Property
comment: Query alias: 1 model declares facebookChannel.

facebook pages live shopping
type: Property
comment: Query alias: 1 model declares facebookPagesLiveShopping.

facebook positions
type: Property
comment: Query alias: 4 models declare facebookPositions.

failed delivery checks
type: Property
comment: Query alias: 2 models declare failedDeliveryChecks.

failure reason
type: Property
comment: Query alias: 1 model declares failureReason.

failure resolution
type: Property
comment: Query alias: 1 model declares failureResolution.

fallback image url
type: Property
comment: Query alias: 1 model declares fallbackImageUrl.

family statuses
type: Property
comment: Query alias: 2 models declare familyStatuses.

fan count
type: Property
comment: Query alias: 1 model declares fanCount.

favorite athletes
type: Property
comment: Query alias: 1 model declares favoriteAthletes.

favorite teams
type: Property
comment: Query alias: 1 model declares favoriteTeams.

fb comment moderation filter
type: Property
comment: Query alias: 1 model declares fbCommentModerationFilter.

fb deal id
type: Property
comment: Query alias: 1 model declares fbDealId.

fb entity
type: Property
comment: Query alias: 1 model declares fbEntity.

fb feed tag
type: Property
comment: Query alias: 1 model declares fbFeedTag.

fb feed tag name
type: Property
comment: Query alias: 1 model declares fbFeedTagName.

fb page categories
type: Property
comment: Query alias: 1 model declares fbPageCategories.

fb page id
type: Property
comment: Query alias: 1 model declares fbPageId.

fb pixel
type: Property
comment: Query alias: 1 model declares fbPixel.

fb pixel event
type: Property
comment: Query alias: 1 model declares fbPixelEvent.

fb reels tag
type: Property
comment: Query alias: 1 model declares fbReelsTag.

fb reels tag name
type: Property
comment: Query alias: 1 model declares fbReelsTagName.

fb sales channel
type: Property
comment: Query alias: 1 model declares fbSalesChannel.

fb story tag
type: Property
comment: Query alias: 1 model declares fbStoryTag.

fb story tag name
type: Property
comment: Query alias: 1 model declares fbStoryTagName.

featured offering spec
type: Property
comment: Query alias: 1 model declares featuredOfferingSpec.

featured video
type: Property
comment: Query alias: 1 model declares featuredVideo.

features
type: Property
comment: Query alias: 1 model declares features.

feed caption optimization
type: Property
comment: Query alias: 1 model declares feedCaptionOptimization.

feed count
type: Property
comment: Query alias: 1 model declares feedCount.

filter
type: Property
comment: Query alias: 1 model declares filter.

first name
type: Property
comment: Query alias: 1 model declares firstName.

flexible spec
type: Property
comment: Query alias: 1 model declares flexibleSpec.

float with margin
type: Property
comment: Query alias: 1 model declares floatWithMargin.

follows count
type: Property
comment: Query alias: 1 model declares followsCount.

font name
type: Property
comment: Query alias: 1 model declares fontName.

food styles
type: Property
comment: Query alias: 1 model declares foodStyles.

footer
type: Property
comment: Query alias: 1 model declares footer.

force single link
type: Property
comment: Query alias: 1 model declares forceSingleLink.

format option
type: Property
comment: Query alias: 1 model declares formatOption.

format transformation spec
type: Property
comment: Query alias: 1 model declares formatTransformationSpec.

founded
type: Property
comment: Query alias: 1 model declares founded.

frame auto show enroll status
type: Property
comment: Query alias: 1 model declares frameAutoShowEnrollStatus.

frame image hash
type: Property
comment: Query alias: 1 model declares frameImageHash.

frame source
type: Property
comment: Query alias: 1 model declares frameSource.

freeform genre
type: Property
comment: Query alias: 1 model declares freeformGenre.

frequency
type: Property
comment: Query alias: 1 model declares frequency.

frequency control specs
type: Property
comment: Query alias: 1 model declares frequencyControlSpecs.

friends
type: Property
comment: Query alias: 1 model declares friends.

full funnel exploration mode
type: Property
comment: Query alias: 1 model declares fullFunnelExplorationMode.

full funnel objective
type: Property
comment: Query alias: 1 model declares fullFunnelObjective.

full view impressions
type: Property
comment: Query alias: 1 model declares fullViewImpressions.

full view reach
type: Property
comment: Query alias: 1 model declares fullViewReach.

funding source
type: Property
comment: Query alias: 1 model declares fundingSource.

funding source details
type: Property
comment: Query alias: 1 model declares fundingSourceDetails.

fundraiser campaign id
type: Property
comment: Query alias: 1 model declares fundraiserCampaignId.

gender
type: Property
comment: Query alias: 1 model declares gender.

genders
type: Property
comment: Query alias: 1 model declares genders.

gender targeting
type: Property
comment: Query alias: 1 model declares genderTargeting.

general info
type: Property
comment: Query alias: 1 model declares generalInfo.

general manager
type: Property
comment: Query alias: 1 model declares generalManager.

generate cta
type: Property
comment: Query alias: 1 model declares generateCta.

generation
type: Property
comment: Query alias: 2 models declare generation.

genre
type: Property
comment: Query alias: 1 model declares genre.

geo locations
type: Property
comment: Query alias: 2 models declare geoLocations.

geo markets
type: Property
comment: Query alias: 1 model declares geoMarkets.

geo targeting type
type: Property
comment: Query alias: 1 model declares geoTargetingType.

global
type: Property
comment: Query alias: 1 model declares global.

global brand page name
type: Property
comment: Query alias: 1 model declares globalBrandPageName.

global brand root id
type: Property
comment: Query alias: 1 model declares globalBrandRootId.

global io max campaign duration
type: Property
comment: Query alias: 1 model declares globalIoMaxCampaignDuration.

greeting
type: Property
comment: Query alias: 1 model declares greeting.

grid
type: Property
comment: Query alias: 1 model declares grid.

guest list enabled
type: Property
comment: Query alias: 1 model declares guestListEnabled.

has added app
type: Property
comment: Query alias: 1 model declares hasAddedApp.

has create ads access
type: Property
comment: Query alias: 1 model declares hasCreateAdsAccess.

hash
type: Property
comment: Query alias: 1 model declares hash.

has lead access
type: Property
comment: Query alias: 1 model declares hasLeadAccess.

has migrated permissions
type: Property
comment: Query alias: 1 model declares hasMigratedPermissions.

has mobile app
type: Property
comment: Query alias: 1 model declares hasMobileApp.

has page authorized adaccount
type: Property
comment: Query alias: 1 model declares hasPageAuthorizedAdaccount.

has permission
type: Property
comment: Query alias: 1 model declares hasPermission.

has poll
type: Property
comment: Query alias: 1 model declares hasPoll.

has profile pic
type: Property
comment: Query alias: 1 model declares hasProfilePic.

has secondary skadnetwork reporting
type: Property
comment: Query alias: 1 model declares hasSecondarySkadnetworkReporting.

has slider
type: Property
comment: Query alias: 1 model declares hasSlider.

has transitioned to new page experience
type: Property
comment: Query alias: 1 model declares hasTransitionedToNewPageExperience.

has whatsapp business number
type: Property
comment: Query alias: 1 model declares hasWhatsappBusinessNumber.

has whatsapp number
type: Property
comment: Query alias: 1 model declares hasWhatsappNumber.

has written mandate from advertiser
type: Property
comment: Query alias: 1 model declares hasWrittenMandateFromAdvertiser.

height
type: Property
comment: Query alias: 1 model declares height.

hidden
type: Property
comment: Query alias: 1 model declares hidden.

hide price
type: Property
comment: Query alias: 1 model declares hidePrice.

home ownership
type: Property
comment: Query alias: 2 models declare homeOwnership.

home type
type: Property
comment: Query alias: 2 models declare homeType.

home value
type: Property
comment: Query alias: 2 models declare homeValue.

hop v2
type: Property
comment: Query alias: 1 model declares hopV2.

hours
type: Property
comment: Query alias: 1 model declares hours.

household composition
type: Property
comment: Query alias: 2 models declare householdComposition.

hyperlink formatting
type: Property
comment: Query alias: 1 model declares hyperlinkFormatting.

icon
type: Property
comment: Query alias: 2 models declare icon.

id
type: Property
comment: Query alias: 54 models declare id.

identity type
type: Property
comment: Query alias: 1 model declares identityType.

ig asset id
type: Property
comment: Query alias: 1 model declares igAssetId.

ig comment moderation filter
type: Property
comment: Query alias: 1 model declares igCommentModerationFilter.

ig feed tag
type: Property
comment: Query alias: 1 model declares igFeedTag.

ig feed tag name
type: Property
comment: Query alias: 1 model declares igFeedTagName.

ig glados feed
type: Property
comment: Query alias: 1 model declares igGladosFeed.

ig media id
type: Property
comment: Query alias: 1 model declares igMediaId.

ig multi app
type: Property
comment: Query alias: 1 model declares igMultiApp.

ig reels tag
type: Property
comment: Query alias: 1 model declares igReelsTag.

ig reels tag name
type: Property
comment: Query alias: 1 model declares igReelsTagName.

ig sales channel
type: Property
comment: Query alias: 1 model declares igSalesChannel.

ig stream tag
type: Property
comment: Query alias: 1 model declares igStreamTag.

ig stream tag name
type: Property
comment: Query alias: 1 model declares igStreamTagName.

ig user id
type: Property
comment: Query alias: 1 model declares igUserId.

ig video native subtitle
type: Property
comment: Query alias: 1 model declares igVideoNativeSubtitle.

image animation
type: Property
comment: Query alias: 1 model declares imageAnimation.

image auto crop
type: Property
comment: Query alias: 1 model declares imageAutoCrop.

image background gen
type: Property
comment: Query alias: 1 model declares imageBackgroundGen.

image banner
type: Property
comment: Query alias: 1 model declares imageBanner.

image brightness and contrast
type: Property
comment: Query alias: 1 model declares imageBrightnessAndContrast.

image crops
type: Property
comment: Query alias: 4 models declare imageCrops.

image crop style
type: Property
comment: Query alias: 1 model declares imageCropStyle.

image end card
type: Property
comment: Query alias: 1 model declares imageEndCard.

image enhancement
type: Property
comment: Query alias: 1 model declares imageEnhancement.

image hash
type: Property
comment: Query alias: 7 models declare imageHash.

image label
type: Property
comment: Query alias: 3 models declare imageLabel.

image layer specs
type: Property
comment: Query alias: 1 model declares imageLayerSpecs.

image overlay spec
type: Property
comment: Query alias: 1 model declares imageOverlaySpec.

image source
type: Property
comment: Query alias: 1 model declares imageSource.

image templates
type: Property
comment: Query alias: 1 model declares imageTemplates.

image text translation
type: Property
comment: Query alias: 1 model declares imageTextTranslation.

image touchups
type: Property
comment: Query alias: 1 model declares imageTouchups.

image transformation types
type: Property
comment: Query alias: 1 model declares imageTransformationTypes.

image uncrop
type: Property
comment: Query alias: 1 model declares imageUncrop.

image url
type: Property
comment: Query alias: 2 models declare imageUrl.

importance
type: Property
comment: Query alias: 1 model declares importance.

impression count
type: Property
comment: Query alias: 1 model declares impressionCount.

impressions
type: Property
comment: Query alias: 1 model declares impressions.

impressum
type: Property
comment: Query alias: 1 model declares impressum.

included countries
type: Property
comment: Query alias: 1 model declares includedCountries.

inclusions
type: Property
comment: Query alias: 1 model declares inclusions.

income
type: Property
comment: Query alias: 2 models declare income.

in conflict
type: Property
comment: Query alias: 2 models declare inConflict.

independent work
type: Property
comment: Query alias: 1 model declares independentWork.

india finserv
type: Property
comment: Query alias: 1 model declares indiaFinserv.

india finserv beneficiary
type: Property
comment: Query alias: 1 model declares indiaFinservBeneficiary.

india finserv payer
type: Property
comment: Query alias: 1 model declares indiaFinservPayer.

individual setting
type: Property
comment: Query alias: 1 model declares individualSetting.

industries
type: Property
comment: Query alias: 2 models declare industries.

influences
type: Property
comment: Query alias: 1 model declares influences.

inline comment
type: Property
comment: Query alias: 1 model declares inlineComment.

inline link click ctr
type: Property
comment: Query alias: 1 model declares inlineLinkClickCtr.

inline link clicks
type: Property
comment: Query alias: 1 model declares inlineLinkClicks.

inline post engagement
type: Property
comment: Query alias: 1 model declares inlinePostEngagement.

inspirational people
type: Property
comment: Query alias: 1 model declares inspirationalPeople.

instagram actor id
type: Property
comment: Query alias: 1 model declares instagramActorId.

instagram boost post access token
type: Property
comment: Query alias: 1 model declares instagramBoostPostAccessToken.

instagram branded content
type: Property
comment: Query alias: 1 model declares instagramBrandedContent.

instagram business account
type: Property
comment: Query alias: 1 model declares instagramBusinessAccount.

instagram channel
type: Property
comment: Query alias: 1 model declares instagramChannel.

instagram permalink url
type: Property
comment: Query alias: 1 model declares instagramPermalinkUrl.

instagram positions
type: Property
comment: Query alias: 4 models declare instagramPositions.

instagram profile visits
type: Property
comment: Query alias: 1 model declares instagramProfileVisits.

instagram shop
type: Property
comment: Query alias: 1 model declares instagramShop.

instagram upcoming event reminders set
type: Property
comment: Query alias: 1 model declares instagramUpcomingEventRemindersSet.

instagram user id
type: Property
comment: Query alias: 3 models declare instagramUserId.

install
type: Property
comment: Query alias: 1 model declares install.

installed
type: Property
comment: Query alias: 1 model declares installed.

install state application
type: Property
comment: Query alias: 1 model declares installStateApplication.

install type
type: Property
comment: Query alias: 1 model declares installType.

instant experience clicks to open
type: Property
comment: Query alias: 1 model declares instantExperienceClicksToOpen.

instant experience clicks to start
type: Property
comment: Query alias: 1 model declares instantExperienceClicksToStart.

instant experience outbound clicks
type: Property
comment: Query alias: 1 model declares instantExperienceOutboundClicks.

instream video skippable excluded
type: Property
comment: Query alias: 1 model declares instreamVideoSkippableExcluded.

integrity review status
type: Property
comment: Query alias: 1 model declares integrityReviewStatus.

intent
type: Property
comment: Query alias: 1 model declares intent.

interactive components spec
type: Property
comment: Query alias: 1 model declares interactiveComponentsSpec.

interactive component sticker id
type: Property
comment: Query alias: 2 models declare interactiveComponentStickerId.

interactive component sticker response
type: Property
comment: Query alias: 2 models declare interactiveComponentStickerResponse.

interactive component tap
type: Property
comment: Query alias: 1 model declares interactiveComponentTap.

interested count
type: Property
comment: Query alias: 1 model declares interestedCount.

interested in
type: Property
comment: Query alias: 2 models declare interestedIn.

interests
type: Property
comment: Query alias: 2 models declare interests.

interval days
type: Property
comment: Query alias: 1 model declares intervalDays.

io number
type: Property
comment: Query alias: 1 model declares ioNumber.

ios url
type: Property
comment: Query alias: 3 models declare iosUrl.

is access revoked
type: Property
comment: Query alias: 1 model declares isAccessRevoked.

is adset budget sharing enabled
type: Property
comment: Query alias: 1 model declares isAdsetBudgetSharingEnabled.

is ai generated
type: Property
comment: Query alias: 1 model declares isAiGenerated.

is all trending
type: Property
comment: Query alias: 1 model declares isAllTrending.

is always open
type: Property
comment: Query alias: 1 model declares isAlwaysOpen.

is attribution spec system default
type: Property
comment: Query alias: 1 model declares isAttributionSpecSystemDefault.

is automated experience
type: Property
comment: Query alias: 1 model declares isAutomatedExperience.

is ba skip delayed eligible
type: Property
comment: Query alias: 2 models declare isBaSkipDelayedEligible.

is budget schedule enabled
type: Property
comment: Query alias: 2 models declare isBudgetScheduleEnabled.

is callable
type: Property
comment: Query alias: 1 model declares isCallable.

is callable webrtc
type: Property
comment: Query alias: 1 model declares isCallableWebrtc.

is calling eligible
type: Property
comment: Query alias: 1 model declares isCallingEligible.

is canceled
type: Property
comment: Query alias: 1 model declares isCanceled.

is catalog segment
type: Property
comment: Query alias: 1 model declares isCatalogSegment.

is chain
type: Property
comment: Query alias: 1 model declares isChain.

is click to message
type: Property
comment: Query alias: 1 model declares isClickToMessage.

is client paying invoices
type: Property
comment: Query alias: 1 model declares isClientPayingInvoices.

is comment enabled
type: Property
comment: Query alias: 1 model declares isCommentEnabled.

is community page
type: Property
comment: Query alias: 1 model declares isCommunityPage.

is crossposting eligible
type: Property
comment: Query alias: 1 model declares isCrosspostingEligible.

is crosspost video
type: Property
comment: Query alias: 1 model declares isCrosspostVideo.

is default
type: Property
comment: Query alias: 1 model declares isDefault.

is defaulting eligible
type: Property
comment: Query alias: 1 model declares isDefaultingEligible.

is direct deals enabled
type: Property
comment: Query alias: 1 model declares isDirectDealsEnabled.

is direct send campaign
type: Property
comment: Query alias: 1 model declares isDirectSendCampaign.

is draft
type: Property
comment: Query alias: 1 model declares isDraft.

is dynamic creative
type: Property
comment: Query alias: 1 model declares isDynamicCreative.

is eligible
type: Property
comment: Query alias: 1 model declares isEligible.

is eligible for branded content
type: Property
comment: Query alias: 1 model declares isEligibleForBrandedContent.

is eligible for disable connect ig btn for non page admin am web
type: Property
comment: Query alias: 1 model declares isEligibleForDisableConnectIgBtnForNonPageAdminAmWeb.

is episode
type: Property
comment: Query alias: 1 model declares isEpisode.

is guest user
type: Property
comment: Query alias: 1 model declares isGuestUser.

is hidden
type: Property
comment: Query alias: 1 model declares isHidden.

is in3ds authorization enabled market
type: Property
comment: Query alias: 1 model declares isIn3dsAuthorizationEnabledMarket.

is incremental attribution enabled
type: Property
comment: Query alias: 1 model declares isIncrementalAttributionEnabled.

is in migration
type: Property
comment: Query alias: 1 model declares isInMigration.

is instagram eligible
type: Property
comment: Query alias: 1 model declares isInstagramEligible.

is local catalog
type: Property
comment: Query alias: 1 model declares isLocalCatalog.

is local expansion
type: Property
comment: Query alias: 1 model declares isLocalExpansion.

is mca internal
type: Property
comment: Query alias: 1 model declares isMcaInternal.

is message campaign
type: Property
comment: Query alias: 1 model declares isMessageCampaign.

is messenger bot get started enabled
type: Property
comment: Query alias: 1 model declares isMessengerBotGetStartedEnabled.

is messenger platform bot
type: Property
comment: Query alias: 1 model declares isMessengerPlatformBot.

is notifications enabled
type: Property
comment: Query alias: 1 model declares isNotificationsEnabled.

is one to one cbo budget
type: Property
comment: Query alias: 1 model declares isOneToOneCboBudget.

is online
type: Property
comment: Query alias: 1 model declares isOnline.

is optimized text
type: Property
comment: Query alias: 1 model declares isOptimizedText.

is owned
type: Property
comment: Query alias: 1 model declares isOwned.

is page admin
type: Property
comment: Query alias: 1 model declares isPageAdmin.

is page owned
type: Property
comment: Query alias: 1 model declares isPageOwned.

is permanently closed
type: Property
comment: Query alias: 1 model declares isPermanentlyClosed.

is personal
type: Property
comment: Query alias: 1 model declares isPersonal.

is prepay account
type: Property
comment: Query alias: 1 model declares isPrepayAccount.

is published
type: Property
comment: Query alias: 2 models declare isPublished.

is pushable
type: Property
comment: Query alias: 1 model declares isPushable.

isrc
type: Property
comment: Query alias: 2 models declare isrc.

is reference only
type: Property
comment: Query alias: 1 model declares isReferenceOnly.

is shared to feed
type: Property
comment: Query alias: 1 model declares isSharedToFeed.

is silhouette
type: Property
comment: Query alias: 1 model declares isSilhouette.

is site link sticky
type: Property
comment: Query alias: 1 model declares isSiteLinkSticky.

is skadnetwork attribution
type: Property
comment: Query alias: 1 model declares isSkadnetworkAttribution.

is special budget alloc
type: Property
comment: Query alias: 1 model declares isSpecialBudgetAlloc.

is tax id required
type: Property
comment: Query alias: 1 model declares isTaxIdRequired.

is test
type: Property
comment: Query alias: 1 model declares isTest.

is unclaimed
type: Property
comment: Query alias: 1 model declares isUnclaimed.

is verified
type: Property
comment: Query alias: 1 model declares isVerified.

iswc
type: Property
comment: Query alias: 1 model declares iswc.

is webhooks subscribed
type: Property
comment: Query alias: 1 model declares isWebhooksSubscribed.

is whatsapp destination ad
type: Property
comment: Query alias: 1 model declares isWhatsappDestinationAd.

is work account
type: Property
comment: Query alias: 1 model declares isWorkAccount.

job listing id
type: Property
comment: Query alias: 1 model declares jobListingId.

job search
type: Property
comment: Query alias: 1 model declares jobSearch.

kids
type: Property
comment: Query alias: 1 model declares kids.

korea ftc listing
type: Property
comment: Query alias: 1 model declares koreaFtcListing.

l7attribution page view
type: Property
comment: Query alias: 1 model declares l7AttributionPageView.

l7attribution page view delta
type: Property
comment: Query alias: 1 model declares l7AttributionPageViewDelta.

l7attribution video view
type: Property
comment: Query alias: 1 model declares l7AttributionVideoView.

l7attribution video view delta
type: Property
comment: Query alias: 1 model declares l7AttributionVideoViewDelta.

label
type: Property
comment: Query alias: 1 model declares label.

labels
type: Property
comment: Query alias: 1 model declares labels.

landing page view actions per link click
type: Property
comment: Query alias: 1 model declares landingPageViewActionsPerLinkClick.

landing page view per link click
type: Property
comment: Query alias: 1 model declares landingPageViewPerLinkClick.

landing page view per purchase rate
type: Property
comment: Query alias: 1 model declares landingPageViewPerPurchaseRate.

land on whatsapp catalog
type: Property
comment: Query alias: 1 model declares landOnWhatsappCatalog.

land on whatsapp profile
type: Property
comment: Query alias: 1 model declares landOnWhatsappProfile.

language
type: Property
comment: Query alias: 1 model declares language.

languages
type: Property
comment: Query alias: 1 model declares languages.

large geo areas
type: Property
comment: Query alias: 1 model declares largeGeoAreas.

last budget toggling time
type: Property
comment: Query alias: 1 model declares lastBudgetTogglingTime.

last name
type: Property
comment: Query alias: 1 model declares lastName.

last sig edit ts
type: Property
comment: Query alias: 1 model declares lastSigEditTs.

last updated by app id
type: Property
comment: Query alias: 1 model declares lastUpdatedByAppId.

latest metadata
type: Property
comment: Query alias: 1 model declares latestMetadata.

latitude
type: Property
comment: Query alias: 4 models declare latitude.

layer type
type: Property
comment: Query alias: 1 model declares layerType.

lead ads custom event str
type: Property
comment: Query alias: 1 model declares leadAdsCustomEventStr.

lead ads custom event type
type: Property
comment: Query alias: 1 model declares leadAdsCustomEventType.

lead ads follow up event
type: Property
comment: Query alias: 1 model declares leadAdsFollowUpEvent.

lead ads form event source type
type: Property
comment: Query alias: 1 model declares leadAdsFormEventSourceType.

lead ads offsite conversion type
type: Property
comment: Query alias: 1 model declares leadAdsOffsiteConversionType.

lead ads quality volume setting
type: Property
comment: Query alias: 1 model declares leadAdsQualityVolumeSetting.

lead ads selected pixel id
type: Property
comment: Query alias: 1 model declares leadAdsSelectedPixelId.

leadgen
type: Property
comment: Query alias: 1 model declares leadgen.

lead gen form id
type: Property
comment: Query alias: 1 model declares leadGenFormId.

lead gen honeypot
type: Property
comment: Query alias: 1 model declares leadGenHoneypot.

leadgen tos acceptance time
type: Property
comment: Query alias: 1 model declares leadgenTosAcceptanceTime.

leadgen tos accepted
type: Property
comment: Query alias: 1 model declares leadgenTosAccepted.

leadgen tos accepting user
type: Property
comment: Query alias: 1 model declares leadgenTosAcceptingUser.

learning stage info
type: Property
comment: Query alias: 1 model declares learningStageInfo.

left
type: Property
comment: Query alias: 1 model declares left.

legacy instagram comment id
type: Property
comment: Query alias: 1 model declares legacyInstagramCommentId.

legacy instagram media id
type: Property
comment: Query alias: 1 model declares legacyInstagramMediaId.

legacy instagram user id
type: Property
comment: Query alias: 1 model declares legacyInstagramUserId.

legal entity name
type: Property
comment: Query alias: 1 model declares legalEntityName.

level
type: Property
comment: Query alias: 2 models declare level.

liability type
type: Property
comment: Query alias: 1 model declares liabilityType.

liable address
type: Property
comment: Query alias: 3 models declare liableAddress.

liable biz name
type: Property
comment: Query alias: 1 model declares liableBizName.

life events
type: Property
comment: Query alias: 2 models declare lifeEvents.

lifetime budget
type: Property
comment: Query alias: 2 models declare lifetimeBudget.

lifetime imps
type: Property
comment: Query alias: 1 model declares lifetimeImps.

lifetime min spend target
type: Property
comment: Query alias: 1 model declares lifetimeMinSpendTarget.

lifetime spend cap
type: Property
comment: Query alias: 1 model declares lifetimeSpendCap.

like count
type: Property
comment: Query alias: 3 models declare likeCount.

line numbers
type: Property
comment: Query alias: 1 model declares lineNumbers.

link
type: Property
comment: Query alias: 11 models declare link.

link caption
type: Property
comment: Query alias: 1 model declares linkCaption.

link clicks per results
type: Property
comment: Query alias: 1 model declares linkClicksPerResults.

link data
type: Property
comment: Query alias: 1 model declares linkData.

link deep link url
type: Property
comment: Query alias: 1 model declares linkDeepLinkUrl.

link description
type: Property
comment: Query alias: 1 model declares linkDescription.

link destination display url
type: Property
comment: Query alias: 1 model declares linkDestinationDisplayUrl.

link format
type: Property
comment: Query alias: 1 model declares linkFormat.

link og id
type: Property
comment: Query alias: 1 model declares linkOgId.

link url
type: Property
comment: Query alias: 1 model declares linkUrl.

link url label
type: Property
comment: Query alias: 3 models declare linkUrlLabel.

link urls
type: Property
comment: Query alias: 1 model declares linkUrls.

live audience count
type: Property
comment: Query alias: 1 model declares liveAudienceCount.

live metadata
type: Property
comment: Query alias: 1 model declares liveMetadata.

live status
type: Property
comment: Query alias: 1 model declares liveStatus.

live video destination
type: Property
comment: Query alias: 1 model declares liveVideoDestination.

locale
type: Property
comment: Query alias: 1 model declares locale.

locales
type: Property
comment: Query alias: 2 models declare locales.

local news megaphone dismiss status
type: Property
comment: Query alias: 1 model declares localNewsMegaphoneDismissStatus.

local news subscription status
type: Property
comment: Query alias: 1 model declares localNewsSubscriptionStatus.

local store extension
type: Property
comment: Query alias: 1 model declares localStoreExtension.

located in
type: Property
comment: Query alias: 1 model declares locatedIn.

location cluster ids
type: Property
comment: Query alias: 1 model declares locationClusterIds.

location source id
type: Property
comment: Query alias: 1 model declares locationSourceId.

location types
type: Property
comment: Query alias: 2 models declare locationTypes.

longitude
type: Property
comment: Query alias: 4 models declare longitude.

lookalike
type: Property
comment: Query alias: 1 model declares lookalike.

lot
type: Property
comment: Query alias: 1 model declares lot.

lunch
type: Property
comment: Query alias: 1 model declares lunch.

marketing message buttons
type: Property
comment: Query alias: 1 model declares marketingMessageButtons.

marketing messages click rate benchmark
type: Property
comment: Query alias: 1 model declares marketingMessagesClickRateBenchmark.

marketing messages cost per delivered
type: Property
comment: Query alias: 1 model declares marketingMessagesCostPerDelivered.

marketing messages cost per link btn click
type: Property
comment: Query alias: 1 model declares marketingMessagesCostPerLinkBtnClick.

marketing messages delivered
type: Property
comment: Query alias: 1 model declares marketingMessagesDelivered.

marketing messages delivery rate
type: Property
comment: Query alias: 1 model declares marketingMessagesDeliveryRate.

marketing messages link btn click
type: Property
comment: Query alias: 1 model declares marketingMessagesLinkBtnClick.

marketing messages link btn click rate
type: Property
comment: Query alias: 1 model declares marketingMessagesLinkBtnClickRate.

marketing messages media view rate
type: Property
comment: Query alias: 1 model declares marketingMessagesMediaViewRate.

marketing messages onboarding status
type: Property
comment: Query alias: 1 model declares marketingMessagesOnboardingStatus.

marketing messages phone call btn click rate
type: Property
comment: Query alias: 1 model declares marketingMessagesPhoneCallBtnClickRate.

marketing messages quick reply btn click
type: Property
comment: Query alias: 1 model declares marketingMessagesQuickReplyBtnClick.

marketing messages quick reply btn click rate
type: Property
comment: Query alias: 1 model declares marketingMessagesQuickReplyBtnClickRate.

marketing messages read
type: Property
comment: Query alias: 1 model declares marketingMessagesRead.

marketing messages read rate
type: Property
comment: Query alias: 1 model declares marketingMessagesReadRate.

marketing messages read rate benchmark
type: Property
comment: Query alias: 1 model declares marketingMessagesReadRateBenchmark.

marketing messages sent
type: Property
comment: Query alias: 1 model declares marketingMessagesSent.

marketing messages settings
type: Property
comment: Query alias: 1 model declares marketingMessagesSettings.

marketing messages spend
type: Property
comment: Query alias: 1 model declares marketingMessagesSpend.

marketing messages spend currency
type: Property
comment: Query alias: 1 model declares marketingMessagesSpendCurrency.

marketing message structured spec
type: Property
comment: Query alias: 1 model declares marketingMessageStructuredSpec.

marketing messages website add to cart
type: Property
comment: Query alias: 1 model declares marketingMessagesWebsiteAddToCart.

marketing messages website initiate checkout
type: Property
comment: Query alias: 1 model declares marketingMessagesWebsiteInitiateCheckout.

marketing messages website purchase
type: Property
comment: Query alias: 1 model declares marketingMessagesWebsitePurchase.

marketing messages website purchase values
type: Property
comment: Query alias: 1 model declares marketingMessagesWebsitePurchaseValues.

marketplace
type: Property
comment: Query alias: 1 model declares marketplace.

marketplace home rentals
type: Property
comment: Query alias: 1 model declares marketplaceHomeRentals.

marketplace home sales
type: Property
comment: Query alias: 1 model declares marketplaceHomeSales.

marketplace motors
type: Property
comment: Query alias: 1 model declares marketplaceMotors.

marketplace shops
type: Property
comment: Query alias: 1 model declares marketplaceShops.

market type
type: Property
comment: Query alias: 1 model declares marketType.

mastercard
type: Property
comment: Query alias: 1 model declares mastercard.

matches found
type: Property
comment: Query alias: 2 models declare matchesFound.

match rule
type: Property
comment: Query alias: 1 model declares matchRule.

max
type: Property
comment: Query alias: 1 model declares max.

max balance
type: Property
comment: Query alias: 2 models declare maxBalance.

max budget spend percentage
type: Property
comment: Query alias: 1 model declares maxBudgetSpendPercentage.

max campaign duration
type: Property
comment: Query alias: 1 model declares maxCampaignDuration.

max days to finish
type: Property
comment: Query alias: 1 model declares maxDaysToFinish.

max frequency
type: Property
comment: Query alias: 1 model declares maxFrequency.

max pause without prediction rerun
type: Property
comment: Query alias: 1 model declares maxPauseWithoutPredictionRerun.

max population
type: Property
comment: Query alias: 1 model declares maxPopulation.

max review placements
type: Property
comment: Query alias: 1 model declares maxReviewPlacements.

maybe count
type: Property
comment: Query alias: 1 model declares maybeCount.

mcme conversion id
type: Property
comment: Query alias: 1 model declares mcmeConversionId.

measurement contact
type: Property
comment: Query alias: 1 model declares measurementContact.

media
type: Property
comment: Query alias: 1 model declares media.

media agency
type: Property
comment: Query alias: 1 model declares mediaAgency.

media audio type
type: Property
comment: Query alias: 1 model declares mediaAudioType.

media count
type: Property
comment: Query alias: 1 model declares mediaCount.

media liquidity animated image
type: Property
comment: Query alias: 1 model declares mediaLiquidityAnimatedImage.

media order
type: Property
comment: Query alias: 1 model declares mediaOrder.

media product type
type: Property
comment: Query alias: 2 models declare mediaProductType.

media sourcing spec
type: Property
comment: Query alias: 1 model declares mediaSourcingSpec.

media type
type: Property
comment: Query alias: 3 models declare mediaType.

media type automation
type: Property
comment: Query alias: 1 model declares mediaTypeAutomation.

media url
type: Property
comment: Query alias: 2 models declare mediaUrl.

medium geo areas
type: Property
comment: Query alias: 1 model declares mediumGeoAreas.

meeting for
type: Property
comment: Query alias: 1 model declares meetingFor.

member count
type: Property
comment: Query alias: 1 model declares memberCount.

member request count
type: Property
comment: Query alias: 1 model declares memberRequestCount.

members
type: Property
comment: Query alias: 1 model declares members.

mentioned comment
type: Property
comment: Query alias: 1 model declares mentionedComment.

mentioned media
type: Property
comment: Query alias: 1 model declares mentionedMedia.

merchant id
type: Property
comment: Query alias: 1 model declares merchantId.

merchant page
type: Property
comment: Query alias: 1 model declares merchantPage.

merchant review status
type: Property
comment: Query alias: 1 model declares merchantReviewStatus.

merchant status
type: Property
comment: Query alias: 1 model declares merchantStatus.

message
type: Property
comment: Query alias: 7 models declare message.

message extensions
type: Property
comment: Query alias: 1 model declares messageExtensions.

messaging customer base for whatsapp
type: Property
comment: Query alias: 1 model declares messagingCustomerBaseForWhatsapp.

messaging feature status
type: Property
comment: Query alias: 1 model declares messagingFeatureStatus.

messenger ads default icebreakers
type: Property
comment: Query alias: 1 model declares messengerAdsDefaultIcebreakers.

messenger ads default quick replies
type: Property
comment: Query alias: 1 model declares messengerAdsDefaultQuickReplies.

messenger ads quick replies type
type: Property
comment: Query alias: 1 model declares messengerAdsQuickRepliesType.

messenger positions
type: Property
comment: Query alias: 4 models declare messengerPositions.

messenger sponsored message
type: Property
comment: Query alias: 1 model declares messengerSponsoredMessage.

messenger subscriber pool
type: Property
comment: Query alias: 1 model declares messengerSubscriberPool.

messenger subscriber source
type: Property
comment: Query alias: 1 model declares messengerSubscriberSource.

metadata
type: Property
comment: Query alias: 1 model declares metadata.

metrics ending date
type: Property
comment: Query alias: 1 model declares metricsEndingDate.

metro areas
type: Property
comment: Query alias: 1 model declares metroAreas.

mid
type: Property
comment: Query alias: 2 models declare mid.

middle name
type: Property
comment: Query alias: 1 model declares middleName.

min
type: Property
comment: Query alias: 1 model declares min.

min budget spend percentage
type: Property
comment: Query alias: 1 model declares minBudgetSpendPercentage.

min campaign duration
type: Property
comment: Query alias: 1 model declares minCampaignDuration.

min campaign group spend cap
type: Property
comment: Query alias: 1 model declares minCampaignGroupSpendCap.

min daily budget
type: Property
comment: Query alias: 1 model declares minDailyBudget.

mini shop storefront
type: Property
comment: Query alias: 2 models declare miniShopStorefront.

min population
type: Property
comment: Query alias: 1 model declares minPopulation.

min reach limits
type: Property
comment: Query alias: 1 model declares minReachLimits.

min retention seconds
type: Property
comment: Query alias: 1 model declares minRetentionSeconds.

mission
type: Property
comment: Query alias: 1 model declares mission.

mobile
type: Property
comment: Query alias: 1 model declares mobile.

mobile app purchase roas
type: Property
comment: Query alias: 1 model declares mobileAppPurchaseRoas.

moms
type: Property
comment: Query alias: 2 models declare moms.

monitoring status
type: Property
comment: Query alias: 1 model declares monitoringStatus.

monitoring type
type: Property
comment: Query alias: 1 model declares monitoringType.

mpg
type: Property
comment: Query alias: 1 model declares mpg.

msgr multi app
type: Property
comment: Query alias: 1 model declares msgrMultiApp.

multi creative post carousel
type: Property
comment: Query alias: 1 model declares multiCreativePostCarousel.

multi event conversion attribution setting
type: Property
comment: Query alias: 1 model declares multiEventConversionAttributionSetting.

multi event product
type: Property
comment: Query alias: 1 model declares multiEventProduct.

multi media transformation type
type: Property
comment: Query alias: 1 model declares multiMediaTransformationType.

multi optimization goal weight
type: Property
comment: Query alias: 1 model declares multiOptimizationGoalWeight.

multi photo to video
type: Property
comment: Query alias: 1 model declares multiPhotoToVideo.

multi share end card
type: Property
comment: Query alias: 3 models declare multiShareEndCard.

multi share optimized
type: Property
comment: Query alias: 2 models declare multiShareOptimized.

music generation
type: Property
comment: Query alias: 1 model declares musicGeneration.

music video copyright
type: Property
comment: Query alias: 1 model declares musicVideoCopyright.

name
type: Property
comment: Query alias: 40 models declare name.

name format
type: Property
comment: Query alias: 1 model declares nameFormat.

name with location descriptor
type: Property
comment: Query alias: 1 model declares nameWithLocationDescriptor.

native commerce experience
type: Property
comment: Query alias: 1 model declares nativeCommerceExperience.

ncs testimonial
type: Property
comment: Query alias: 1 model declares ncsTestimonial.

network
type: Property
comment: Query alias: 1 model declares network.

networks
type: Property
comment: Query alias: 1 model declares networks.

net worth
type: Property
comment: Query alias: 2 models declare netWorth.

new customer tag
type: Property
comment: Query alias: 1 model declares newCustomerTag.

new like count
type: Property
comment: Query alias: 1 model declares newLikeCount.

noreply count
type: Property
comment: Query alias: 1 model declares noreplyCount.

object
type: Property
comment: Query alias: 1 model declares object.

object domain
type: Property
comment: Query alias: 1 model declares objectDomain.

object id
type: Property
comment: Query alias: 1 model declares objectId.

objective
type: Property
comment: Query alias: 2 models declare objective.

objective result rate
type: Property
comment: Query alias: 1 model declares objectiveResultRate.

objective results
type: Property
comment: Query alias: 1 model declares objectiveResults.

object store url
type: Property
comment: Query alias: 2 models declare objectStoreUrl.

object store urls
type: Property
comment: Query alias: 3 models declare objectStoreUrls.

object story id
type: Property
comment: Query alias: 1 model declares objectStoryId.

object story spec
type: Property
comment: Query alias: 1 model declares objectStorySpec.

object type
type: Property
comment: Query alias: 1 model declares objectType.

object url
type: Property
comment: Query alias: 1 model declares objectUrl.

observation end time
type: Property
comment: Query alias: 1 model declares observationEndTime.

oculus positions
type: Property
comment: Query alias: 2 models declare oculusPositions.

offer creator
type: Property
comment: Query alias: 1 model declares offerCreator.

offer eligible
type: Property
comment: Query alias: 1 model declares offerEligible.

offer id
type: Property
comment: Query alias: 3 models declare offerId.

office type
type: Property
comment: Query alias: 2 models declare officeType.

offline conversion data set id
type: Property
comment: Query alias: 1 model declares offlineConversionDataSetId.

offsetted amount
type: Property
comment: Query alias: 1 model declares offsettedAmount.

offset x
type: Property
comment: Query alias: 2 models declare offsetX.

offset y
type: Property
comment: Query alias: 2 models declare offsetY.

offsite clo signal status
type: Property
comment: Query alias: 1 model declares offsiteCloSignalStatus.

offsite conversion event id
type: Property
comment: Query alias: 1 model declares offsiteConversionEventId.

offsite iab checkout enabled countries
type: Property
comment: Query alias: 1 model declares offsiteIabCheckoutEnabledCountries.

offsite pixel
type: Property
comment: Query alias: 1 model declares offsitePixel.

offsite pixels tos accepted
type: Property
comment: Query alias: 1 model declares offsitePixelsTosAccepted.

omnichannel link spec
type: Property
comment: Query alias: 1 model declares omnichannelLinkSpec.

omnichannel object
type: Property
comment: Query alias: 1 model declares omnichannelObject.

online event format
type: Property
comment: Query alias: 1 model declares onlineEventFormat.

online event third party url
type: Property
comment: Query alias: 1 model declares onlineEventThirdPartyUrl.

online max balance
type: Property
comment: Query alias: 1 model declares onlineMaxBalance.

onsite conversion messaging detected purchase deduped
type: Property
comment: Query alias: 1 model declares onsiteConversionMessagingDetectedPurchaseDeduped.

onsite destinations
type: Property
comment: Query alias: 1 model declares onsiteDestinations.

opacity
type: Property
comment: Query alias: 1 model declares opacity.

opportunity score
type: Property
comment: Query alias: 1 model declares opportunityScore.

optimization goal
type: Property
comment: Query alias: 2 models declare optimizationGoal.

optimization sub event
type: Property
comment: Query alias: 1 model declares optimizationSubEvent.

optimization type
type: Property
comment: Query alias: 1 model declares optimizationType.

ordering info
type: Property
comment: Query alias: 1 model declares orderingInfo.

origin
type: Property
comment: Query alias: 1 model declares origin.

original amount
type: Property
comment: Query alias: 1 model declares originalAmount.

original display amount
type: Property
comment: Query alias: 1 model declares originalDisplayAmount.

original release date
type: Property
comment: Query alias: 1 model declares originalReleaseDate.

origins
type: Property
comment: Query alias: 1 model declares origins.

outbound clicks
type: Property
comment: Query alias: 1 model declares outboundClicks.

outbound clicks ctr
type: Property
comment: Query alias: 1 model declares outboundClicksCtr.

outdoor
type: Property
comment: Query alias: 1 model declares outdoor.

overall rating
type: Property
comment: Query alias: 1 model declares overallRating.

overall star rating
type: Property
comment: Query alias: 1 model declares overallStarRating.

overlay position
type: Property
comment: Query alias: 1 model declares overlayPosition.

overlay shape
type: Property
comment: Query alias: 1 model declares overlayShape.

overlay template
type: Property
comment: Query alias: 1 model declares overlayTemplate.

owner business
type: Property
comment: Query alias: 5 models declare ownerBusiness.

owner business name
type: Property
comment: Query alias: 1 model declares ownerBusinessName.

owning business
type: Property
comment: Query alias: 1 model declares owningBusiness.

owning credential
type: Property
comment: Query alias: 1 model declares owningCredential.

pac genai recomposition
type: Property
comment: Query alias: 1 model declares pacGenaiRecomposition.

pacing type
type: Property
comment: Query alias: 2 models declare pacingType.

package
type: Property
comment: Query alias: 1 model declares package.

pac recomposition
type: Property
comment: Query alias: 1 model declares pacRecomposition.

pac relaxation
type: Property
comment: Query alias: 1 model declares pacRelaxation.

page admin
type: Property
comment: Query alias: 1 model declares pageAdmin.

page backed threads account id
type: Property
comment: Query alias: 1 model declares pageBackedThreadsAccountId.

page id
type: Property
comment: Query alias: 4 models declare pageId.

page parent
type: Property
comment: Query alias: 1 model declares pageParent.

pages count
type: Property
comment: Query alias: 1 model declares pagesCount.

page token
type: Property
comment: Query alias: 1 model declares pageToken.

page types
type: Property
comment: Query alias: 1 model declares pageTypes.

page welcome message
type: Property
comment: Query alias: 5 models declare pageWelcomeMessage.

parent
type: Property
comment: Query alias: 1 model declares parent.

parental warning type
type: Property
comment: Query alias: 1 model declares parentalWarningType.

parent group
type: Property
comment: Query alias: 1 model declares parentGroup.

parent id
type: Property
comment: Query alias: 1 model declares parentId.

parent page
type: Property
comment: Query alias: 2 models declare parentPage.

parent source facebook post id
type: Property
comment: Query alias: 1 model declares parentSourceFacebookPostId.

parent source instagram media id
type: Property
comment: Query alias: 1 model declares parentSourceInstagramMediaId.

parking
type: Property
comment: Query alias: 1 model declares parking.

partition from
type: Property
comment: Query alias: 1 model declares partitionFrom.

partition type
type: Property
comment: Query alias: 1 model declares partitionType.

partner
type: Property
comment: Query alias: 1 model declares partner.

partner app welcome message flow id
type: Property
comment: Query alias: 1 model declares partnerAppWelcomeMessageFlowId.

partners
type: Property
comment: Query alias: 1 model declares partners.

passback application id
type: Property
comment: Query alias: 1 model declares passbackApplicationId.

passback pixel id
type: Property
comment: Query alias: 1 model declares passbackPixelId.

payment account id
type: Property
comment: Query alias: 1 model declares paymentAccountId.

payment options
type: Property
comment: Query alias: 1 model declares paymentOptions.

payment pricepoints
type: Property
comment: Query alias: 1 model declares paymentPricepoints.

payment provider
type: Property
comment: Query alias: 1 model declares paymentProvider.

pca spec
type: Property
comment: Query alias: 1 model declares pcaSpec.

pe carousel
type: Property
comment: Query alias: 1 model declares peCarousel.

permalink
type: Property
comment: Query alias: 2 models declare permalink.

permalink url
type: Property
comment: Query alias: 1 model declares permalinkUrl.

permissions
type: Property
comment: Query alias: 1 model declares permissions.

personal info
type: Property
comment: Query alias: 1 model declares personalInfo.

personal interests
type: Property
comment: Query alias: 1 model declares personalInterests.

pharma safety info
type: Property
comment: Query alias: 1 model declares pharmaSafetyInfo.

phone
type: Property
comment: Query alias: 1 model declares phone.

phone data ids label
type: Property
comment: Query alias: 1 model declares phoneDataIdsLabel.

photo album source object story id
type: Property
comment: Query alias: 1 model declares photoAlbumSourceObjectStoryId.

photo data
type: Property
comment: Query alias: 1 model declares photoData.

pic
type: Property
comment: Query alias: 1 model declares pic.

pic crop
type: Property
comment: Query alias: 1 model declares picCrop.

pickup
type: Property
comment: Query alias: 1 model declares pickup.

pickup options
type: Property
comment: Query alias: 1 model declares pickupOptions.

pic large
type: Property
comment: Query alias: 1 model declares picLarge.

pic small
type: Property
comment: Query alias: 1 model declares picSmall.

pic square
type: Property
comment: Query alias: 1 model declares picSquare.

picture
type: Property
comment: Query alias: 3 models declare picture.

pixel aggregation rule
type: Property
comment: Query alias: 1 model declares pixelAggregationRule.

pixel id
type: Property
comment: Query alias: 1 model declares pixelId.

pixel rule
type: Property
comment: Query alias: 1 model declares pixelRule.

place
type: Property
comment: Query alias: 2 models declare place.

place data
type: Property
comment: Query alias: 1 model declares placeData.

placement
type: Property
comment: Query alias: 1 model declares placement.

placement soft opt out
type: Property
comment: Query alias: 1 model declares placementSoftOptOut.

placement specific
type: Property
comment: Query alias: 1 model declares placementSpecific.

place page name
type: Property
comment: Query alias: 1 model declares placePageName.

place page set
type: Property
comment: Query alias: 1 model declares placePageSet.

place page set id
type: Property
comment: Query alias: 2 models declare placePageSetId.

place page set ids
type: Property
comment: Query alias: 1 model declares placePageSetIds.

places
type: Property
comment: Query alias: 1 model declares places.

place type
type: Property
comment: Query alias: 1 model declares placeType.

platform customizations
type: Property
comment: Query alias: 1 model declares platformCustomizations.

playable asset id
type: Property
comment: Query alias: 1 model declares playableAssetId.

playable video uri
type: Property
comment: Query alias: 1 model declares playableVideoUri.

plot outline
type: Property
comment: Query alias: 1 model declares plotOutline.

political
type: Property
comment: Query alias: 1 model declares political.

political district
type: Property
comment: Query alias: 1 model declares politicalDistrict.

political districts
type: Property
comment: Query alias: 1 model declares politicalDistricts.

political views
type: Property
comment: Query alias: 1 model declares politicalViews.

politics
type: Property
comment: Query alias: 2 models declare politics.

portrait customizations
type: Property
comment: Query alias: 1 model declares portraitCustomizations.

position
type: Property
comment: Query alias: 1 model declares position.

post
type: Property
comment: Query alias: 2 models declare post.

postal code
type: Property
comment: Query alias: 2 models declare postalCode.

post click configuration
type: Property
comment: Query alias: 2 models declare postClickConfiguration.

post click item description
type: Property
comment: Query alias: 1 model declares postClickItemDescription.

post click item headline
type: Property
comment: Query alias: 1 model declares postClickItemHeadline.

post id
type: Property
comment: Query alias: 1 model declares postId.

post object
type: Property
comment: Query alias: 1 model declares postObject.

post object wall
type: Property
comment: Query alias: 1 model declares postObjectWall.

post views
type: Property
comment: Query alias: 1 model declares postViews.

post wall
type: Property
comment: Query alias: 1 model declares postWall.

preferred audience
type: Property
comment: Query alias: 1 model declares preferredAudience.

preferred events
type: Property
comment: Query alias: 1 model declares preferredEvents.

preferred image tags
type: Property
comment: Query alias: 1 model declares preferredImageTags.

preferred video tags
type: Property
comment: Query alias: 1 model declares preferredVideoTags.

premiere living room status
type: Property
comment: Query alias: 1 model declares premiereLivingRoomStatus.

press contact
type: Property
comment: Query alias: 1 model declares pressContact.

preview shareable link
type: Property
comment: Query alias: 1 model declares previewShareableLink.

price range
type: Property
comment: Query alias: 1 model declares priceRange.

primary attribution
type: Property
comment: Query alias: 1 model declares primaryAttribution.

primary city id
type: Property
comment: Query alias: 3 models declare primaryCityId.

primary page
type: Property
comment: Query alias: 1 model declares primaryPage.

priority hours
type: Property
comment: Query alias: 1 model declares priorityHours.

privacy info url
type: Property
comment: Query alias: 1 model declares privacyInfoUrl.

privacy policy localized
type: Property
comment: Query alias: 1 model declares privacyPolicyLocalized.

processing phase
type: Property
comment: Query alias: 1 model declares processingPhase.

processing progress
type: Property
comment: Query alias: 1 model declares processingProgress.

produced by
type: Property
comment: Query alias: 1 model declares producedBy.

product
type: Property
comment: Query alias: 1 model declares product.

product audience specs
type: Property
comment: Query alias: 1 model declares productAudienceSpecs.

product browsing
type: Property
comment: Query alias: 1 model declares productBrowsing.

product catalog
type: Property
comment: Query alias: 1 model declares productCatalog.

product catalog id
type: Property
comment: Query alias: 1 model declares productCatalogId.

product catalog proxy id
type: Property
comment: Query alias: 1 model declares productCatalogProxyId.

product data
type: Property
comment: Query alias: 2 models declare productData.

product extensions
type: Property
comment: Query alias: 1 model declares productExtensions.

product group retailer id
type: Property
comment: Query alias: 1 model declares productGroupRetailerId.

product id
type: Property
comment: Query alias: 1 model declares productId.

product item id
type: Property
comment: Query alias: 1 model declares productItemId.

product link
type: Property
comment: Query alias: 1 model declares productLink.

product media metadata spec
type: Property
comment: Query alias: 1 model declares productMediaMetadataSpec.

product metadata automation
type: Property
comment: Query alias: 1 model declares productMetadataAutomation.

product retailer id
type: Property
comment: Query alias: 1 model declares productRetailerId.

products
type: Property
comment: Query alias: 1 model declares products.

product sales channel
type: Property
comment: Query alias: 1 model declares productSalesChannel.

product service
type: Property
comment: Query alias: 1 model declares productService.

product set
type: Property
comment: Query alias: 1 model declares productSet.

product set id
type: Property
comment: Query alias: 3 models declare productSetId.

product set optimization
type: Property
comment: Query alias: 1 model declares productSetOptimization.

product set partner selection status
type: Property
comment: Query alias: 1 model declares productSetPartnerSelectionStatus.

product source
type: Property
comment: Query alias: 1 model declares productSource.

product suggestion settings
type: Property
comment: Query alias: 1 model declares productSuggestionSettings.

product tags
type: Property
comment: Query alias: 1 model declares productTags.

product views
type: Property
comment: Query alias: 1 model declares productViews.

profile
type: Property
comment: Query alias: 1 model declares profile.

profile card
type: Property
comment: Query alias: 1 model declares profileCard.

profile extension
type: Property
comment: Query alias: 1 model declares profileExtension.

profile pic
type: Property
comment: Query alias: 1 model declares profilePic.

profile picture uri
type: Property
comment: Query alias: 1 model declares profilePictureUri.

profile picture url
type: Property
comment: Query alias: 1 model declares profilePictureUrl.

profile type
type: Property
comment: Query alias: 1 model declares profileType.

promotable app ids
type: Property
comment: Query alias: 1 model declares promotableAppIds.

promotable page ids
type: Property
comment: Query alias: 1 model declares promotablePageIds.

promotable urls
type: Property
comment: Query alias: 1 model declares promotableUrls.

promoted object
type: Property
comment: Query alias: 2 models declare promotedObject.

promoted page id
type: Property
comment: Query alias: 1 model declares promotedPageId.

promoted product set result
type: Property
comment: Query alias: 2 models declare promotedProductSetResult.

promotional metadata
type: Property
comment: Query alias: 1 model declares promotionalMetadata.

promotion eligible
type: Property
comment: Query alias: 1 model declares promotionEligible.

promotion ineligible reason
type: Property
comment: Query alias: 1 model declares promotionIneligibleReason.

promotion metadata spec
type: Property
comment: Query alias: 1 model declares promotionMetadataSpec.

promotion source
type: Property
comment: Query alias: 1 model declares promotionSource.

promotion type
type: Property
comment: Query alias: 1 model declares promotionType.

promotion value
type: Property
comment: Query alias: 1 model declares promotionValue.

prospecting audience
type: Property
comment: Query alias: 1 model declares prospectingAudience.

public transit
type: Property
comment: Query alias: 1 model declares publicTransit.

published
type: Property
comment: Query alias: 1 model declares published.

published time
type: Property
comment: Query alias: 1 model declares publishedTime.

publisher platforms
type: Property
comment: Query alias: 3 models declare publisherPlatforms.

publishing phase
type: Property
comment: Query alias: 1 model declares publishingPhase.

publishing rights data
type: Property
comment: Query alias: 1 model declares publishingRightsData.

publish status
type: Property
comment: Query alias: 1 model declares publishStatus.

publish time
type: Property
comment: Query alias: 1 model declares publishTime.

purchase per landing page view
type: Property
comment: Query alias: 1 model declares purchasePerLandingPageView.

purchase roas
type: Property
comment: Query alias: 1 model declares purchaseRoas.

purchases per link click
type: Property
comment: Query alias: 1 model declares purchasesPerLinkClick.

purpose
type: Property
comment: Query alias: 1 model declares purpose.

push metadata ids
type: Property
comment: Query alias: 1 model declares pushMetadataIds.

qualifying question qualify answer rate
type: Property
comment: Query alias: 1 model declares qualifyingQuestionQualifyAnswerRate.

quality ranking
type: Property
comment: Query alias: 1 model declares qualityRanking.

question
type: Property
comment: Query alias: 1 model declares question.

question creator
type: Property
comment: Query alias: 1 model declares questionCreator.

questions
type: Property
comment: Query alias: 1 model declares questions.

quotes
type: Property
comment: Query alias: 1 model declares quotes.

rating count
type: Property
comment: Query alias: 1 model declares ratingCount.

reach
type: Property
comment: Query alias: 1 model declares reach.

reason description
type: Property
comment: Query alias: 2 models declare reasonDescription.

reasons to shop
type: Property
comment: Query alias: 1 model declares reasonsToShop.

receiving business
type: Property
comment: Query alias: 1 model declares receivingBusiness.

receiving credential
type: Property
comment: Query alias: 1 model declares receivingCredential.

receiving credit allocation config
type: Property
comment: Query alias: 2 models declare receivingCreditAllocationConfig.

recipient
type: Property
comment: Query alias: 1 model declares recipient.

recommendation data
type: Property
comment: Query alias: 1 model declares recommendationData.

recommendations
type: Property
comment: Query alias: 3 models declare recommendations.

recommended budget prediction
type: Property
comment: Query alias: 1 model declares recommendedBudgetPrediction.

recommender settings
type: Property
comment: Query alias: 1 model declares recommenderSettings.

recomposition type
type: Property
comment: Query alias: 1 model declares recompositionType.

record label
type: Property
comment: Query alias: 1 model declares recordLabel.

recurring budget semantics
type: Property
comment: Query alias: 1 model declares recurringBudgetSemantics.

referenced adgroup id
type: Property
comment: Query alias: 1 model declares referencedAdgroupId.

reference file
type: Property
comment: Query alias: 1 model declares referenceFile.

reference file disabled
type: Property
comment: Query alias: 1 model declares referenceFileDisabled.

reference file disabled by ops
type: Property
comment: Query alias: 1 model declares referenceFileDisabledByOps.

reference file status
type: Property
comment: Query alias: 1 model declares referenceFileStatus.

reference owner id
type: Property
comment: Query alias: 1 model declares referenceOwnerId.

region
type: Property
comment: Query alias: 4 models declare region.

regional regulated categories
type: Property
comment: Query alias: 1 model declares regionalRegulatedCategories.

regional regulation disclaimer spec
type: Property
comment: Query alias: 1 model declares regionalRegulationDisclaimerSpec.

regional regulation identities
type: Property
comment: Query alias: 1 model declares regionalRegulationIdentities.

registration label
type: Property
comment: Query alias: 1 model declares registrationLabel.

registration number
type: Property
comment: Query alias: 1 model declares registrationNumber.

registration setting
type: Property
comment: Query alias: 1 model declares registrationSetting.

related media
type: Property
comment: Query alias: 1 model declares relatedMedia.

relationship status
type: Property
comment: Query alias: 1 model declares relationshipStatus.

relationship statuses
type: Property
comment: Query alias: 2 models declare relationshipStatuses.

release date
type: Property
comment: Query alias: 1 model declares releaseDate.

religion
type: Property
comment: Query alias: 1 model declares religion.

replace audio status
type: Property
comment: Query alias: 1 model declares replaceAudioStatus.

replace media text
type: Property
comment: Query alias: 1 model declares replaceMediaText.

reposts count
type: Property
comment: Query alias: 2 models declare repostsCount.

request status
type: Property
comment: Query alias: 1 model declares requestStatus.

required code
type: Property
comment: Query alias: 1 model declares requiredCode.

reserve
type: Property
comment: Query alias: 1 model declares reserve.

response
type: Property
comment: Query alias: 1 model declares response.

restaurant services
type: Property
comment: Query alias: 1 model declares restaurantServices.

restaurant specialties
type: Property
comment: Query alias: 1 model declares restaurantSpecialties.

result rate
type: Property
comment: Query alias: 1 model declares resultRate.

results
type: Property
comment: Query alias: 1 model declares results.

results first available date
type: Property
comment: Query alias: 1 model declares resultsFirstAvailableDate.

result values performance indicator
type: Property
comment: Query alias: 1 model declares resultValuesPerformanceIndicator.

retailer custom audience config
type: Property
comment: Query alias: 1 model declares retailerCustomAudienceConfig.

retailer id
type: Property
comment: Query alias: 1 model declares retailerId.

retailer item ids
type: Property
comment: Query alias: 2 models declare retailerItemIds.

retention days
type: Property
comment: Query alias: 1 model declares retentionDays.

retention seconds
type: Property
comment: Query alias: 2 models declare retentionSeconds.

reveal details over time
type: Property
comment: Query alias: 1 model declares revealDetailsOverTime.

review feedback
type: Property
comment: Query alias: 1 model declares reviewFeedback.

rf prediction id
type: Property
comment: Query alias: 1 model declares rfPredictionId.

rf spec
type: Property
comment: Query alias: 1 model declares rfSpec.

ridge monitoring status
type: Property
comment: Query alias: 1 model declares ridgeMonitoringStatus.

right
type: Property
comment: Query alias: 1 model declares right.

roas average floor
type: Property
comment: Query alias: 1 model declares roasAverageFloor.

rule
type: Property
comment: Query alias: 1 model declares rule.

rule ids
type: Property
comment: Query alias: 1 model declares ruleIds.

sales contact
type: Property
comment: Query alias: 1 model declares salesContact.

saved count
type: Property
comment: Query alias: 2 models declare savedCount.

scale
type: Property
comment: Query alias: 1 model declares scale.

schedule
type: Property
comment: Query alias: 1 model declares schedule.

school
type: Property
comment: Query alias: 1 model declares school.

screenplay by
type: Property
comment: Query alias: 1 model declares screenplayBy.

season
type: Property
comment: Query alias: 1 model declares season.

selected audio spec
type: Property
comment: Query alias: 1 model declares selectedAudioSpec.

self ig scoped id
type: Property
comment: Query alias: 1 model declares selfIgScopedId.

seller
type: Property
comment: Query alias: 1 model declares seller.

seller business info
type: Property
comment: Query alias: 1 model declares sellerBusinessInfo.

seller business status
type: Property
comment: Query alias: 1 model declares sellerBusinessStatus.

send bill to
type: Property
comment: Query alias: 1 model declares sendBillTo.

send bill to address
type: Property
comment: Query alias: 2 models declare sendBillToAddress.

send bill to biz name
type: Property
comment: Query alias: 1 model declares sendBillToBizName.

shape color
type: Property
comment: Query alias: 1 model declares shapeColor.

shared audiences
type: Property
comment: Query alias: 1 model declares sharedAudiences.

shared login upgrade required by
type: Property
comment: Query alias: 1 model declares sharedLoginUpgradeRequiredBy.

shared to sponsor status
type: Property
comment: Query alias: 1 model declares sharedToSponsorStatus.

shares count
type: Property
comment: Query alias: 2 models declare sharesCount.

shop collection product set id
type: Property
comment: Query alias: 1 model declares shopCollectionProductSetId.

shopping product tag eligibility
type: Property
comment: Query alias: 1 model declares shoppingProductTagEligibility.

shopping review status
type: Property
comment: Query alias: 1 model declares shoppingReviewStatus.

shops
type: Property
comment: Query alias: 1 model declares shops.

shops ads setup
type: Property
comment: Query alias: 1 model declares shopsAdsSetup.

shops assisted purchases
type: Property
comment: Query alias: 1 model declares shopsAssistedPurchases.

shops bundle
type: Property
comment: Query alias: 1 model declares shopsBundle.

shop status
type: Property
comment: Query alias: 1 model declares shopStatus.

shortcode
type: Property
comment: Query alias: 1 model declares shortcode.

short name
type: Property
comment: Query alias: 1 model declares shortName.

show assign permissions
type: Property
comment: Query alias: 1 model declares showAssignPermissions.

showcase card display
type: Property
comment: Query alias: 1 model declares showcaseCardDisplay.

show checkout experience
type: Property
comment: Query alias: 1 model declares showCheckoutExperience.

show destination blurbs
type: Property
comment: Query alias: 1 model declares showDestinationBlurbs.

show multiple images
type: Property
comment: Query alias: 1 model declares showMultipleImages.

show summary
type: Property
comment: Query alias: 1 model declares showSummary.

sigedit removal
type: Property
comment: Query alias: 1 model declares sigeditRemoval.

significant other
type: Property
comment: Query alias: 1 model declares significantOther.

singapore universal
type: Property
comment: Query alias: 1 model declares singaporeUniversal.

singapore universal beneficiary
type: Property
comment: Query alias: 1 model declares singaporeUniversalBeneficiary.

singapore universal payer
type: Property
comment: Query alias: 1 model declares singaporeUniversalPayer.

single ad
type: Property
comment: Query alias: 1 model declares singleAd.

single line address
type: Property
comment: Query alias: 1 model declares singleLineAddress.

site category
type: Property
comment: Query alias: 1 model declares siteCategory.

site extensions
type: Property
comment: Query alias: 1 model declares siteExtensions.

site link classification
type: Property
comment: Query alias: 1 model declares siteLinkClassification.

site link extra metadata
type: Property
comment: Query alias: 1 model declares siteLinkExtraMetadata.

site link hash
type: Property
comment: Query alias: 1 model declares siteLinkHash.

site link id
type: Property
comment: Query alias: 1 model declares siteLinkId.

site link image hash
type: Property
comment: Query alias: 1 model declares siteLinkImageHash.

site link image url
type: Property
comment: Query alias: 1 model declares siteLinkImageUrl.

site link language
type: Property
comment: Query alias: 1 model declares siteLinkLanguage.

site link original url
type: Property
comment: Query alias: 1 model declares siteLinkOriginalUrl.

site link recommendation type
type: Property
comment: Query alias: 1 model declares siteLinkRecommendationType.

site links data consented
type: Property
comment: Query alias: 1 model declares siteLinksDataConsented.

site links spec
type: Property
comment: Query alias: 1 model declares siteLinksSpec.

site link title
type: Property
comment: Query alias: 1 model declares siteLinkTitle.

site link url
type: Property
comment: Query alias: 1 model declares siteLinkUrl.

site link url anchor
type: Property
comment: Query alias: 1 model declares siteLinkUrlAnchor.

site link url recommender type
type: Property
comment: Query alias: 1 model declares siteLinkUrlRecommenderType.

site link website data source
type: Property
comment: Query alias: 1 model declares siteLinkWebsiteDataSource.

size
type: Property
comment: Query alias: 1 model declares size.

small geo areas
type: Property
comment: Query alias: 1 model declares smallGeoAreas.

smart promotion type
type: Property
comment: Query alias: 1 model declares smartPromotionType.

smart pse enabled
type: Property
comment: Query alias: 2 models declare smartPseEnabled.

smart pse setting
type: Property
comment: Query alias: 1 model declares smartPseSetting.

social sentence
type: Property
comment: Query alias: 1 model declares socialSentence.

social sentence with like
type: Property
comment: Query alias: 1 model declares socialSentenceWithLike.

social sentence without like
type: Property
comment: Query alias: 1 model declares socialSentenceWithoutLike.

social spend
type: Property
comment: Query alias: 1 model declares socialSpend.

sold to address
type: Property
comment: Query alias: 3 models declare soldToAddress.

source
type: Property
comment: Query alias: 4 models declare source.

source ad
type: Property
comment: Query alias: 1 model declares sourceAd.

source ad id
type: Property
comment: Query alias: 1 model declares sourceAdId.

source adset
type: Property
comment: Query alias: 1 model declares sourceAdset.

source adset id
type: Property
comment: Query alias: 1 model declares sourceAdsetId.

source campaign
type: Property
comment: Query alias: 1 model declares sourceCampaign.

source campaign id
type: Property
comment: Query alias: 1 model declares sourceCampaignId.

source facebook post id
type: Property
comment: Query alias: 1 model declares sourceFacebookPostId.

source file size
type: Property
comment: Query alias: 1 model declares sourceFileSize.

source instagram media id
type: Property
comment: Query alias: 1 model declares sourceInstagramMediaId.

source recommendation type
type: Property
comment: Query alias: 1 model declares sourceRecommendationType.

sources
type: Property
comment: Query alias: 1 model declares sources.

source url
type: Property
comment: Query alias: 1 model declares sourceUrl.

special ad categories
type: Property
comment: Query alias: 1 model declares specialAdCategories.

special ad category
type: Property
comment: Query alias: 1 model declares specialAdCategory.

special ad category country
type: Property
comment: Query alias: 1 model declares specialAdCategoryCountry.

specifications
type: Property
comment: Query alias: 1 model declares specifications.

spend
type: Property
comment: Query alias: 1 model declares spend.

spend cap
type: Property
comment: Query alias: 2 models declare spendCap.

spherical
type: Property
comment: Query alias: 1 model declares spherical.

sponsor id
type: Property
comment: Query alias: 1 model declares sponsorId.

sponsor page id
type: Property
comment: Query alias: 1 model declares sponsorPageId.

sponsor relationship
type: Property
comment: Query alias: 1 model declares sponsorRelationship.

sports
type: Property
comment: Query alias: 1 model declares sports.

standard enhancements
type: Property
comment: Query alias: 1 model declares standardEnhancements.

standard enhancements catalog
type: Property
comment: Query alias: 1 model declares standardEnhancementsCatalog.

starring
type: Property
comment: Query alias: 1 model declares starring.

start info
type: Property
comment: Query alias: 1 model declares startInfo.

start minute
type: Property
comment: Query alias: 1 model declares startMinute.

start time in sec
type: Property
comment: Query alias: 1 model declares startTimeInSec.

state
type: Property
comment: Query alias: 2 models declare state.

static card
type: Property
comment: Query alias: 2 models declare staticCard.

static fallback spec
type: Property
comment: Query alias: 1 model declares staticFallbackSpec.

stop time
type: Property
comment: Query alias: 1 model declares stopTime.

store catalog settings
type: Property
comment: Query alias: 1 model declares storeCatalogSettings.

store code
type: Property
comment: Query alias: 1 model declares storeCode.

storefront shop id
type: Property
comment: Query alias: 1 model declares storefrontShopId.

store location descriptor
type: Property
comment: Query alias: 1 model declares storeLocationDescriptor.

store number
type: Property
comment: Query alias: 1 model declares storeNumber.

stories transformation types
type: Property
comment: Query alias: 1 model declares storiesTransformationTypes.

street1
type: Property
comment: Query alias: 2 models declare street1.

street2
type: Property
comment: Query alias: 2 models declare street2.

street3
type: Property
comment: Query alias: 1 model declares street3.

street4
type: Property
comment: Query alias: 1 model declares street4.

studio
type: Property
comment: Query alias: 1 model declares studio.

subcities
type: Property
comment: Query alias: 1 model declares subcities.

subdomain
type: Property
comment: Query alias: 1 model declares subdomain.

subneighborhoods
type: Property
comment: Query alias: 1 model declares subneighborhoods.

subscriber universe
type: Property
comment: Query alias: 1 model declares subscriberUniverse.

subtitle
type: Property
comment: Query alias: 1 model declares subtitle.

subtype
type: Property
comment: Query alias: 1 model declares subtype.

summary
type: Property
comment: Query alias: 1 model declares summary.

supports donate button in live video
type: Property
comment: Query alias: 2 models declare supportsDonateButtonInLiveVideo.

tags
type: Property
comment: Query alias: 2 models declare tags.

taiwan finserv
type: Property
comment: Query alias: 1 model declares taiwanFinserv.

taiwan finserv beneficiary
type: Property
comment: Query alias: 1 model declares taiwanFinservBeneficiary.

taiwan finserv payer
type: Property
comment: Query alias: 1 model declares taiwanFinservPayer.

taiwan universal
type: Property
comment: Query alias: 1 model declares taiwanUniversal.

taiwan universal beneficiary
type: Property
comment: Query alias: 1 model declares taiwanUniversalBeneficiary.

taiwan universal payer
type: Property
comment: Query alias: 1 model declares taiwanUniversalPayer.

takeout
type: Property
comment: Query alias: 1 model declares takeout.

talking about count
type: Property
comment: Query alias: 1 model declares talkingAboutCount.

targeting
type: Property
comment: Query alias: 3 models declare targeting.

targeting automation
type: Property
comment: Query alias: 1 model declares targetingAutomation.

targeting optimization
type: Property
comment: Query alias: 1 model declares targetingOptimization.

targeting optimization types
type: Property
comment: Query alias: 1 model declares targetingOptimizationTypes.

targeting relaxation types
type: Property
comment: Query alias: 1 model declares targetingRelaxationTypes.

target type
type: Property
comment: Query alias: 1 model declares targetType.

tax id
type: Property
comment: Query alias: 1 model declares taxId.

tax id status
type: Property
comment: Query alias: 1 model declares taxIdStatus.

tax id type
type: Property
comment: Query alias: 1 model declares taxIdType.

template
type: Property
comment: Query alias: 1 model declares template.

template data
type: Property
comment: Query alias: 1 model declares templateData.

template url
type: Property
comment: Query alias: 1 model declares templateUrl.

template url spec
type: Property
comment: Query alias: 2 models declare templateUrlSpec.

temporary status
type: Property
comment: Query alias: 1 model declares temporaryStatus.

terms
type: Property
comment: Query alias: 1 model declares terms.

testimonial
type: Property
comment: Query alias: 1 model declares testimonial.

testimonial locale
type: Property
comment: Query alias: 1 model declares testimonialLocale.

text
type: Property
comment: Query alias: 6 models declare text.

text color
type: Property
comment: Query alias: 1 model declares textColor.

text data
type: Property
comment: Query alias: 1 model declares textData.

text extraction
type: Property
comment: Query alias: 1 model declares textExtraction.

text extraction for headline
type: Property
comment: Query alias: 1 model declares textExtractionForHeadline.

text extraction for tap target
type: Property
comment: Query alias: 1 model declares textExtractionForTapTarget.

text font
type: Property
comment: Query alias: 2 models declare textFont.

text formatting optimization
type: Property
comment: Query alias: 1 model declares textFormattingOptimization.

text generation
type: Property
comment: Query alias: 1 model declares textGeneration.

text optimizations
type: Property
comment: Query alias: 1 model declares textOptimizations.

text overlay translation
type: Property
comment: Query alias: 1 model declares textOverlayTranslation.

text style
type: Property
comment: Query alias: 1 model declares textStyle.

text template tags
type: Property
comment: Query alias: 1 model declares textTemplateTags.

text transformation types
type: Property
comment: Query alias: 1 model declares textTransformationTypes.

text translation
type: Property
comment: Query alias: 1 model declares textTranslation.

text type
type: Property
comment: Query alias: 1 model declares textType.

theme color
type: Property
comment: Query alias: 1 model declares themeColor.

third party id
type: Property
comment: Query alias: 1 model declares thirdPartyId.

threads comment moderation filter
type: Property
comment: Query alias: 1 model declares threadsCommentModerationFilter.

threads positions
type: Property
comment: Query alias: 4 models declare threadsPositions.

thumbnail hash
type: Property
comment: Query alias: 1 model declares thumbnailHash.

thumbnail id
type: Property
comment: Query alias: 1 model declares thumbnailId.

thumbnail url
type: Property
comment: Query alias: 5 models declare thumbnailUrl.

ticket delivery type
type: Property
comment: Query alias: 1 model declares ticketDeliveryType.

ticketing privacy uri
type: Property
comment: Query alias: 1 model declares ticketingPrivacyUri.

ticketing terms uri
type: Property
comment: Query alias: 1 model declares ticketingTermsUri.

ticket setting
type: Property
comment: Query alias: 1 model declares ticketSetting.

ticket tier ids
type: Property
comment: Query alias: 1 model declares ticketTierIds.

ticket uri
type: Property
comment: Query alias: 2 models declare ticketUri.

ticket uri start sales time
type: Property
comment: Query alias: 1 model declares ticketUriStartSalesTime.

time
type: Property
comment: Query alias: 1 model declares time.

time based ad rotation id blocks
type: Property
comment: Query alias: 1 model declares timeBasedAdRotationIdBlocks.

time based ad rotation intervals
type: Property
comment: Query alias: 1 model declares timeBasedAdRotationIntervals.

timestamp
type: Property
comment: Query alias: 3 models declare timestamp.

timezone id
type: Property
comment: Query alias: 2 models declare timezoneId.

timezone name
type: Property
comment: Query alias: 1 model declares timezoneName.

timezone offset hours utc
type: Property
comment: Query alias: 1 model declares timezoneOffsetHoursUtc.

timezone type
type: Property
comment: Query alias: 1 model declares timezoneType.

title
type: Property
comment: Query alias: 7 models declare title.

title label
type: Property
comment: Query alias: 3 models declare titleLabel.

title with featured artists
type: Property
comment: Query alias: 1 model declares titleWithFeaturedArtists.

token for business
type: Property
comment: Query alias: 1 model declares tokenForBusiness.

top
type: Property
comment: Query alias: 1 model declares top.

topline id
type: Property
comment: Query alias: 1 model declares toplineId.

top searchable artist id
type: Property
comment: Query alias: 1 model declares topSearchableArtistId.

top searchable artist name
type: Property
comment: Query alias: 1 model declares topSearchableArtistName.

top searchable artist profile pic url
type: Property
comment: Query alias: 1 model declares topSearchableArtistProfilePicUrl.

tos accepted
type: Property
comment: Query alias: 1 model declares tosAccepted.

total card view
type: Property
comment: Query alias: 1 model declares totalCardView.

total comments count
type: Property
comment: Query alias: 2 models declare totalCommentsCount.

total like count
type: Property
comment: Query alias: 2 models declare totalLikeCount.

total postbacks
type: Property
comment: Query alias: 1 model declares totalPostbacks.

total postbacks detailed
type: Property
comment: Query alias: 1 model declares totalPostbacksDetailed.

total postbacks detailed v4
type: Property
comment: Query alias: 1 model declares totalPostbacksDetailedV4.

total views count
type: Property
comment: Query alias: 2 models declare totalViewsCount.

tracking and conversion with defaults
type: Property
comment: Query alias: 1 model declares trackingAndConversionWithDefaults.

tracking specs
type: Property
comment: Query alias: 1 model declares trackingSpecs.

traffic quality
type: Property
comment: Query alias: 1 model declares trafficQuality.

transformation type
type: Property
comment: Query alias: 1 model declares transformationType.

translate voiceover
type: Property
comment: Query alias: 1 model declares translateVoiceover.

translations
type: Property
comment: Query alias: 1 model declares translations.

trending topics
type: Property
comment: Query alias: 1 model declares trendingTopics.

trending topics spec
type: Property
comment: Query alias: 1 model declares trendingTopicsSpec.

two factor type
type: Property
comment: Query alias: 1 model declares twoFactorType.

ui version
type: Property
comment: Query alias: 1 model declares uiVersion.

unified commerce content
type: Property
comment: Query alias: 1 model declares unifiedCommerceContent.

unique actions
type: Property
comment: Query alias: 1 model declares uniqueActions.

unique clicks
type: Property
comment: Query alias: 1 model declares uniqueClicks.

unique conversions
type: Property
comment: Query alias: 1 model declares uniqueConversions.

unique ctr
type: Property
comment: Query alias: 1 model declares uniqueCtr.

unique inline link click ctr
type: Property
comment: Query alias: 1 model declares uniqueInlineLinkClickCtr.

unique inline link clicks
type: Property
comment: Query alias: 1 model declares uniqueInlineLinkClicks.

unique link clicks ctr
type: Property
comment: Query alias: 1 model declares uniqueLinkClicksCtr.

unique outbound clicks
type: Property
comment: Query alias: 1 model declares uniqueOutboundClicks.

unique outbound clicks ctr
type: Property
comment: Query alias: 1 model declares uniqueOutboundClicksCtr.

unique video continuous2sec watched actions
type: Property
comment: Query alias: 1 model declares uniqueVideoContinuous2SecWatchedActions.

unique video view15sec
type: Property
comment: Query alias: 1 model declares uniqueVideoView15Sec.

universal beneficiary
type: Property
comment: Query alias: 1 model declares universalBeneficiary.

universal content id
type: Property
comment: Query alias: 1 model declares universalContentId.

universal payer
type: Property
comment: Query alias: 1 model declares universalPayer.

universal video id
type: Property
comment: Query alias: 1 model declares universalVideoId.

unread message count
type: Property
comment: Query alias: 1 model declares unreadMessageCount.

unread notif count
type: Property
comment: Query alias: 1 model declares unreadNotifCount.

unseen message count
type: Property
comment: Query alias: 1 model declares unseenMessageCount.

upc
type: Property
comment: Query alias: 1 model declares upc.

upcoming events
type: Property
comment: Query alias: 1 model declares upcomingEvents.

update time
type: Property
comment: Query alias: 1 model declares updateTime.

uploading phase
type: Property
comment: Query alias: 1 model declares uploadingPhase.

url
type: Property
comment: Query alias: 6 models declare url.

url tags
type: Property
comment: Query alias: 8 models declare urlTags.

usd exchange
type: Property
comment: Query alias: 1 model declares usdExchange.

usd exchange inverse
type: Property
comment: Query alias: 1 model declares usdExchangeInverse.

use flexible image aspect ratio
type: Property
comment: Query alias: 1 model declares useFlexibleImageAspectRatio.

use new app click
type: Property
comment: Query alias: 1 model declares useNewAppClick.

use page actor override
type: Property
comment: Query alias: 1 model declares usePageActorOverride.

user
type: Property
comment: Query alias: 1 model declares user.

user access expire time
type: Property
comment: Query alias: 4 models declare userAccessExpireTime.

user adclusters
type: Property
comment: Query alias: 2 models declare userAdclusters.

user age unknown
type: Property
comment: Query alias: 1 model declares userAgeUnknown.

user currency
type: Property
comment: Query alias: 1 model declares userCurrency.

user device
type: Property
comment: Query alias: 1 model declares userDevice.

user event
type: Property
comment: Query alias: 1 model declares userEvent.

user groups
type: Property
comment: Query alias: 1 model declares userGroups.

user has leads permission
type: Property
comment: Query alias: 1 model declares userHasLeadsPermission.

user id
type: Property
comment: Query alias: 1 model declares userId.

username
type: Property
comment: Query alias: 7 models declare username.

user os
type: Property
comment: Query alias: 1 model declares userOs.

user tasks
type: Property
comment: Query alias: 1 model declares userTasks.

user tos accepted
type: Property
comment: Query alias: 1 model declares userTosAccepted.

utm campaign
type: Property
comment: Query alias: 1 model declares utmCampaign.

utm medium
type: Property
comment: Query alias: 1 model declares utmMedium.

utm source
type: Property
comment: Query alias: 1 model declares utmSource.

valet
type: Property
comment: Query alias: 1 model declares valet.

validation status
type: Property
comment: Query alias: 1 model declares validationStatus.

validity status
type: Property
comment: Query alias: 2 models declare validityStatus.

value expression
type: Property
comment: Query alias: 1 model declares valueExpression.

value rules applied
type: Property
comment: Query alias: 1 model declares valueRulesApplied.

value rule set id
type: Property
comment: Query alias: 1 model declares valueRuleSetId.

value semantic type
type: Property
comment: Query alias: 1 model declares valueSemanticType.

variation
type: Property
comment: Query alias: 1 model declares variation.

vat tax id
type: Property
comment: Query alias: 1 model declares vatTaxId.

vendor id
type: Property
comment: Query alias: 1 model declares vendorId.

venue
type: Property
comment: Query alias: 1 model declares venue.

verification status
type: Property
comment: Query alias: 2 models declare verificationStatus.

verified
type: Property
comment: Query alias: 1 model declares verified.

vertical
type: Property
comment: Query alias: 2 models declare vertical.

vertical id
type: Property
comment: Query alias: 1 model declares verticalId.

video15sec watched actions
type: Property
comment: Query alias: 1 model declares video15SecWatchedActions.

video30sec watched actions
type: Property
comment: Query alias: 1 model declares video30SecWatchedActions.

video asset
type: Property
comment: Query alias: 1 model declares videoAsset.

video auto crop
type: Property
comment: Query alias: 1 model declares videoAutoCrop.

video avg time watched actions
type: Property
comment: Query alias: 1 model declares videoAvgTimeWatchedActions.

video continuous2sec watched actions
type: Property
comment: Query alias: 1 model declares videoContinuous2SecWatchedActions.

video data
type: Property
comment: Query alias: 1 model declares videoData.

video filtering
type: Property
comment: Query alias: 1 model declares videoFiltering.

video highlight
type: Property
comment: Query alias: 1 model declares videoHighlight.

video highlights
type: Property
comment: Query alias: 1 model declares videoHighlights.

video label
type: Property
comment: Query alias: 3 models declare videoLabel.

video p100watched actions
type: Property
comment: Query alias: 1 model declares videoP100WatchedActions.

video p25watched actions
type: Property
comment: Query alias: 1 model declares videoP25WatchedActions.

video p50watched actions
type: Property
comment: Query alias: 1 model declares videoP50WatchedActions.

video p75watched actions
type: Property
comment: Query alias: 1 model declares videoP75WatchedActions.

video p95watched actions
type: Property
comment: Query alias: 1 model declares videoP95WatchedActions.

video play actions
type: Property
comment: Query alias: 1 model declares videoPlayActions.

video play curve actions
type: Property
comment: Query alias: 1 model declares videoPlayCurveActions.

video play retention0to15s actions
type: Property
comment: Query alias: 1 model declares videoPlayRetention0To15sActions.

video play retention20to60s actions
type: Property
comment: Query alias: 1 model declares videoPlayRetention20To60sActions.

video play retention graph actions
type: Property
comment: Query alias: 1 model declares videoPlayRetentionGraphActions.

video status
type: Property
comment: Query alias: 1 model declares videoStatus.

video thruplay watched actions
type: Property
comment: Query alias: 1 model declares videoThruplayWatchedActions.

video time watched actions
type: Property
comment: Query alias: 1 model declares videoTimeWatchedActions.

video title
type: Property
comment: Query alias: 1 model declares videoTitle.

video to image
type: Property
comment: Query alias: 1 model declares videoToImage.

video transformation types
type: Property
comment: Query alias: 1 model declares videoTransformationTypes.

video uncrop
type: Property
comment: Query alias: 1 model declares videoUncrop.

video uncrop9x16to9x18
type: Property
comment: Query alias: 1 model declares videoUncrop9x16To9x18.

video upload limits
type: Property
comment: Query alias: 1 model declares videoUploadLimits.

video view per impression
type: Property
comment: Query alias: 1 model declares videoViewPerImpression.

viewable business
type: Property
comment: Query alias: 1 model declares viewableBusiness.

view count
type: Property
comment: Query alias: 1 model declares viewCount.

views
type: Property
comment: Query alias: 1 model declares views.

visa
type: Property
comment: Query alias: 1 model declares visa.

voip info
type: Property
comment: Query alias: 1 model declares voipInfo.

waiter
type: Property
comment: Query alias: 1 model declares waiter.

walkins
type: Property
comment: Query alias: 1 model declares walkins.

wa mm image filtering
type: Property
comment: Query alias: 1 model declares waMmImageFiltering.

wa mm text truncation length
type: Property
comment: Query alias: 1 model declares waMmTextTruncationLength.

web
type: Property
comment: Query alias: 2 models declare web.

web destination spec
type: Property
comment: Query alias: 1 model declares webDestinationSpec.

website ctr
type: Property
comment: Query alias: 1 model declares websiteCtr.

website media spec
type: Property
comment: Query alias: 1 model declares websiteMediaSpec.

website purchase roas
type: Property
comment: Query alias: 1 model declares websitePurchaseRoas.

website summary spec
type: Property
comment: Query alias: 1 model declares websiteSummarySpec.

website url
type: Property
comment: Query alias: 1 model declares websiteUrl.

were here count
type: Property
comment: Query alias: 1 model declares wereHereCount.

whatsapp
type: Property
comment: Query alias: 1 model declares whatsapp.

whatsapp activation status
type: Property
comment: Query alias: 1 model declares whatsappActivationStatus.

whatsapp business manager messaging limit
type: Property
comment: Query alias: 1 model declares whatsappBusinessManagerMessagingLimit.

whats app business phone number
type: Property
comment: Query alias: 1 model declares whatsAppBusinessPhoneNumber.

whats app business phone number id
type: Property
comment: Query alias: 2 models declare whatsAppBusinessPhoneNumberId.

whatsapp number
type: Property
comment: Query alias: 2 models declare whatsappNumber.

whatsapp phone number
type: Property
comment: Query alias: 1 model declares whatsappPhoneNumber.

whatsapp positions
type: Property
comment: Query alias: 3 models declare whatsappPositions.

whatsapp subscriber source
type: Property
comment: Query alias: 1 model declares whatsappSubscriberSource.

whitelisted fb users
type: Property
comment: Query alias: 1 model declares whitelistedFbUsers.

whitelisted ids
type: Property
comment: Query alias: 1 model declares whitelistedIds.

whitelisted ig users
type: Property
comment: Query alias: 1 model declares whitelistedIgUsers.

width
type: Property
comment: Query alias: 1 model declares width.

window days
type: Property
comment: Query alias: 1 model declares windowDays.

windows phone
type: Property
comment: Query alias: 1 model declares windowsPhone.

wireless carrier
type: Property
comment: Query alias: 1 model declares wirelessCarrier.

wish bid
type: Property
comment: Query alias: 1 model declares wishBid.

with
type: Property
comment: Query alias: 2 models declare with.

work employers
type: Property
comment: Query alias: 2 models declare workEmployers.

work positions
type: Property
comment: Query alias: 2 models declare workPositions.

workspace
type: Property
comment: Query alias: 1 model declares workspace.

writer names
type: Property
comment: Query alias: 1 model declares writerNames.

written by
type: Property
comment: Query alias: 1 model declares writtenBy.

year
type: Property
comment: Query alias: 1 model declares year.

zip
type: Property
comment: Query alias: 1 model declares zip.

account id
type: Property
comment: Identifies the ad account associated with the ad.
alternate name: account_id
sub property of: account id
domain: Ad
range: string

ad active time
type: Property
comment: Represents the ad's active time.
alternate name: ad_active_time
sub property of: ad active time
domain: Ad
range: string

ad review feedback
type: Property
comment: Contains review feedback for the ad.
alternate name: ad_review_feedback
sub property of: ad review feedback
domain: Ad
range: Adgroup Review Feedback

ad schedule end time
type: Property
comment: Represents the scheduled UTC end time for the ad.
alternate name: ad_schedule_end_time
sub property of: ad schedule end time
domain: Ad
range: dateTime

ad schedule start time
type: Property
comment: Represents the scheduled UTC start time for the ad.
alternate name: ad_schedule_start_time
sub property of: ad schedule start time
domain: Ad
range: dateTime

adlabels
type: Property
comment: Lists labels associated with the ad.
alternate name: adlabels
domain: Ad
range: Ad Label

adset
type: Property
comment: Represents the ad set associated with the ad.
alternate name: adset
sub property of: adset
domain: Ad
range: Ad Set

adset id
type: Property
comment: Identifies the ad set associated with the ad.
alternate name: adset_id
sub property of: adset id
domain: Ad
range: string

bid amount
type: Property
comment: Represents the ad's bid amount.
alternate name: bid_amount
domain: Ad
range: int

bid info
type: Property
comment: Contains bid information associated with the ad.
alternate name: bid_info
domain: Ad
range: Bid Info Record

bid type
type: Property
comment: Indicates the ad's bid type, such as CPC, CPM, CPA, ABSOLUTE_OCPM, or MULTI_PREMIUM.
alternate name: bid_type
sub property of: bid type
domain: Ad
range: string
code list: AdBidType

campaign
type: Property
comment: Represents the campaign associated with the ad.
alternate name: campaign
sub property of: campaign
domain: Ad
range: Campaign

campaign id
type: Property
comment: Identifies the campaign associated with the ad.
alternate name: campaign_id
sub property of: campaign id
domain: Ad
range: string

configured status
type: Property
comment: Indicates the ad's configured status as ACTIVE, ARCHIVED, DELETED, or PAUSED.
alternate name: configured_status
sub property of: configured status
domain: Ad
range: string
code list: AdConfiguredStatus

conversion domain
type: Property
comment: Represents the domain associated with the ad's conversions.
alternate name: conversion_domain
sub property of: conversion domain
domain: Ad
range: string

conversion specs
type: Property
comment: Lists conversion specifications associated with the ad.
alternate name: conversion_specs
sub property of: conversion specs
domain: Ad
range: Conversion Action Query

created time
type: Property
comment: Represents when the ad was created in UTC.
alternate name: created_time
domain: Ad
range: dateTime

creative
type: Property
comment: Represents the creative associated with the ad.
alternate name: creative
domain: Ad
range: Ad Creative

creative asset groups spec
type: Property
comment: Contains the ad's creative asset group specification.
alternate name: creative_asset_groups_spec
sub property of: creative asset groups spec
domain: Ad
range: Ad Creative Asset Groups Spec

demolink hash
type: Property
comment: Represents the hash associated with the ad's demo link.
alternate name: demolink_hash
sub property of: demolink hash
domain: Ad
range: string

display sequence
type: Property
comment: Represents the ad's display sequence.
alternate name: display_sequence
sub property of: display sequence
domain: Ad
range: int

effective status
type: Property
comment: Indicates the ad's effective status, including ACTIVE, PAUSED, ARCHIVED, DELETED, or a review, billing, issue, or parent-level paused state.
alternate name: effective_status
sub property of: effective status
domain: Ad
range: string
code list: AdEffectiveStatus

engagement audience
type: Property
comment: Indicates whether the ad is associated with an engagement audience.
alternate name: engagement_audience
sub property of: engagement audience
domain: Ad
range: boolean

failed delivery checks
type: Property
comment: Lists delivery checks that the ad has failed.
alternate name: failed_delivery_checks
sub property of: failed delivery checks
domain: Ad
range: Delivery Check

id
type: Property
comment: Identifies the ad.
alternate name: id
sub property of: id
domain: Ad
range: string

issues info
type: Property
comment: Lists issue information associated with the ad.
alternate name: issues_info
domain: Ad
range: Adgroup Issues Info

last updated by app id
type: Property
comment: Identifies the app that last updated the ad.
alternate name: last_updated_by_app_id
sub property of: last updated by app id
domain: Ad
range: string

name
type: Property
comment: Represents the ad's name.
alternate name: name
sub property of: name
domain: Ad
range: string

placement
type: Property
comment: Represents the ad's placement.
alternate name: placement
sub property of: placement
domain: Ad
range: Placement

preview shareable link
type: Property
comment: Contains a shareable link for previewing the ad.
alternate name: preview_shareable_link
sub property of: preview shareable link
domain: Ad
range: string

priority
type: Property
comment: Represents the ad's priority.
alternate name: priority
domain: Ad
range: unsignedInt

recommendations
type: Property
comment: Lists recommendations associated with the ad.
alternate name: recommendations
sub property of: recommendations
domain: Ad
range: Ad Recommendation

source ad
type: Property
comment: Represents the source ad associated with the ad.
alternate name: source_ad
sub property of: source ad
domain: Ad
range: Ad

source ad id
type: Property
comment: Identifies the source ad associated with the ad.
alternate name: source_ad_id
sub property of: source ad id
domain: Ad
range: string

status
type: Property
comment: Indicates the ad's status as ACTIVE, ARCHIVED, DELETED, or PAUSED.
alternate name: status
domain: Ad
range: string
code list: AdStatus

targeting
type: Property
comment: Represents the ad's targeting configuration.
alternate name: targeting
sub property of: targeting
domain: Ad
range: Targeting

tracking and conversion with defaults
type: Property
comment: Contains the ad's tracking and conversion information with defaults.
alternate name: tracking_and_conversion_with_defaults
sub property of: tracking and conversion with defaults
domain: Ad
range: Tracking And Conversion With Defaults

tracking specs
type: Property
comment: Lists tracking specifications associated with the ad.
alternate name: tracking_specs
sub property of: tracking specs
domain: Ad
range: Conversion Action Query

updated time
type: Property
comment: Represents when the ad was last updated in UTC.
alternate name: updated_time
domain: Ad
range: dateTime

global
type: Property
comment: Contains review feedback that applies globally to the ad group.
alternate name: global
sub property of: global
domain: Adgroup Review Feedback
range: Global Record

placement specific
type: Property
comment: Contains review feedback specific to placements.
alternate name: placement_specific
sub property of: placement specific
domain: Adgroup Review Feedback
range: Adgroup Placement Specific Review Feedback

account admin
type: Property
comment: Contains placement-specific review feedback for account administrators.
alternate name: account_admin
sub property of: account admin
domain: Adgroup Placement Specific Review Feedback
range: Account Admin Record

ad
type: Property
comment: Contains placement-specific review feedback for ads.
alternate name: ad
sub property of: ad
domain: Adgroup Placement Specific Review Feedback
range: Ad Record

ads conversion experiences
type: Property
comment: Contains placement-specific review feedback for ads conversion experiences.
alternate name: ads_conversion_experiences
sub property of: ads conversion experiences
domain: Adgroup Placement Specific Review Feedback
range: Ads Conversion Experiences Record

b2c
type: Property
comment: Contains placement-specific review feedback for B2C.
alternate name: b2c
sub property of: b2c
domain: Adgroup Placement Specific Review Feedback
range: B2c Record

b2c commerce unified
type: Property
comment: Contains placement-specific review feedback for unified B2C commerce.
alternate name: b2c_commerce_unified
sub property of: b2c commerce unified
domain: Adgroup Placement Specific Review Feedback
range: B2c Commerce Unified Record

bsg
type: Property
comment: Contains placement-specific review feedback for BSG.
alternate name: bsg
sub property of: bsg
domain: Adgroup Placement Specific Review Feedback
range: Bsg Record

city community
type: Property
comment: Contains placement-specific review feedback for city community.
alternate name: city_community
sub property of: city community
domain: Adgroup Placement Specific Review Feedback
range: City Community Record

commerce
type: Property
comment: Contains placement-specific review feedback for commerce.
alternate name: commerce
sub property of: commerce
domain: Adgroup Placement Specific Review Feedback
range: Commerce Record

compromise
type: Property
comment: Contains placement-specific review feedback for compromise.
alternate name: compromise
sub property of: compromise
domain: Adgroup Placement Specific Review Feedback
range: Compromise Record

daily deals
type: Property
comment: Contains placement-specific review feedback for daily deals.
alternate name: daily_deals
sub property of: daily deals
domain: Adgroup Placement Specific Review Feedback
range: Daily Deals Record

daily deals legacy
type: Property
comment: Contains placement-specific review feedback for legacy daily deals.
alternate name: daily_deals_legacy
sub property of: daily deals legacy
domain: Adgroup Placement Specific Review Feedback
range: Daily Deals Legacy Record

dpa
type: Property
comment: Contains placement-specific review feedback for DPA.
alternate name: dpa
sub property of: dpa
domain: Adgroup Placement Specific Review Feedback
range: Dpa Record

dri copyright
type: Property
comment: Contains placement-specific review feedback for DRI copyright.
alternate name: dri_copyright
sub property of: dri copyright
domain: Adgroup Placement Specific Review Feedback
range: Dri Copyright Record

dri counterfeit
type: Property
comment: Contains placement-specific review feedback for DRI counterfeit.
alternate name: dri_counterfeit
sub property of: dri counterfeit
domain: Adgroup Placement Specific Review Feedback
range: Dri Counterfeit Record

facebook
type: Property
comment: Contains placement-specific review feedback for Facebook.
alternate name: facebook
sub property of: facebook
domain: Adgroup Placement Specific Review Feedback
range: Facebook Record

facebook pages live shopping
type: Property
comment: Contains placement-specific review feedback for Facebook Pages live shopping.
alternate name: facebook_pages_live_shopping
sub property of: facebook pages live shopping
domain: Adgroup Placement Specific Review Feedback
range: Facebook Pages Live Shopping Record

independent work
type: Property
comment: Contains placement-specific review feedback for independent work.
alternate name: independent_work
sub property of: independent work
domain: Adgroup Placement Specific Review Feedback
range: Independent Work Record

instagram
type: Property
comment: Contains placement-specific review feedback for Instagram.
alternate name: instagram
domain: Adgroup Placement Specific Review Feedback
range: Instagram Record

instagram shop
type: Property
comment: Contains placement-specific review feedback for Instagram Shop.
alternate name: instagram_shop
sub property of: instagram shop
domain: Adgroup Placement Specific Review Feedback
range: Instagram Shop Record

job search
type: Property
comment: Contains placement-specific review feedback for job search.
alternate name: job_search
sub property of: job search
domain: Adgroup Placement Specific Review Feedback
range: Job Search Record

lead gen honeypot
type: Property
comment: Contains placement-specific review feedback for lead generation honeypot.
alternate name: lead_gen_honeypot
sub property of: lead gen honeypot
domain: Adgroup Placement Specific Review Feedback
range: Lead Gen Honeypot Record

marketplace
type: Property
comment: Contains placement-specific review feedback for Marketplace.
alternate name: marketplace
sub property of: marketplace
domain: Adgroup Placement Specific Review Feedback
range: Marketplace Record

marketplace home rentals
type: Property
comment: Contains placement-specific review feedback for Marketplace home rentals.
alternate name: marketplace_home_rentals
sub property of: marketplace home rentals
domain: Adgroup Placement Specific Review Feedback
range: Marketplace Home Rentals Record

marketplace home sales
type: Property
comment: Contains placement-specific review feedback for Marketplace home sales.
alternate name: marketplace_home_sales
sub property of: marketplace home sales
domain: Adgroup Placement Specific Review Feedback
range: Marketplace Home Sales Record

marketplace motors
type: Property
comment: Contains placement-specific review feedback for Marketplace Motors.
alternate name: marketplace_motors
sub property of: marketplace motors
domain: Adgroup Placement Specific Review Feedback
range: Marketplace Motors Record

marketplace shops
type: Property
comment: Contains placement-specific review feedback for Marketplace Shops.
alternate name: marketplace_shops
sub property of: marketplace shops
domain: Adgroup Placement Specific Review Feedback
range: Marketplace Shops Record

max review placements
type: Property
comment: Contains placement-specific review feedback for Max review placements.
alternate name: max_review_placements
sub property of: max review placements
domain: Adgroup Placement Specific Review Feedback
range: Max Review Placements Record

neighborhoods
type: Property
comment: Contains placement-specific review feedback for Neighborhoods.
alternate name: neighborhoods
domain: Adgroup Placement Specific Review Feedback
range: Neighborhoods Record

page admin
type: Property
comment: Contains placement-specific review feedback for page administrators.
alternate name: page_admin
sub property of: page admin
domain: Adgroup Placement Specific Review Feedback
range: Page Admin Record

product
type: Property
comment: Contains placement-specific review feedback for products.
alternate name: product
sub property of: product
domain: Adgroup Placement Specific Review Feedback
range: Product Record

product service
type: Property
comment: Contains placement-specific review feedback for products and services.
alternate name: product_service
sub property of: product service
domain: Adgroup Placement Specific Review Feedback
range: Product Service Record

profile
type: Property
comment: Contains placement-specific review feedback for profiles.
alternate name: profile
sub property of: profile
domain: Adgroup Placement Specific Review Feedback
range: Profile Record

seller
type: Property
comment: Contains placement-specific review feedback for sellers.
alternate name: seller
sub property of: seller
domain: Adgroup Placement Specific Review Feedback
range: Seller Record

shops
type: Property
comment: Contains placement-specific review feedback for Shops.
alternate name: shops
sub property of: shops
domain: Adgroup Placement Specific Review Feedback
range: Shops Record

traffic quality
type: Property
comment: Contains placement-specific review feedback for traffic quality.
alternate name: traffic_quality
sub property of: traffic quality
domain: Adgroup Placement Specific Review Feedback
range: Traffic Quality Record

unified commerce content
type: Property
comment: Contains placement-specific review feedback for unified commerce content.
alternate name: unified_commerce_content
sub property of: unified commerce content
domain: Adgroup Placement Specific Review Feedback
range: Unified Commerce Content Record

whatsapp
type: Property
comment: Contains placement-specific review feedback for WhatsApp.
alternate name: whatsapp
sub property of: whatsapp
domain: Adgroup Placement Specific Review Feedback
range: Whatsapp Record

account
type: Property
comment: Identifies the ad account associated with the label.
alternate name: account
sub property of: account
domain: Ad Label
range: Ad Account

created time
type: Property
comment: Records when the ad label was created.
alternate name: created_time
domain: Ad Label
range: dateTime

id
type: Property
comment: Identifies the ad label.
alternate name: id
sub property of: id
domain: Ad Label
range: string

name
type: Property
comment: Provides the name of the ad label.
alternate name: name
sub property of: name
domain: Ad Label
range: string

updated time
type: Property
comment: Records when the ad label was last updated.
alternate name: updated_time
domain: Ad Label
range: dateTime

account id
type: Property
comment: Identifies the ad account.
alternate name: account_id
sub property of: account id
domain: Ad Account
range: string

account status
type: Property
comment: Represents the ad account's status.
alternate name: account_status
sub property of: account status
domain: Ad Account
range: unsignedInt

ad account promotable objects
type: Property
comment: Contains objects that the ad account can promote.
alternate name: ad_account_promotable_objects
sub property of: ad account promotable objects
domain: Ad Account
range: Ad Account Promotable Objects

age
type: Property
comment: Represents the ad account's age.
alternate name: age
sub property of: age
domain: Ad Account
range: double

agency client declaration
type: Property
comment: Contains the ad account's agency client declaration.
alternate name: agency_client_declaration
sub property of: agency client declaration
domain: Ad Account
range: Agency Client Declaration

all capabilities
type: Property
comment: Lists all capabilities associated with the ad account.
alternate name: all_capabilities
sub property of: all capabilities
domain: Ad Account
range: string

amount spent
type: Property
comment: Represents the amount spent by the ad account.
alternate name: amount_spent
sub property of: amount spent
domain: Ad Account
range: string

attribution spec
type: Property
comment: Lists the ad account's attribution specifications.
alternate name: attribution_spec
sub property of: attribution spec
domain: Ad Account
range: Attribution Spec

balance
type: Property
comment: Represents the ad account's balance.
alternate name: balance
domain: Ad Account
range: string

brand safety content filter levels
type: Property
comment: Lists the ad account's brand safety content filter levels.
alternate name: brand_safety_content_filter_levels
sub property of: brand safety content filter levels
domain: Ad Account
range: string

business
type: Property
comment: Represents the business associated with the ad account.
alternate name: business
domain: Ad Account
range: Business

business city
type: Property
comment: Represents the city in the ad account's business address.
alternate name: business_city
sub property of: business city
domain: Ad Account
range: string

business country code
type: Property
comment: Represents the country code in the ad account's business address.
alternate name: business_country_code
sub property of: business country code
domain: Ad Account
range: string

business name
type: Property
comment: Represents the business name associated with the ad account.
alternate name: business_name
sub property of: business name
domain: Ad Account
range: string

business state
type: Property
comment: Represents the state in the ad account's business address.
alternate name: business_state
sub property of: business state
domain: Ad Account
range: string

business street
type: Property
comment: Represents the street in the ad account's business address.
alternate name: business_street
sub property of: business street
domain: Ad Account
range: string

business street2
type: Property
comment: Represents the second street line in the ad account's business address.
alternate name: business_street2
sub property of: business street2
domain: Ad Account
range: string

business zip
type: Property
comment: Represents the ZIP code in the ad account's business address.
alternate name: business_zip
sub property of: business zip
domain: Ad Account
range: string

can create brand lift study
type: Property
comment: Indicates whether the ad account can create a brand lift study.
alternate name: can_create_brand_lift_study
sub property of: can create brand lift study
domain: Ad Account
range: boolean

capabilities
type: Property
comment: Lists capabilities associated with the ad account.
alternate name: capabilities
sub property of: capabilities
domain: Ad Account
range: string

created time
type: Property
comment: Represents when the ad account was created in UTC.
alternate name: created_time
domain: Ad Account
range: dateTime

currency
type: Property
comment: Represents the currency associated with the ad account.
alternate name: currency
domain: Ad Account
range: string

custom audience info
type: Property
comment: Contains custom audience information for the ad account.
alternate name: custom_audience_info
sub property of: custom audience info
domain: Ad Account
range: Custom Audience Group

default dsa beneficiary
type: Property
comment: Represents the ad account's default DSA beneficiary.
alternate name: default_dsa_beneficiary
sub property of: default dsa beneficiary
domain: Ad Account
range: string

default dsa payor
type: Property
comment: Represents the ad account's default DSA payor.
alternate name: default_dsa_payor
sub property of: default dsa payor
domain: Ad Account
range: string

disable reason
type: Property
comment: Represents the reason associated with disabling the ad account.
alternate name: disable_reason
sub property of: disable reason
domain: Ad Account
range: unsignedInt

end advertiser
type: Property
comment: Identifies the end advertiser associated with the ad account.
alternate name: end_advertiser
sub property of: end advertiser
domain: Ad Account
range: string

end advertiser name
type: Property
comment: Represents the name of the end advertiser associated with the ad account.
alternate name: end_advertiser_name
sub property of: end advertiser name
domain: Ad Account
range: string

existing customers
type: Property
comment: Lists existing customers associated with the ad account.
alternate name: existing_customers
sub property of: existing customers
domain: Ad Account
range: string

expired funding source details
type: Property
comment: Contains details about the ad account's expired funding source.
alternate name: expired_funding_source_details
sub property of: expired funding source details
domain: Ad Account
range: Funding Source Details

extended credit invoice group
type: Property
comment: Represents the extended credit invoice group associated with the ad account.
alternate name: extended_credit_invoice_group
sub property of: extended credit invoice group
domain: Ad Account
range: Extended Credit Invoice Group

failed delivery checks
type: Property
comment: Lists delivery checks that the ad account has failed.
alternate name: failed_delivery_checks
sub property of: failed delivery checks
domain: Ad Account
range: Delivery Check

fb entity
type: Property
comment: Represents the Facebook entity associated with the ad account.
alternate name: fb_entity
sub property of: fb entity
domain: Ad Account
range: unsignedInt

funding source
type: Property
comment: Represents the ad account's funding source.
alternate name: funding_source
sub property of: funding source
domain: Ad Account
range: string

funding source details
type: Property
comment: Contains details about the ad account's funding source.
alternate name: funding_source_details
sub property of: funding source details
domain: Ad Account
range: Funding Source Details

has migrated permissions
type: Property
comment: Indicates whether the ad account has migrated permissions.
alternate name: has_migrated_permissions
sub property of: has migrated permissions
domain: Ad Account
range: boolean

has page authorized adaccount
type: Property
comment: Indicates whether a Page has authorized the ad account.
alternate name: has_page_authorized_adaccount
sub property of: has page authorized adaccount
domain: Ad Account
range: boolean

id
type: Property
comment: Identifies the ad account.
alternate name: id
sub property of: id
domain: Ad Account
range: string

io number
type: Property
comment: Represents the insertion order number associated with the ad account.
alternate name: io_number
sub property of: io number
domain: Ad Account
range: string

is attribution spec system default
type: Property
comment: Indicates whether the ad account's attribution specification is the system default.
alternate name: is_attribution_spec_system_default
sub property of: is attribution spec system default
domain: Ad Account
range: boolean

is ba skip delayed eligible
type: Property
comment: Indicates whether the ad account is eligible to skip delayed BA processing.
alternate name: is_ba_skip_delayed_eligible
sub property of: is ba skip delayed eligible
domain: Ad Account
range: boolean

is direct deals enabled
type: Property
comment: Indicates whether direct deals are enabled for the ad account.
alternate name: is_direct_deals_enabled
sub property of: is direct deals enabled
domain: Ad Account
range: boolean

is in3ds authorization enabled market
type: Property
comment: Indicates whether the ad account is in a market where 3DS authorization is enabled.
alternate name: is_in_3ds_authorization_enabled_market
sub property of: is in3ds authorization enabled market
domain: Ad Account
range: boolean

is notifications enabled
type: Property
comment: Indicates whether notifications are enabled for the ad account.
alternate name: is_notifications_enabled
sub property of: is notifications enabled
domain: Ad Account
range: boolean

is personal
type: Property
comment: Represents whether the ad account is personal.
alternate name: is_personal
sub property of: is personal
domain: Ad Account
range: unsignedInt

is prepay account
type: Property
comment: Indicates whether the ad account is a prepaid account.
alternate name: is_prepay_account
sub property of: is prepay account
domain: Ad Account
range: boolean

is tax id required
type: Property
comment: Indicates whether a tax ID is required for the ad account.
alternate name: is_tax_id_required
sub property of: is tax id required
domain: Ad Account
range: boolean

liable address
type: Property
comment: Contains the liable address associated with the ad account.
alternate name: liable_address
sub property of: liable address
domain: Ad Account
range: CRMAddress

line numbers
type: Property
comment: Lists line numbers associated with the ad account.
alternate name: line_numbers
sub property of: line numbers
domain: Ad Account
range: int

media agency
type: Property
comment: Represents the media agency associated with the ad account.
alternate name: media_agency
sub property of: media agency
domain: Ad Account
range: string

min campaign group spend cap
type: Property
comment: Represents the minimum campaign group spend cap for the ad account.
alternate name: min_campaign_group_spend_cap
sub property of: min campaign group spend cap
domain: Ad Account
range: string

min daily budget
type: Property
comment: Represents the minimum daily budget for the ad account.
alternate name: min_daily_budget
sub property of: min daily budget
domain: Ad Account
range: unsignedInt

name
type: Property
comment: Represents the ad account's name.
alternate name: name
sub property of: name
domain: Ad Account
range: string

offsite pixels tos accepted
type: Property
comment: Indicates whether the ad account has accepted the offsite pixels terms of service.
alternate name: offsite_pixels_tos_accepted
sub property of: offsite pixels tos accepted
domain: Ad Account
range: boolean

owner
type: Property
comment: Identifies the owner of the ad account.
alternate name: owner
domain: Ad Account
range: string

owner business
type: Property
comment: Represents the business that owns the ad account.
alternate name: owner_business
sub property of: owner business
domain: Ad Account
range: Business

partner
type: Property
comment: Represents the partner associated with the ad account.
alternate name: partner
sub property of: partner
domain: Ad Account
range: string

rf spec
type: Property
comment: Contains the ad account's reach and frequency specification.
alternate name: rf_spec
sub property of: rf spec
domain: Ad Account
range: Reach Frequency Spec

send bill to address
type: Property
comment: Contains the address to which bills for the ad account are sent.
alternate name: send_bill_to_address
sub property of: send bill to address
domain: Ad Account
range: CRMAddress

show checkout experience
type: Property
comment: Indicates whether the checkout experience is shown for the ad account.
alternate name: show_checkout_experience
sub property of: show checkout experience
domain: Ad Account
range: boolean

sold to address
type: Property
comment: Contains the sold-to address associated with the ad account.
alternate name: sold_to_address
sub property of: sold to address
domain: Ad Account
range: CRMAddress

spend cap
type: Property
comment: Represents the spending cap associated with the ad account.
alternate name: spend_cap
sub property of: spend cap
domain: Ad Account
range: string

tax id
type: Property
comment: Represents the tax identification value associated with the ad account.
alternate name: tax_id
sub property of: tax id
domain: Ad Account
range: string

tax id status
type: Property
comment: Represents the status of the ad account's tax identification information.
alternate name: tax_id_status
sub property of: tax id status
domain: Ad Account
range: unsignedInt

tax id type
type: Property
comment: Represents the type of tax identification associated with the ad account.
alternate name: tax_id_type
sub property of: tax id type
domain: Ad Account
range: string

timezone id
type: Property
comment: Represents the time zone identifier associated with the ad account.
alternate name: timezone_id
sub property of: timezone id
domain: Ad Account
range: unsignedInt

timezone name
type: Property
comment: Represents the name of the time zone associated with the ad account.
alternate name: timezone_name
sub property of: timezone name
domain: Ad Account
range: string

timezone offset hours utc
type: Property
comment: Represents the ad account's time zone offset from UTC in hours.
alternate name: timezone_offset_hours_utc
sub property of: timezone offset hours utc
domain: Ad Account
range: double

tos accepted
type: Property
comment: Represents terms-of-service acceptance information for the ad account.
alternate name: tos_accepted
sub property of: tos accepted
domain: Ad Account
range: Tos Accepted Record

user access expire time
type: Property
comment: Represents when user access to the ad account expires.
alternate name: user_access_expire_time
sub property of: user access expire time
domain: Ad Account
range: dateTime

user tasks
type: Property
comment: Represents tasks associated with users of the ad account.
alternate name: user_tasks
sub property of: user tasks
domain: Ad Account
range: string

user tos accepted
type: Property
comment: Represents terms-of-service acceptance information for users of the ad account.
alternate name: user_tos_accepted
sub property of: user tos accepted
domain: Ad Account
range: User Tos Accepted Record

viewable business
type: Property
comment: Represents the business viewable through the ad account.
alternate name: viewable_business
sub property of: viewable business
domain: Ad Account
range: Business

opportunity score
type: Property
comment: Represents the opportunity score associated with the ad account.
alternate name: opportunity_score
sub property of: opportunity score
domain: Ad Account
range: double
added in version: v24

marketing messages settings
type: Property
comment: Represents the marketing messages settings for the ad account.
alternate name: marketing_messages_settings
sub property of: marketing messages settings
domain: Ad Account
range: Ad Account Marketing Messages Settings
added in version: v25

offsite clo signal status
type: Property
comment: Represents the status of the ad account's offsite CLO signal.
alternate name: offsite_clo_signal_status
sub property of: offsite clo signal status
domain: Ad Account
range: int
added in version: v25

promotable app ids
type: Property
comment: Represents the app identifiers for apps promotable through the ad account.
alternate name: promotable_app_ids
sub property of: promotable app ids
domain: Ad Account Promotable Objects
range: string

promotable page ids
type: Property
comment: Represents the Page identifiers for Pages promotable through the ad account.
alternate name: promotable_page_ids
sub property of: promotable page ids
domain: Ad Account Promotable Objects
range: string

promotable urls
type: Property
comment: Represents the URLs promotable through the ad account.
alternate name: promotable_urls
sub property of: promotable urls
domain: Ad Account Promotable Objects
range: string

agency representing client
type: Property
comment: Represents the agency's representation of the client.
alternate name: agency_representing_client
sub property of: agency representing client
domain: Agency Client Declaration
range: unsignedInt

client based in france
type: Property
comment: Represents whether the client is based in France.
alternate name: client_based_in_france
sub property of: client based in france
domain: Agency Client Declaration
range: unsignedInt

client city
type: Property
comment: Represents the client's city.
alternate name: client_city
sub property of: client city
domain: Agency Client Declaration
range: string

client country code
type: Property
comment: Represents the client's country code.
alternate name: client_country_code
sub property of: client country code
domain: Agency Client Declaration
range: string

client email address
type: Property
comment: Represents the client's email address.
alternate name: client_email_address
sub property of: client email address
domain: Agency Client Declaration
range: string

client name
type: Property
comment: Represents the client's name.
alternate name: client_name
sub property of: client name
domain: Agency Client Declaration
range: string

client postal code
type: Property
comment: Represents the client's postal code.
alternate name: client_postal_code
sub property of: client postal code
domain: Agency Client Declaration
range: string

client province
type: Property
comment: Represents the client's province.
alternate name: client_province
sub property of: client province
domain: Agency Client Declaration
range: string

client street
type: Property
comment: Represents the client's street address.
alternate name: client_street
sub property of: client street
domain: Agency Client Declaration
range: string

client street2
type: Property
comment: Represents the second line of the client's street address.
alternate name: client_street2
sub property of: client street2
domain: Agency Client Declaration
range: string

has written mandate from advertiser
type: Property
comment: Represents whether the agency has a written mandate from the advertiser.
alternate name: has_written_mandate_from_advertiser
sub property of: has written mandate from advertiser
domain: Agency Client Declaration
range: unsignedInt

is client paying invoices
type: Property
comment: Represents whether the client is paying invoices.
alternate name: is_client_paying_invoices
sub property of: is client paying invoices
domain: Agency Client Declaration
range: unsignedInt

event type
type: Property
comment: Represents the event type used by the attribution specification.
alternate name: event_type
sub property of: event type
domain: Attribution Spec
range: string

window days
type: Property
comment: Represents the number of days in the attribution window.
alternate name: window_days
sub property of: window days
domain: Attribution Spec
range: int

block offline analytics
type: Property
comment: Indicates whether offline analytics are blocked for the business.
alternate name: block_offline_analytics
sub property of: block offline analytics
domain: Business
range: boolean

collaborative ads managed partner business info
type: Property
comment: Represents managed partner business information for collaborative ads.
alternate name: collaborative_ads_managed_partner_business_info
sub property of: collaborative ads managed partner business info
domain: Business
range: Managed Partner Business

collaborative ads managed partner eligibility
type: Property
comment: Represents the business's managed partner eligibility for collaborative ads.
alternate name: collaborative_ads_managed_partner_eligibility
sub property of: collaborative ads managed partner eligibility
domain: Business
range: Business Managed Partner Eligibility

collaborative ads partner premium options
type: Property
comment: Represents premium partner options for collaborative ads.
alternate name: collaborative_ads_partner_premium_options
sub property of: collaborative ads partner premium options
domain: Business
range: Business Partner Premium Options

created by
type: Property
comment: Represents the entity that created the business.
alternate name: created_by
domain: Business
range: JSON

created time
type: Property
comment: Represents when the business was created.
alternate name: created_time
domain: Business
range: dateTime

extended updated time
type: Property
comment: Represents the extended update time of the business.
alternate name: extended_updated_time
sub property of: extended updated time
domain: Business
range: dateTime

id
type: Property
comment: Identifies the business.
alternate name: id
sub property of: id
domain: Business
range: string

is hidden
type: Property
comment: Indicates whether the business is hidden.
alternate name: is_hidden
sub property of: is hidden
domain: Business
range: boolean

link
type: Property
comment: Represents the link associated with the business.
alternate name: link
sub property of: link
domain: Business
range: string

marketing messages onboarding status
type: Property
comment: Represents the business's onboarding status for marketing messages.
alternate name: marketing_messages_onboarding_status
sub property of: marketing messages onboarding status
domain: Business
range: Marketing Messages Onboarding Status

name
type: Property
comment: The name associated with the business.
alternate name: name
sub property of: name
domain: Business
range: string

payment account id
type: Property
comment: The identifier of the business's payment account.
alternate name: payment_account_id
sub property of: payment account id
domain: Business
range: string

primary page
type: Property
comment: The page designated as the business's primary page.
alternate name: primary_page
sub property of: primary page
domain: Business
range: Page

profile picture uri
type: Property
comment: The URI of the business's profile picture.
alternate name: profile_picture_uri
sub property of: profile picture uri
domain: Business
range: string

timezone id
type: Property
comment: The identifier of the business's time zone.
alternate name: timezone_id
sub property of: timezone id
domain: Business
range: unsignedInt

two factor type
type: Property
comment: The type of two-factor authentication associated with the business.
alternate name: two_factor_type
sub property of: two factor type
domain: Business
range: string

updated by
type: Property
comment: The object representing who or what last updated the business.
alternate name: updated_by
domain: Business
range: JSON

updated time
type: Property
comment: The time when the business was last updated.
alternate name: updated_time
domain: Business
range: dateTime

user access expire time
type: Property
comment: The time when user access to the business expires.
alternate name: user_access_expire_time
sub property of: user access expire time
domain: Business
range: dateTime

verification status
type: Property
comment: The business's verification status, such as pending, rejected, or verified.
alternate name: verification_status
sub property of: verification status
domain: Business
range: string
code list: BusinessVerificationStatus

vertical
type: Property
comment: The business's vertical.
alternate name: vertical
sub property of: vertical
domain: Business
range: string

vertical id
type: Property
comment: The identifier of the business's vertical.
alternate name: vertical_id
sub property of: vertical id
domain: Business
range: unsignedInt

whatsapp business manager messaging limit
type: Property
comment: The WhatsApp Business Manager messaging limit tier associated with the business.
alternate name: whatsapp_business_manager_messaging_limit
sub property of: whatsapp business manager messaging limit
domain: Business
range: string
code list: BusinessWhatsappBusinessManagerMessagingLimit

ad account
type: Property
comment: Contains the advertising account associated with the managed partner business.
alternate name: ad_account
sub property of: ad account
domain: Managed Partner Business
range: Ad Account

catalog segment
type: Property
comment: Contains the product catalog associated with the managed partner business.
alternate name: catalog_segment
sub property of: catalog segment
domain: Managed Partner Business
range: Product Catalog

extended credit
type: Property
comment: Contains the extended credit associated with the managed partner business.
alternate name: extended_credit
sub property of: extended credit
domain: Managed Partner Business
range: Managed Partner Extended Credit

page
type: Property
comment: Contains the Page associated with the managed partner business.
alternate name: page
domain: Managed Partner Business
range: Page

seller business info
type: Property
comment: Contains seller business information associated with the managed partner business.
alternate name: seller_business_info
sub property of: seller business info
domain: Managed Partner Business
range: JSON

seller business status
type: Property
comment: Represents the seller business status of the managed partner business.
alternate name: seller_business_status
sub property of: seller business status
domain: Managed Partner Business
range: string

template
type: Property
comment: Contains templates associated with the managed partner business.
alternate name: template
sub property of: template
domain: Managed Partner Business
range: JSON

ad account to collaborative ads share settings
type: Property
comment: Collaborative ads sharing settings associated with ad accounts for the product catalog.
alternate name: ad_account_to_collaborative_ads_share_settings
sub property of: ad account to collaborative ads share settings
domain: Product Catalog
range: Collaborative Ads Share Settings

agency collaborative ads share settings
type: Property
comment: Collaborative ads sharing settings associated with an agency for the product catalog.
alternate name: agency_collaborative_ads_share_settings
sub property of: agency collaborative ads share settings
domain: Product Catalog
range: Collaborative Ads Share Settings

business
type: Property
comment: The business associated with the product catalog.
alternate name: business
domain: Product Catalog
range: Business

catalog store
type: Property
comment: Store catalog settings associated with the product catalog.
alternate name: catalog_store
sub property of: catalog store
domain: Product Catalog
range: Store Catalog Settings

commerce merchant settings
type: Property
comment: Commerce merchant settings associated with the product catalog.
alternate name: commerce_merchant_settings
sub property of: commerce merchant settings
domain: Product Catalog
range: Commerce Merchant Settings

creator user
type: Property
comment: The user who created the product catalog.
alternate name: creator_user
sub property of: creator user
domain: Product Catalog
range: User

da display settings
type: Property
comment: Image display settings for the product catalog.
alternate name: da_display_settings
sub property of: da display settings
domain: Product Catalog
range: Product Catalog Image Settings

default image url
type: Property
comment: The URL of the default image for the product catalog.
alternate name: default_image_url
sub property of: default image url
domain: Product Catalog
range: string

fallback image url
type: Property
comment: URLs of fallback images for the product catalog.
alternate name: fallback_image_url
sub property of: fallback image url
domain: Product Catalog
range: string

feed count
type: Property
comment: The number of feeds associated with the product catalog.
alternate name: feed_count
sub property of: feed count
domain: Product Catalog
range: int

id
type: Property
comment: The identifier of the product catalog.
alternate name: id
sub property of: id
domain: Product Catalog
range: string

is catalog segment
type: Property
comment: Indicates whether the product catalog is a catalog segment.
alternate name: is_catalog_segment
sub property of: is catalog segment
domain: Product Catalog
range: boolean

is local catalog
type: Property
comment: Indicates whether the product catalog is local.
alternate name: is_local_catalog
sub property of: is local catalog
domain: Product Catalog
range: boolean

name
type: Property
comment: The name of the product catalog.
alternate name: name
sub property of: name
domain: Product Catalog
range: string

owner business
type: Property
comment: The business that owns the product catalog.
alternate name: owner_business
sub property of: owner business
domain: Product Catalog
range: Business

product count
type: Property
comment: The number of products in the product catalog.
alternate name: product_count
domain: Product Catalog
range: int

show assign permissions
type: Property
comment: Indicates whether assign permissions are shown for the product catalog.
alternate name: show_assign_permissions
sub property of: show assign permissions
domain: Product Catalog
range: boolean

store catalog settings
type: Property
comment: Store catalog settings associated with the product catalog.
alternate name: store_catalog_settings
sub property of: store catalog settings
domain: Product Catalog
range: Store Catalog Settings

user access expire time
type: Property
comment: The time at which user access to the product catalog expires.
alternate name: user_access_expire_time
sub property of: user access expire time
domain: Product Catalog
range: dateTime

vertical
type: Property
comment: The vertical associated with the product catalog.
alternate name: vertical
sub property of: vertical
domain: Product Catalog
range: string

agency business
type: Property
comment: The agency business associated with the collaborative ads sharing settings.
alternate name: agency_business
sub property of: agency business
domain: Collaborative Ads Share Settings
range: Business

id
type: Property
comment: The identifier of the collaborative ads sharing settings.
alternate name: id
sub property of: id
domain: Collaborative Ads Share Settings
range: string

product catalog proxy id
type: Property
comment: The identifier of the product catalog proxy associated with the sharing settings.
alternate name: product_catalog_proxy_id
sub property of: product catalog proxy id
domain: Collaborative Ads Share Settings
range: string

utm campaign
type: Property
comment: The UTM campaign value in the sharing settings.
alternate name: utm_campaign
sub property of: utm campaign
domain: Collaborative Ads Share Settings
range: string

utm medium
type: Property
comment: The UTM medium value in the sharing settings.
alternate name: utm_medium
sub property of: utm medium
domain: Collaborative Ads Share Settings
range: string

utm source
type: Property
comment: The UTM source value in the sharing settings.
alternate name: utm_source
sub property of: utm source
domain: Collaborative Ads Share Settings
range: string

id
type: Property
comment: Identifies the store catalog settings record.
alternate name: id
sub property of: id
domain: Store Catalog Settings
range: string

page
type: Property
comment: Represents the Page associated with the store catalog settings.
alternate name: page
domain: Store Catalog Settings
range: Page

about
type: Property
comment: Represents information about the Page.
alternate name: about
sub property of: about
domain: Page
range: string

access token
type: Property
comment: Represents the access token associated with the Page.
alternate name: access_token
sub property of: access token
domain: Page
range: string

ad campaign
type: Property
comment: Contains the ad set associated with the Page.
alternate name: ad_campaign
sub property of: ad campaign
domain: Page
range: Ad Set

affiliation
type: Property
comment: Represents the affiliation associated with the Page.
alternate name: affiliation
sub property of: affiliation
domain: Page
range: string

app id
type: Property
comment: Identifies the app associated with the Page.
alternate name: app_id
sub property of: app id
domain: Page
range: string

artists we like
type: Property
comment: Represents the artists the Page likes.
alternate name: artists_we_like
sub property of: artists we like
domain: Page
range: string

attire
type: Property
comment: Represents the attire associated with the Page.
alternate name: attire
sub property of: attire
domain: Page
range: string

available promo offer ids
type: Property
comment: Contains identifiers for promotional offers available to the Page.
alternate name: available_promo_offer_ids
sub property of: available promo offer ids
domain: Page
range: Available Promo Offer Ids Record

awards
type: Property
comment: Represents the awards associated with the Page.
alternate name: awards
sub property of: awards
domain: Page
range: string

band interests
type: Property
comment: Represents the band's interests associated with the Page.
alternate name: band_interests
sub property of: band interests
domain: Page
range: string

band members
type: Property
comment: Represents the band members associated with the Page.
alternate name: band_members
sub property of: band members
domain: Page
range: string

best page
type: Property
comment: Contains the Page identified as the best Page.
alternate name: best_page
sub property of: best page
domain: Page
range: Page

bio
type: Property
comment: Represents the biography associated with the Page.
alternate name: bio
sub property of: bio
domain: Page
range: string

birthday
type: Property
comment: Represents the birthday associated with the Page.
alternate name: birthday
sub property of: birthday
domain: Page
range: string

booking agent
type: Property
comment: Represents the booking agent associated with the Page.
alternate name: booking_agent
sub property of: booking agent
domain: Page
range: string

breaking news usage
type: Property
comment: Represents information about the Page's breaking-news usage.
alternate name: breaking_news_usage
sub property of: breaking news usage
domain: Page
range: JSON

built
type: Property
comment: Represents when the Page was built.
alternate name: built
sub property of: built
domain: Page
range: string

business
type: Property
comment: Represents business information associated with the Page.
alternate name: business
domain: Page
range: JSON

can checkin
type: Property
comment: Indicates whether check-ins can be made on the Page.
alternate name: can_checkin
sub property of: can checkin
domain: Page
range: boolean

can post
type: Property
comment: Indicates whether posts can be made on the Page.
alternate name: can_post
sub property of: can post
domain: Page
range: boolean

category
type: Property
comment: Represents the Page's category.
alternate name: category
sub property of: category
domain: Page
range: string

category list
type: Property
comment: Represents the categories associated with the Page.
alternate name: category_list
sub property of: category list
domain: Page
range: Page Category

checkins
type: Property
comment: Represents the number of check-ins associated with the Page.
alternate name: checkins
sub property of: checkins
domain: Page
range: unsignedInt

company overview
type: Property
comment: Represents the Page's company overview.
alternate name: company_overview
sub property of: company overview
domain: Page
range: string

connected instagram account
type: Property
comment: Represents an Instagram account connected to the Page.
alternate name: connected_instagram_account
sub property of: connected instagram account
domain: Page
range: IGUser

connected page backed instagram account
type: Property
comment: Represents an Instagram account backed by and connected to the Page.
alternate name: connected_page_backed_instagram_account
sub property of: connected page backed instagram account
domain: Page
range: IGUser

contact address
type: Property
comment: Represents the Page's contact mailing address.
alternate name: contact_address
sub property of: contact address
domain: Page
range: Mailing Address

copyright attribution insights
type: Property
comment: Represents copyright attribution insights for the Page.
alternate name: copyright_attribution_insights
sub property of: copyright attribution insights
domain: Page
range: Copyright Attribution Insights

copyright whitelisted ig partners
type: Property
comment: Represents Instagram partners that are whitelisted for the Page's copyright.
alternate name: copyright_whitelisted_ig_partners
sub property of: copyright whitelisted ig partners
domain: Page
range: string

country page likes
type: Property
comment: Represents the number of Page likes by country.
alternate name: country_page_likes
sub property of: country page likes
domain: Page
range: unsignedInt

cover
type: Property
comment: Represents the Page's cover photo.
alternate name: cover
domain: Page
range: Cover Photo

culinary team
type: Property
comment: Represents the Page's culinary team.
alternate name: culinary_team
sub property of: culinary team
domain: Page
range: string

current location
type: Property
comment: Represents the Page's current location.
alternate name: current_location
sub property of: current location
domain: Page
range: string

delivery and pickup option info
type: Property
comment: Represents information about the Page's delivery and pickup options.
alternate name: delivery_and_pickup_option_info
sub property of: delivery and pickup option info
domain: Page
range: string

description
type: Property
comment: Represents the Page's description.
alternate name: description
sub property of: description
domain: Page
range: string

description html
type: Property
comment: Represents the Page's description in HTML form.
alternate name: description_html
sub property of: description html
domain: Page
range: string

differently open offerings
type: Property
comment: Represents offerings whose opening arrangements differ for the Page.
alternate name: differently_open_offerings
sub property of: differently open offerings
domain: Page
range: Differently Open Offerings Record

directed by
type: Property
comment: Represents the person or people associated with directing the Page's subject.
alternate name: directed_by
sub property of: directed by
domain: Page
range: string

display subtext
type: Property
comment: Represents supplementary text displayed for the Page.
alternate name: display_subtext
sub property of: display subtext
domain: Page
range: string

displayed message response time
type: Property
comment: Represents the message response time displayed for the Page.
alternate name: displayed_message_response_time
sub property of: displayed message response time
domain: Page
range: string

does viewer have page permission link ig
type: Property
comment: Indicates whether the viewer has the Page permission to link Instagram.
alternate name: does_viewer_have_page_permission_link_ig
sub property of: does viewer have page permission link ig
domain: Page
range: boolean

emails
type: Property
comment: Represents email addresses associated with the Page.
alternate name: emails
sub property of: emails
domain: Page
range: string

engagement
type: Property
comment: Represents engagement information for the Page.
alternate name: engagement
sub property of: engagement
domain: Page
range: Engagement

fan count
type: Property
comment: Represents the number of fans associated with the Page.
alternate name: fan_count
sub property of: fan count
domain: Page
range: unsignedInt

featured video
type: Property
comment: Represents the video featured by the Page.
alternate name: featured_video
sub property of: featured video
domain: Page
range: Ad Video

features
type: Property
comment: Represents features associated with the Page.
alternate name: features
sub property of: features
domain: Page
range: string

followers count
type: Property
comment: Represents the number of followers of the Page.
alternate name: followers_count
domain: Page
range: unsignedInt

food styles
type: Property
comment: Represents food styles associated with the Page.
alternate name: food_styles
sub property of: food styles
domain: Page
range: string

founded
type: Property
comment: Represents when the Page's subject was founded.
alternate name: founded
sub property of: founded
domain: Page
range: string

general info
type: Property
comment: Represents general information about the Page.
alternate name: general_info
sub property of: general info
domain: Page
range: string

general manager
type: Property
comment: Represents the Page's general manager.
alternate name: general_manager
sub property of: general manager
domain: Page
range: string

genre
type: Property
comment: Represents the Page's genre.
alternate name: genre
sub property of: genre
domain: Page
range: string

global brand page name
type: Property
comment: Represents the global brand Page name associated with the Page.
alternate name: global_brand_page_name
sub property of: global brand page name
domain: Page
range: string

global brand root id
type: Property
comment: Represents the identifier of the global brand root associated with the Page.
alternate name: global_brand_root_id
sub property of: global brand root id
domain: Page
range: string

has added app
type: Property
comment: Indicates whether an app has been added to the Page.
alternate name: has_added_app
sub property of: has added app
domain: Page
range: boolean

has lead access
type: Property
comment: Represents the Page's lead access status.
alternate name: has_lead_access
sub property of: has lead access
domain: Page
range: Has Lead Access

has transitioned to new page experience
type: Property
comment: Indicates whether the Page has transitioned to the new Page experience.
alternate name: has_transitioned_to_new_page_experience
sub property of: has transitioned to new page experience
domain: Page
range: boolean

has whatsapp business number
type: Property
comment: Indicates whether the Page has a WhatsApp Business number.
alternate name: has_whatsapp_business_number
sub property of: has whatsapp business number
domain: Page
range: boolean

has whatsapp number
type: Property
comment: Indicates whether the Page has a WhatsApp number.
alternate name: has_whatsapp_number
sub property of: has whatsapp number
domain: Page
range: boolean

hometown
type: Property
comment: Represents the Page's hometown.
alternate name: hometown
domain: Page
range: string

hours
type: Property
comment: Represents the Page's hours.
alternate name: hours
sub property of: hours
domain: Page
range: Hours Record

id
type: Property
comment: Represents the Page's identifier.
alternate name: id
sub property of: id
domain: Page
range: string

impressum
type: Property
comment: Represents the Page's impressum information.
alternate name: impressum
sub property of: impressum
domain: Page
range: string

influences
type: Property
comment: Represents influences associated with the Page.
alternate name: influences
sub property of: influences
domain: Page
range: string

instagram business account
type: Property
comment: Represents the Instagram business account associated with the Page.
alternate name: instagram_business_account
sub property of: instagram business account
domain: Page
range: IGUser

is always open
type: Property
comment: Indicates whether the Page is always open.
alternate name: is_always_open
sub property of: is always open
domain: Page
range: boolean

is calling eligible
type: Property
comment: Indicates whether the Page is eligible for calling.
alternate name: is_calling_eligible
sub property of: is calling eligible
domain: Page
range: boolean

is chain
type: Property
comment: Indicates whether the Page represents a chain.
alternate name: is_chain
sub property of: is chain
domain: Page
range: boolean

is community page
type: Property
comment: Indicates whether the Page is a community Page.
alternate name: is_community_page
sub property of: is community page
domain: Page
range: boolean

is eligible for branded content
type: Property
comment: Indicates whether the Page is eligible for branded content.
alternate name: is_eligible_for_branded_content
sub property of: is eligible for branded content
domain: Page
range: boolean

is eligible for disable connect ig btn for non page admin am web
type: Property
comment: Indicates whether the Page is eligible to disable the connect-Instagram button for non-Page administrators on the web.
alternate name: is_eligible_for_disable_connect_ig_btn_for_non_page_admin_am_web
sub property of: is eligible for disable connect ig btn for non page admin am web
domain: Page
range: boolean

is messenger bot get started enabled
type: Property
comment: Indicates whether the Messenger bot Get Started feature is enabled for the Page.
alternate name: is_messenger_bot_get_started_enabled
sub property of: is messenger bot get started enabled
domain: Page
range: boolean

is messenger platform bot
type: Property
comment: Indicates whether the Page is a Messenger platform bot.
alternate name: is_messenger_platform_bot
sub property of: is messenger platform bot
domain: Page
range: boolean

is owned
type: Property
comment: Indicates whether the Page is owned.
alternate name: is_owned
sub property of: is owned
domain: Page
range: boolean

is permanently closed
type: Property
comment: Indicates whether the Page is permanently closed.
alternate name: is_permanently_closed
sub property of: is permanently closed
domain: Page
range: boolean

is published
type: Property
comment: Indicates whether the Page is published.
alternate name: is_published
sub property of: is published
domain: Page
range: boolean

is unclaimed
type: Property
comment: Indicates whether the Page is unclaimed.
alternate name: is_unclaimed
sub property of: is unclaimed
domain: Page
range: boolean

is verified
type: Property
comment: Indicates whether the Page is verified.
alternate name: is_verified
sub property of: is verified
domain: Page
range: boolean

is webhooks subscribed
type: Property
comment: Indicates whether the Page is subscribed to webhooks.
alternate name: is_webhooks_subscribed
sub property of: is webhooks subscribed
domain: Page
range: boolean

keywords
type: Property
comment: Represents keywords associated with the Page.
alternate name: keywords
domain: Page
range: JSON

leadgen tos acceptance time
type: Property
comment: Represents when the Page's lead-generation terms of service were accepted.
alternate name: leadgen_tos_acceptance_time
sub property of: leadgen tos acceptance time
domain: Page
range: dateTime

leadgen tos accepted
type: Property
comment: Indicates whether the Page's lead-generation terms of service were accepted.
alternate name: leadgen_tos_accepted
sub property of: leadgen tos accepted
domain: Page
range: boolean

leadgen tos accepting user
type: Property
comment: Represents the user who accepted the Page's lead-generation terms of service.
alternate name: leadgen_tos_accepting_user
sub property of: leadgen tos accepting user
domain: Page
range: User

link
type: Property
comment: Represents the Page's link.
alternate name: link
sub property of: link
domain: Page
range: string

location
type: Property
comment: Represents the Page's location.
alternate name: location
domain: Page
range: Location

members
type: Property
comment: Represents members associated with the Page.
alternate name: members
sub property of: members
domain: Page
range: string

merchant id
type: Property
comment: Represents the merchant identifier associated with the Page.
alternate name: merchant_id
sub property of: merchant id
domain: Page
range: string

merchant review status
type: Property
comment: Represents the Page's merchant review status.
alternate name: merchant_review_status
sub property of: merchant review status
domain: Page
range: string

messaging feature status
type: Property
comment: Represents the status of messaging features for the Page.
alternate name: messaging_feature_status
sub property of: messaging feature status
domain: Page
range: Messaging Feature Status

messenger ads default icebreakers
type: Property
comment: Represents the default icebreakers for the Page's Messenger ads.
alternate name: messenger_ads_default_icebreakers
sub property of: messenger ads default icebreakers
domain: Page
range: string

messenger ads default quick replies
type: Property
comment: Represents the default quick replies for the Page's Messenger ads.
alternate name: messenger_ads_default_quick_replies
sub property of: messenger ads default quick replies
domain: Page
range: string

messenger ads quick replies type
type: Property
comment: Represents the quick-reply type used by the Page's Messenger ads.
alternate name: messenger_ads_quick_replies_type
sub property of: messenger ads quick replies type
domain: Page
range: string

mini shop storefront
type: Property
comment: Represents the Page's mini-shop storefront.
alternate name: mini_shop_storefront
sub property of: mini shop storefront
domain: Page
range: Shop

mission
type: Property
comment: Represents the Page's mission.
alternate name: mission
sub property of: mission
domain: Page
range: string

mpg
type: Property
comment: Represents the Page's MPG information.
alternate name: mpg
sub property of: mpg
domain: Page
range: string

name
type: Property
comment: Represents the Page's name.
alternate name: name
sub property of: name
domain: Page
range: string

name with location descriptor
type: Property
comment: Represents the Page's name together with its location descriptor.
alternate name: name_with_location_descriptor
sub property of: name with location descriptor
domain: Page
range: string

network
type: Property
comment: Represents the network associated with the Page.
alternate name: network
sub property of: network
domain: Page
range: string

new like count
type: Property
comment: Represents the number of new likes for the Page.
alternate name: new_like_count
sub property of: new like count
domain: Page
range: unsignedInt

offer eligible
type: Property
comment: Indicates whether the Page is eligible for offers.
alternate name: offer_eligible
sub property of: offer eligible
domain: Page
range: boolean

overall star rating
type: Property
comment: Represents the Page's overall star rating.
alternate name: overall_star_rating
sub property of: overall star rating
domain: Page
range: double

owner business
type: Property
comment: Represents the business that owns the Page.
alternate name: owner_business
sub property of: owner business
domain: Page
range: Business

page backed threads account id
type: Property
comment: Represents the identifier of the Threads account backed by the Page.
alternate name: page_backed_threads_account_id
sub property of: page backed threads account id
domain: Page
range: string

page token
type: Property
comment: Represents the token associated with the Page.
alternate name: page_token
sub property of: page token
domain: Page
range: string

parent page
type: Property
comment: Represents the parent Page.
alternate name: parent_page
sub property of: parent page
domain: Page
range: Page

parking
type: Property
comment: Represents parking information for the Page.
alternate name: parking
sub property of: parking
domain: Page
range: Page Parking

payment options
type: Property
comment: Represents payment options associated with the Page.
alternate name: payment_options
sub property of: payment options
domain: Page
range: Page Payment Options

personal info
type: Property
comment: Represents personal information associated with the Page.
alternate name: personal_info
sub property of: personal info
domain: Page
range: string

personal interests
type: Property
comment: Represents personal interests associated with the Page.
alternate name: personal_interests
sub property of: personal interests
domain: Page
range: string

pharma safety info
type: Property
comment: Represents pharmaceutical safety information for the Page.
alternate name: pharma_safety_info
sub property of: pharma safety info
domain: Page
range: string

phone
type: Property
comment: Represents the Page's phone number.
alternate name: phone
sub property of: phone
domain: Page
range: string

pickup options
type: Property
comment: Represents pickup options associated with the Page.
alternate name: pickup_options
sub property of: pickup options
domain: Page
range: string

place type
type: Property
comment: Represents the Page's place type.
alternate name: place_type
sub property of: place type
domain: Page
range: string

plot outline
type: Property
comment: Represents the Page's plot outline.
alternate name: plot_outline
sub property of: plot outline
domain: Page
range: string

preferred audience
type: Property
comment: Represents the Page's preferred audience.
alternate name: preferred_audience
sub property of: preferred audience
domain: Page
range: Targeting

press contact
type: Property
comment: Represents the Page's press contact information.
alternate name: press_contact
sub property of: press contact
domain: Page
range: string

price range
type: Property
comment: Represents the Page's price range.
alternate name: price_range
sub property of: price range
domain: Page
range: string

priority hours
type: Property
comment: Represents the Page's priority hours.
alternate name: priority_hours
sub property of: priority hours
domain: Page
range: Priority Hours Record

privacy info url
type: Property
comment: Represents the URL for the Page's privacy information.
alternate name: privacy_info_url
sub property of: privacy info url
domain: Page
range: string

produced by
type: Property
comment: Represents who produced the Page's associated work.
alternate name: produced_by
sub property of: produced by
domain: Page
range: string

products
type: Property
comment: Represents the products associated with the Page.
alternate name: products
sub property of: products
domain: Page
range: string

promotion eligible
type: Property
comment: Indicates whether the Page is eligible for promotion.
alternate name: promotion_eligible
sub property of: promotion eligible
domain: Page
range: boolean

promotion ineligible reason
type: Property
comment: Represents the reason the Page is not eligible for promotion.
alternate name: promotion_ineligible_reason
sub property of: promotion ineligible reason
domain: Page
range: string

public transit
type: Property
comment: Represents public transit information for the Page.
alternate name: public_transit
sub property of: public transit
domain: Page
range: string

rating count
type: Property
comment: Represents the number of ratings associated with the Page.
alternate name: rating_count
sub property of: rating count
domain: Page
range: unsignedInt

recipient
type: Property
comment: Represents the recipient associated with the Page.
alternate name: recipient
sub property of: recipient
domain: Page
range: string

record label
type: Property
comment: Represents the record label associated with the Page.
alternate name: record_label
sub property of: record label
domain: Page
range: string

release date
type: Property
comment: Represents the release date associated with the Page.
alternate name: release_date
sub property of: release date
domain: Page
range: string

restaurant services
type: Property
comment: Represents the restaurant services associated with the Page.
alternate name: restaurant_services
sub property of: restaurant services
domain: Page
range: Page Restaurant Services

restaurant specialties
type: Property
comment: Represents the restaurant specialties associated with the Page.
alternate name: restaurant_specialties
sub property of: restaurant specialties
domain: Page
range: Page Restaurant Specialties

schedule
type: Property
comment: Represents the Page's schedule.
alternate name: schedule
sub property of: schedule
domain: Page
range: string

screenplay by
type: Property
comment: Represents who wrote the screenplay associated with the Page.
alternate name: screenplay_by
sub property of: screenplay by
domain: Page
range: string

season
type: Property
comment: Represents the season associated with the Page.
alternate name: season
sub property of: season
domain: Page
range: string

single line address
type: Property
comment: Represents the Page's address in a single line.
alternate name: single_line_address
sub property of: single line address
domain: Page
range: string

starring
type: Property
comment: Represents the starring information associated with the Page.
alternate name: starring
sub property of: starring
domain: Page
range: string

start info
type: Property
comment: Represents the Page's start information.
alternate name: start_info
sub property of: start info
domain: Page
range: Page Start Info

store code
type: Property
comment: Represents the code associated with the Page's store.
alternate name: store_code
sub property of: store code
domain: Page
range: string

store location descriptor
type: Property
comment: Represents the location descriptor associated with the Page's store.
alternate name: store_location_descriptor
sub property of: store location descriptor
domain: Page
range: string

store number
type: Property
comment: Represents the number associated with the Page's store.
alternate name: store_number
sub property of: store number
domain: Page
range: unsignedInt

studio
type: Property
comment: Represents the studio associated with the Page.
alternate name: studio
sub property of: studio
domain: Page
range: string

supports donate button in live video
type: Property
comment: Indicates whether the Page supports a donate button in live video.
alternate name: supports_donate_button_in_live_video
sub property of: supports donate button in live video
domain: Page
range: boolean

talking about count
type: Property
comment: Represents the number associated with people talking about the Page.
alternate name: talking_about_count
sub property of: talking about count
domain: Page
range: unsignedInt

temporary status
type: Property
comment: Represents the Page's temporary status.
alternate name: temporary_status
sub property of: temporary status
domain: Page
range: string

unread message count
type: Property
comment: Represents the number of unread messages associated with the Page.
alternate name: unread_message_count
sub property of: unread message count
domain: Page
range: unsignedInt

unread notif count
type: Property
comment: Represents the number of unread notifications associated with the Page.
alternate name: unread_notif_count
sub property of: unread notif count
domain: Page
range: unsignedInt

unseen message count
type: Property
comment: Represents the number of unseen messages associated with the Page.
alternate name: unseen_message_count
sub property of: unseen message count
domain: Page
range: unsignedInt

user access expire time
type: Property
comment: Represents when the user's access to the Page expires.
alternate name: user_access_expire_time
sub property of: user access expire time
domain: Page
range: dateTime

username
type: Property
comment: Represents the Page's username.
alternate name: username
sub property of: username
domain: Page
range: string

verification status
type: Property
comment: Represents the Page's verification status.
alternate name: verification_status
sub property of: verification status
domain: Page
range: string

voip info
type: Property
comment: Represents the Page's voice-over-IP information.
alternate name: voip_info
sub property of: voip info
domain: Page
range: Voip Info

website
type: Property
comment: Represents the website associated with the Page.
alternate name: website
domain: Page
range: string

were here count
type: Property
comment: Represents the number associated with people who were at the Page's place.
alternate name: were_here_count
sub property of: were here count
domain: Page
range: unsignedInt

whatsapp number
type: Property
comment: Represents the Page's WhatsApp number.
alternate name: whatsapp_number
sub property of: whatsapp number
domain: Page
range: string

written by
type: Property
comment: Represents who wrote the work associated with the Page.
alternate name: written_by
sub property of: written by
domain: Page
range: string

account id
type: Property
comment: Identifies the account associated with the ad set.
alternate name: account_id
sub property of: account id
domain: Ad Set
range: string

adlabels
type: Property
comment: Contains the ad labels associated with the ad set.
alternate name: adlabels
domain: Ad Set
range: Ad Label

adset schedule
type: Property
comment: Contains the day-part schedule associated with the ad set.
alternate name: adset_schedule
sub property of: adset schedule
domain: Ad Set
range: Day Part

asset feed id
type: Property
comment: Identifies the asset feed associated with the ad set.
alternate name: asset_feed_id
sub property of: asset feed id
domain: Ad Set
range: string

attribution spec
type: Property
comment: Contains the attribution specification for the ad set.
alternate name: attribution_spec
sub property of: attribution spec
domain: Ad Set
range: Attribution Spec

bid adjustments
type: Property
comment: Contains bid adjustment settings for the ad set.
alternate name: bid_adjustments
sub property of: bid adjustments
domain: Ad Set
range: Ad Bid Adjustments

bid amount
type: Property
comment: Represents the bid amount configured for the ad set.
alternate name: bid_amount
domain: Ad Set
range: unsignedInt

bid constraints
type: Property
comment: Contains bid constraint settings for the ad set.
alternate name: bid_constraints
sub property of: bid constraints
domain: Ad Set
range: Ad Campaign Bid Constraint

bid info
type: Property
comment: Contains bid information organized as keyed numeric values for the ad set.
alternate name: bid_info
domain: Ad Set
range: Bid Info Record

bid strategy
type: Property
comment: Specifies the ad set's bidding strategy, such as cost cap or a lowest-cost strategy.
alternate name: bid_strategy
sub property of: bid strategy
domain: Ad Set
range: string
code list: AdSetBidStrategy

billing event
type: Property
comment: Specifies the event used for billing the ad set, such as clicks, impressions, or purchases.
alternate name: billing_event
sub property of: billing event
domain: Ad Set
range: string
code list: AdSetBillingEvent

brand safety config
type: Property
comment: Contains the brand-safety campaign configuration for the ad set.
alternate name: brand_safety_config
sub property of: brand safety config
domain: Ad Set
range: Brand Safety Campaign Config

budget remaining
type: Property
comment: Represents the budget remaining for the ad set.
alternate name: budget_remaining
sub property of: budget remaining
domain: Ad Set
range: string

campaign
type: Property
comment: Contains the campaign associated with the ad set.
alternate name: campaign
sub property of: campaign
domain: Ad Set
range: Campaign

campaign active time
type: Property
comment: Represents the active time associated with the ad set's campaign.
alternate name: campaign_active_time
sub property of: campaign active time
domain: Ad Set
range: string

campaign attribution
type: Property
comment: Represents the campaign attribution associated with the ad set.
alternate name: campaign_attribution
sub property of: campaign attribution
domain: Ad Set
range: string

campaign id
type: Property
comment: Identifies the campaign associated with the ad set.
alternate name: campaign_id
sub property of: campaign id
domain: Ad Set
range: string

configured status
type: Property
comment: Represents the configured status of the ad set, such as active, paused, archived, or deleted.
alternate name: configured_status
sub property of: configured status
domain: Ad Set
range: string
code list: AdSetConfiguredStatus

created time
type: Property
comment: Represents when the ad set was created.
alternate name: created_time
domain: Ad Set
range: dateTime

creative sequence
type: Property
comment: Contains the creative sequence configured for the ad set.
alternate name: creative_sequence
sub property of: creative sequence
domain: Ad Set
range: string

creative sequence repetition pattern
type: Property
comment: Represents the repetition pattern for the ad set's creative sequence.
alternate name: creative_sequence_repetition_pattern
sub property of: creative sequence repetition pattern
domain: Ad Set
range: string

daily budget
type: Property
comment: Represents the ad set's daily budget.
alternate name: daily_budget
sub property of: daily budget
domain: Ad Set
range: string

daily min spend target
type: Property
comment: Represents the ad set's minimum daily spend target.
alternate name: daily_min_spend_target
sub property of: daily min spend target
domain: Ad Set
range: string

daily spend cap
type: Property
comment: Represents the ad set's daily spending cap.
alternate name: daily_spend_cap
sub property of: daily spend cap
domain: Ad Set
range: string

destination type
type: Property
comment: Represents the destination type configured for the ad set.
alternate name: destination_type
sub property of: destination type
domain: Ad Set
range: string

dsa beneficiary
type: Property
comment: Identifies the DSA beneficiary associated with the ad set.
alternate name: dsa_beneficiary
sub property of: dsa beneficiary
domain: Ad Set
range: string

dsa payor
type: Property
comment: Identifies the DSA payor associated with the ad set.
alternate name: dsa_payor
sub property of: dsa payor
domain: Ad Set
range: string

effective status
type: Property
comment: Represents the ad set's effective status, such as active, paused, deleted, or with issues.
alternate name: effective_status
sub property of: effective status
domain: Ad Set
range: string
code list: AdSetEffectiveStatus

end time
type: Property
comment: Represents when the ad set ends.
alternate name: end_time
domain: Ad Set
range: dateTime

existing customer budget percentage
type: Property
comment: Represents the budget percentage allocated to existing customers.
alternate name: existing_customer_budget_percentage
sub property of: existing customer budget percentage
domain: Ad Set
range: unsignedInt

frequency control specs
type: Property
comment: Contains frequency-control specifications for the ad set.
alternate name: frequency_control_specs
sub property of: frequency control specs
domain: Ad Set
range: Ad Campaign Frequency Control Specs

full funnel exploration mode
type: Property
comment: Represents the full-funnel exploration mode configured for the ad set.
alternate name: full_funnel_exploration_mode
sub property of: full funnel exploration mode
domain: Ad Set
range: string

id
type: Property
comment: Identifies the ad set.
alternate name: id
sub property of: id
domain: Ad Set
range: string

instagram user id
type: Property
comment: Identifies the Instagram user associated with the ad set.
alternate name: instagram_user_id
sub property of: instagram user id
domain: Ad Set
range: string

is ba skip delayed eligible
type: Property
comment: Indicates whether the ad set is eligible for BA skip delayed.
alternate name: is_ba_skip_delayed_eligible
sub property of: is ba skip delayed eligible
domain: Ad Set
range: boolean

is budget schedule enabled
type: Property
comment: Indicates whether budget scheduling is enabled for the ad set.
alternate name: is_budget_schedule_enabled
sub property of: is budget schedule enabled
domain: Ad Set
range: boolean

is dynamic creative
type: Property
comment: Indicates whether the ad set uses dynamic creative.
alternate name: is_dynamic_creative
sub property of: is dynamic creative
domain: Ad Set
range: boolean

is incremental attribution enabled
type: Property
comment: Indicates whether incremental attribution is enabled for the ad set.
alternate name: is_incremental_attribution_enabled
sub property of: is incremental attribution enabled
domain: Ad Set
range: boolean

issues info
type: Property
comment: Contains issue information associated with the ad set.
alternate name: issues_info
domain: Ad Set
range: Ad Campaign Issues Info

learning stage info
type: Property
comment: Contains learning-stage information for the ad set.
alternate name: learning_stage_info
sub property of: learning stage info
domain: Ad Set
range: Ad Campaign Learning Stage Info

lifetime budget
type: Property
comment: Represents the ad set's lifetime budget.
alternate name: lifetime_budget
sub property of: lifetime budget
domain: Ad Set
range: string

lifetime imps
type: Property
comment: Represents the ad set's lifetime impressions.
alternate name: lifetime_imps
sub property of: lifetime imps
domain: Ad Set
range: int

lifetime min spend target
type: Property
comment: Represents the ad set's minimum lifetime spend target.
alternate name: lifetime_min_spend_target
sub property of: lifetime min spend target
domain: Ad Set
range: string

lifetime spend cap
type: Property
comment: Represents the ad set's lifetime spending cap.
alternate name: lifetime_spend_cap
sub property of: lifetime spend cap
domain: Ad Set
range: string

max budget spend percentage
type: Property
comment: Represents the maximum budget-spend percentage configured for the ad set.
alternate name: max_budget_spend_percentage
sub property of: max budget spend percentage
domain: Ad Set
range: string

min budget spend percentage
type: Property
comment: Represents the minimum budget-spend percentage configured for the ad set.
alternate name: min_budget_spend_percentage
sub property of: min budget spend percentage
domain: Ad Set
range: string

multi optimization goal weight
type: Property
comment: Represents the weight assigned to the ad set's multiple optimization goals.
alternate name: multi_optimization_goal_weight
sub property of: multi optimization goal weight
domain: Ad Set
range: string

name
type: Property
comment: Represents the name of the ad set.
alternate name: name
sub property of: name
domain: Ad Set
range: string

optimization goal
type: Property
comment: Specifies the ad set's optimization goal, such as impressions, reach, link clicks, or app installs.
alternate name: optimization_goal
sub property of: optimization goal
domain: Ad Set
range: string
code list: AdSetOptimizationGoal

optimization sub event
type: Property
comment: Represents the sub-event used for optimizing the ad set.
alternate name: optimization_sub_event
sub property of: optimization sub event
domain: Ad Set
range: string

pacing type
type: Property
comment: Contains the pacing types configured for the ad set.
alternate name: pacing_type
sub property of: pacing type
domain: Ad Set
range: string

promoted object
type: Property
comment: Contains the object promoted by the ad set.
alternate name: promoted_object
sub property of: promoted object
domain: Ad Set
range: Ad Promoted Object

recommendations
type: Property
comment: Contains recommendations associated with the ad set.
alternate name: recommendations
sub property of: recommendations
domain: Ad Set
range: Ad Recommendation

recurring budget semantics
type: Property
comment: Indicates whether the ad set uses recurring budget semantics.
alternate name: recurring_budget_semantics
sub property of: recurring budget semantics
domain: Ad Set
range: boolean

regional regulated categories
type: Property
comment: Contains the regionally regulated categories associated with the ad set.
alternate name: regional_regulated_categories
sub property of: regional regulated categories
domain: Ad Set
range: string

regional regulation identities
type: Property
comment: Contains the identities associated with regional regulation for the ad set.
alternate name: regional_regulation_identities
sub property of: regional regulation identities
domain: Ad Set
range: Regional Regulation Identities

review feedback
type: Property
comment: Represents review feedback associated with the ad set.
alternate name: review_feedback
sub property of: review feedback
domain: Ad Set
range: string

rf prediction id
type: Property
comment: Identifies the RF prediction associated with the ad set.
alternate name: rf_prediction_id
sub property of: rf prediction id
domain: Ad Set
range: string

source adset
type: Property
comment: Contains the source ad set associated with the ad set.
alternate name: source_adset
sub property of: source adset
domain: Ad Set
range: Ad Set

source adset id
type: Property
comment: Identifies the source ad set associated with the ad set.
alternate name: source_adset_id
sub property of: source adset id
domain: Ad Set
range: string

start time
type: Property
comment: Represents when the ad set starts, before its end time.
alternate name: start_time
domain: Ad Set
range: dateTime

status
type: Property
comment: Represents the ad set's configured status, such as active, paused, archived, or deleted.
alternate name: status
domain: Ad Set
range: string
code list: AdSetStatus

targeting
type: Property
comment: Contains the targeting configuration for the ad set.
alternate name: targeting
sub property of: targeting
domain: Ad Set
range: Targeting

targeting optimization types
type: Property
comment: Contains targeting optimization type values for the ad set.
alternate name: targeting_optimization_types
sub property of: targeting optimization types
domain: Ad Set
range: Targeting Optimization Types Record

time based ad rotation id blocks
type: Property
comment: Contains nested blocks of identifiers used for time-based ad rotation.
alternate name: time_based_ad_rotation_id_blocks
sub property of: time based ad rotation id blocks
domain: Ad Set
range: List

time based ad rotation intervals
type: Property
comment: Contains the intervals configured for time-based ad rotation.
alternate name: time_based_ad_rotation_intervals
sub property of: time based ad rotation intervals
domain: Ad Set
range: unsignedInt

updated time
type: Property
comment: Represents when the ad set was last updated.
alternate name: updated_time
domain: Ad Set
range: dateTime

use new app click
type: Property
comment: Indicates whether the ad set uses the new app-click behavior.
alternate name: use_new_app_click
sub property of: use new app click
domain: Ad Set
range: boolean

anchor event attribution window days
type: Property
comment: Represents the attribution-window duration in days for the anchor event.
alternate name: anchor_event_attribution_window_days
sub property of: anchor event attribution window days
domain: Ad Set
range: int
added in version: v24

automatic manual state
type: Property
comment: Represents the ad set's automatic or manual state.
alternate name: automatic_manual_state
sub property of: automatic manual state
domain: Ad Set
range: string
added in version: v24

placement soft opt out
type: Property
comment: Contains the ad set's placement soft opt-out settings.
alternate name: placement_soft_opt_out
sub property of: placement soft opt out
domain: Ad Set
range: Placement Soft Opt Out
added in version: v24

trending topics spec
type: Property
comment: Contains the trending-topics specification for the ad set.
alternate name: trending_topics_spec
sub property of: trending topics spec
domain: Ad Set
range: Trending Topics Spec
added in version: v24

value rule set id
type: Property
comment: Identifies the value rule set associated with the ad set.
alternate name: value_rule_set_id
sub property of: value rule set id
domain: Ad Set
range: string
added in version: v24

value rules applied
type: Property
comment: Indicates whether value rules have been applied to the ad set.
alternate name: value_rules_applied
sub property of: value rules applied
domain: Ad Set
range: boolean
added in version: v24

creative diversity label
type: Property
comment: Contains creative diversity labels associated with the ad set.
alternate name: creative_diversity_label
sub property of: creative diversity label
domain: Ad Set
range: string
added in version: v25

creative diversity score
type: Property
comment: Contains creative diversity scores associated with the ad set.
alternate name: creative_diversity_score
sub property of: creative diversity score
domain: Ad Set
range: string
added in version: v25

days
type: Property
comment: Lists the days associated with the day part.
alternate name: days
sub property of: days
domain: Day Part
range: int

end minute
type: Property
comment: Represents the ending minute of the day part.
alternate name: end_minute
sub property of: end minute
domain: Day Part
range: int

start minute
type: Property
comment: Represents the starting minute of the day part.
alternate name: start_minute
sub property of: start minute
domain: Day Part
range: int

timezone type
type: Property
comment: Represents the timezone type used by the day part.
alternate name: timezone_type
sub property of: timezone type
domain: Day Part
range: string

age range
type: Property
comment: Contains bid adjustments associated with age ranges.
alternate name: age_range
domain: Ad Bid Adjustments
range: Age Range Record

page types
type: Property
comment: Contains page-type bid adjustment information.
alternate name: page_types
sub property of: page types
domain: Ad Bid Adjustments
range: JSON

user groups
type: Property
comment: Contains user-group bid adjustment information.
alternate name: user_groups
sub property of: user groups
domain: Ad Bid Adjustments
range: string

roas average floor
type: Property
comment: Contains the campaign's average ROAS floor.
alternate name: roas_average_floor
sub property of: roas average floor
domain: Ad Campaign Bid Constraint
range: int

comment moderation filter
type: Property
comment: Represents the comment moderation filter for the brand safety campaign configuration.
alternate name: comment_moderation_filter
sub property of: comment moderation filter
domain: Brand Safety Campaign Config
range: string

fb comment moderation filter
type: Property
comment: Represents the Facebook comment moderation filter for the brand safety campaign configuration.
alternate name: fb_comment_moderation_filter
sub property of: fb comment moderation filter
domain: Brand Safety Campaign Config
range: string

ig comment moderation filter
type: Property
comment: Represents the Instagram comment moderation filter for the brand safety campaign configuration.
alternate name: ig_comment_moderation_filter
sub property of: ig comment moderation filter
domain: Brand Safety Campaign Config
range: string

threads comment moderation filter
type: Property
comment: Represents the Threads comment moderation filter for the brand safety campaign configuration.
alternate name: threads_comment_moderation_filter
sub property of: threads comment moderation filter
domain: Brand Safety Campaign Config
range: string

account id
type: Property
comment: The identifier of the account associated with the campaign.
alternate name: account_id
sub property of: account id
domain: Campaign
range: string

adlabels
type: Property
comment: The ad labels associated with the campaign.
alternate name: adlabels
domain: Campaign
range: Ad Label

advantage state info
type: Property
comment: Information about the campaign's Advantage state.
alternate name: advantage_state_info
sub property of: advantage state info
domain: Campaign
range: Ad Campaign Group Advantage State

bid strategy
type: Property
comment: The campaign's bid strategy, such as cost cap or lowest cost.
alternate name: bid_strategy
sub property of: bid strategy
domain: Campaign
range: string
code list: CampaignBidStrategy

boosted object id
type: Property
comment: The identifier of the object boosted by the campaign.
alternate name: boosted_object_id
sub property of: boosted object id
domain: Campaign
range: string

brand lift studies
type: Property
comment: The brand lift studies associated with the campaign.
alternate name: brand_lift_studies
sub property of: brand lift studies
domain: Campaign
range: Ad Study

budget rebalance flag
type: Property
comment: Whether the campaign has its budget rebalance flag enabled.
alternate name: budget_rebalance_flag
sub property of: budget rebalance flag
domain: Campaign
range: boolean

budget remaining
type: Property
comment: The budget remaining for the campaign.
alternate name: budget_remaining
sub property of: budget remaining
domain: Campaign
range: string

buying type
type: Property
comment: The campaign's buying type.
alternate name: buying_type
sub property of: buying type
domain: Campaign
range: string

campaign group active time
type: Property
comment: The active time associated with the campaign group.
alternate name: campaign_group_active_time
sub property of: campaign group active time
domain: Campaign
range: string

can create brand lift study
type: Property
comment: Whether the campaign can create a brand lift study.
alternate name: can_create_brand_lift_study
sub property of: can create brand lift study
domain: Campaign
range: boolean

can use spend cap
type: Property
comment: Whether the campaign can use a spend cap.
alternate name: can_use_spend_cap
sub property of: can use spend cap
domain: Campaign
range: boolean

configured status
type: Property
comment: The status configured for the campaign, such as active, paused, archived, or deleted.
alternate name: configured_status
sub property of: configured status
domain: Campaign
range: string
code list: CampaignConfiguredStatus

created time
type: Property
comment: The time when the campaign was created.
alternate name: created_time
domain: Campaign
range: dateTime

daily budget
type: Property
comment: The campaign's daily budget.
alternate name: daily_budget
sub property of: daily budget
domain: Campaign
range: string

effective status
type: Property
comment: The campaign's effective status, such as active, paused, or with issues.
alternate name: effective_status
sub property of: effective status
domain: Campaign
range: string
code list: CampaignEffectiveStatus

has secondary skadnetwork reporting
type: Property
comment: Whether the campaign has secondary SKAdNetwork reporting.
alternate name: has_secondary_skadnetwork_reporting
sub property of: has secondary skadnetwork reporting
domain: Campaign
range: boolean

id
type: Property
comment: The identifier of the campaign.
alternate name: id
sub property of: id
domain: Campaign
range: string

is budget schedule enabled
type: Property
comment: Whether the campaign's budget schedule is enabled.
alternate name: is_budget_schedule_enabled
sub property of: is budget schedule enabled
domain: Campaign
range: boolean

is skadnetwork attribution
type: Property
comment: Whether the campaign uses SKAdNetwork attribution.
alternate name: is_skadnetwork_attribution
sub property of: is skadnetwork attribution
domain: Campaign
range: boolean

issues info
type: Property
comment: Information about issues associated with the campaign.
alternate name: issues_info
domain: Campaign
range: Ad Campaign Issues Info

last budget toggling time
type: Property
comment: The time when the campaign's budget was last toggled.
alternate name: last_budget_toggling_time
sub property of: last budget toggling time
domain: Campaign
range: dateTime

lifetime budget
type: Property
comment: The campaign's lifetime budget.
alternate name: lifetime_budget
sub property of: lifetime budget
domain: Campaign
range: string

name
type: Property
comment: The name of the campaign.
alternate name: name
sub property of: name
domain: Campaign
range: string

objective
type: Property
comment: The campaign's objective.
alternate name: objective
sub property of: objective
domain: Campaign
range: string

pacing type
type: Property
comment: The pacing types associated with the campaign.
alternate name: pacing_type
sub property of: pacing type
domain: Campaign
range: string

primary attribution
type: Property
comment: The campaign's primary attribution setting.
alternate name: primary_attribution
sub property of: primary attribution
domain: Campaign
range: string

promoted object
type: Property
comment: The object promoted by the campaign.
alternate name: promoted_object
sub property of: promoted object
domain: Campaign
range: Ad Promoted Object

recommendations
type: Property
comment: The recommendations associated with the campaign.
alternate name: recommendations
sub property of: recommendations
domain: Campaign
range: Ad Recommendation

smart promotion type
type: Property
comment: The campaign's smart promotion type.
alternate name: smart_promotion_type
sub property of: smart promotion type
domain: Campaign
range: string

source campaign
type: Property
comment: The campaign from which this campaign originated.
alternate name: source_campaign
sub property of: source campaign
domain: Campaign
range: Campaign

source campaign id
type: Property
comment: The identifier of the campaign from which this campaign originated.
alternate name: source_campaign_id
sub property of: source campaign id
domain: Campaign
range: string

source recommendation type
type: Property
comment: The type of recommendation from which this campaign originated.
alternate name: source_recommendation_type
sub property of: source recommendation type
domain: Campaign
range: string

special ad categories
type: Property
comment: The special ad categories associated with the campaign.
alternate name: special_ad_categories
sub property of: special ad categories
domain: Campaign
range: string

special ad category
type: Property
comment: The special ad category associated with the campaign.
alternate name: special_ad_category
sub property of: special ad category
domain: Campaign
range: string

special ad category country
type: Property
comment: The countries associated with the campaign's special ad category.
alternate name: special_ad_category_country
sub property of: special ad category country
domain: Campaign
range: string

spend cap
type: Property
comment: The campaign's spend cap.
alternate name: spend_cap
sub property of: spend cap
domain: Campaign
range: string

start time
type: Property
comment: The time when the campaign starts, before its stop time.
alternate name: start_time
domain: Campaign
range: dateTime

status
type: Property
comment: The campaign's configured status, such as active, paused, archived, or deleted.
alternate name: status
domain: Campaign
range: string
code list: CampaignStatus

stop time
type: Property
comment: The time when the campaign stops.
alternate name: stop_time
sub property of: stop time
domain: Campaign
range: dateTime

topline id
type: Property
comment: The identifier of the campaign's topline.
alternate name: topline_id
sub property of: topline id
domain: Campaign
range: string

updated time
type: Property
comment: The time when the campaign was last updated.
alternate name: updated_time
domain: Campaign
range: dateTime

is adset budget sharing enabled
type: Property
comment: Whether budget sharing across ad sets is enabled for the campaign.
alternate name: is_adset_budget_sharing_enabled
sub property of: is adset budget sharing enabled
domain: Campaign
range: boolean
added in version: v24

is direct send campaign
type: Property
comment: Whether the campaign is a direct-send campaign.
alternate name: is_direct_send_campaign
sub property of: is direct send campaign
domain: Campaign
range: boolean
added in version: v24

is message campaign
type: Property
comment: Whether the campaign is a message campaign.
alternate name: is_message_campaign
sub property of: is message campaign
domain: Campaign
range: boolean
added in version: v24

advantage audience state
type: Property
comment: Describes the advantage audience state for the campaign group.
alternate name: advantage_audience_state
sub property of: advantage audience state
domain: Ad Campaign Group Advantage State
range: string

advantage budget state
type: Property
comment: Describes the advantage budget state for the campaign group.
alternate name: advantage_budget_state
sub property of: advantage budget state
domain: Ad Campaign Group Advantage State
range: string

advantage placement state
type: Property
comment: Describes the advantage placement state for the campaign group.
alternate name: advantage_placement_state
sub property of: advantage placement state
domain: Ad Campaign Group Advantage State
range: string

advantage state
type: Property
comment: Describes the overall advantage state for the campaign group.
alternate name: advantage_state
sub property of: advantage state
domain: Ad Campaign Group Advantage State
range: string

business
type: Property
comment: Identifies the business associated with the ad study.
alternate name: business
domain: Ad Study
range: Business

canceled time
type: Property
comment: Indicates when the ad study was canceled.
alternate name: canceled_time
sub property of: canceled time
domain: Ad Study
range: dateTime

client business
type: Property
comment: Identifies the client business associated with the ad study.
alternate name: client_business
sub property of: client business
domain: Ad Study
range: Business

cooldown start time
type: Property
comment: Indicates when the ad study cooldown started.
alternate name: cooldown_start_time
sub property of: cooldown start time
domain: Ad Study
range: dateTime

created by
type: Property
comment: Identifies the user who created the ad study.
alternate name: created_by
domain: Ad Study
range: User

created time
type: Property
comment: Indicates when the ad study was created.
alternate name: created_time
domain: Ad Study
range: dateTime

description
type: Property
comment: Contains the description of the ad study.
alternate name: description
sub property of: description
domain: Ad Study
range: string

end time
type: Property
comment: Indicates when the ad study ends.
alternate name: end_time
domain: Ad Study
range: dateTime

id
type: Property
comment: Identifies the ad study.
alternate name: id
sub property of: id
domain: Ad Study
range: string

measurement contact
type: Property
comment: Identifies the user serving as the measurement contact for the ad study.
alternate name: measurement_contact
sub property of: measurement contact
domain: Ad Study
range: User

name
type: Property
comment: Contains the name of the ad study.
alternate name: name
sub property of: name
domain: Ad Study
range: string

observation end time
type: Property
comment: Indicates when the ad study observation period ends.
alternate name: observation_end_time
sub property of: observation end time
domain: Ad Study
range: dateTime

results first available date
type: Property
comment: Indicates the date when ad study results are first available.
alternate name: results_first_available_date
sub property of: results first available date
domain: Ad Study
range: string

sales contact
type: Property
comment: Identifies the user serving as the sales contact for the ad study.
alternate name: sales_contact
sub property of: sales contact
domain: Ad Study
range: User

start time
type: Property
comment: Indicates when the ad study starts.
alternate name: start_time
domain: Ad Study
range: dateTime

type
type: Property
comment: Represents the type of the ad study.
alternate name: type
domain: Ad Study
range: string

updated by
type: Property
comment: Identifies the user who last updated the ad study.
alternate name: updated_by
domain: Ad Study
range: User

updated time
type: Property
comment: Indicates when the ad study was updated.
alternate name: updated_time
domain: Ad Study
range: dateTime

about
type: Property
comment: Represents information about the user.
alternate name: about
sub property of: about
domain: User
range: string

age range
type: Property
comment: Represents the user's age range.
alternate name: age_range
domain: User
range: Age Range

birthday
type: Property
comment: Represents the user's birthday.
alternate name: birthday
sub property of: birthday
domain: User
range: string

client business id
type: Property
comment: Represents the client business identifier associated with the user.
alternate name: client_business_id
sub property of: client business id
domain: User
range: string

community
type: Property
comment: Represents the group associated with the user as their community.
alternate name: community
sub property of: community
domain: User
range: Group

cover
type: Property
comment: Represents the user's cover photo.
alternate name: cover
domain: User
range: User Cover Photo

currency
type: Property
comment: Represents the currency associated with the user.
alternate name: currency
domain: User
range: Currency

education
type: Property
comment: Represents the user's education experiences.
alternate name: education
sub property of: education
domain: User
range: Education Experience

email
type: Property
comment: Represents the user's email address.
alternate name: email
domain: User
range: string

favorite athletes
type: Property
comment: Represents the athletes marked as favorites by the user.
alternate name: favorite_athletes
sub property of: favorite athletes
domain: User
range: Experience

favorite teams
type: Property
comment: Represents the teams marked as favorites by the user.
alternate name: favorite_teams
sub property of: favorite teams
domain: User
range: Experience

first name
type: Property
comment: Represents the user's first name.
alternate name: first_name
sub property of: first name
domain: User
range: string

gender
type: Property
comment: Represents the user's gender.
alternate name: gender
sub property of: gender
domain: User
range: string

hometown
type: Property
comment: Represents the page associated with the user's hometown.
alternate name: hometown
domain: User
range: Page

id
type: Property
comment: Represents the user's identifier.
alternate name: id
sub property of: id
domain: User
range: string

inspirational people
type: Property
comment: Represents the people identified as inspirational by the user.
alternate name: inspirational_people
sub property of: inspirational people
domain: User
range: Experience

install type
type: Property
comment: Represents the user's installation type.
alternate name: install_type
sub property of: install type
domain: User
range: string

installed
type: Property
comment: Indicates whether the user is installed.
alternate name: installed
sub property of: installed
domain: User
range: boolean

is guest user
type: Property
comment: Indicates whether the user is a guest user.
alternate name: is_guest_user
sub property of: is guest user
domain: User
range: boolean

is work account
type: Property
comment: Indicates whether the user is a work account.
alternate name: is_work_account
sub property of: is work account
domain: User
range: boolean

languages
type: Property
comment: Represents the languages associated with the user.
alternate name: languages
sub property of: languages
domain: User
range: Experience

last name
type: Property
comment: Represents the user's last name.
alternate name: last_name
sub property of: last name
domain: User
range: string

link
type: Property
comment: Represents the link associated with the user.
alternate name: link
sub property of: link
domain: User
range: string

local news megaphone dismiss status
type: Property
comment: Indicates the user's local-news megaphone dismissal status.
alternate name: local_news_megaphone_dismiss_status
sub property of: local news megaphone dismiss status
domain: User
range: boolean

local news subscription status
type: Property
comment: Indicates the user's local-news subscription status.
alternate name: local_news_subscription_status
sub property of: local news subscription status
domain: User
range: boolean

locale
type: Property
comment: Represents the user's locale.
alternate name: locale
sub property of: locale
domain: User
range: string

location
type: Property
comment: Represents the page associated with the user's location.
alternate name: location
domain: User
range: Page

meeting for
type: Property
comment: Represents what the user is seeking to meet for.
alternate name: meeting_for
sub property of: meeting for
domain: User
range: string

middle name
type: Property
comment: Represents the user's middle name.
alternate name: middle_name
sub property of: middle name
domain: User
range: string

name
type: Property
comment: Represents the user's name.
alternate name: name
sub property of: name
domain: User
range: string

name format
type: Property
comment: Represents the format of the user's name.
alternate name: name_format
sub property of: name format
domain: User
range: string

payment pricepoints
type: Property
comment: Represents the payment price points associated with the user.
alternate name: payment_pricepoints
sub property of: payment pricepoints
domain: User
range: Payment Pricepoints

political
type: Property
comment: Represents the user's political information.
alternate name: political
sub property of: political
domain: User
range: string

profile pic
type: Property
comment: Represents the user's profile picture.
alternate name: profile_pic
sub property of: profile pic
domain: User
range: string

quotes
type: Property
comment: Represents the user's quotes.
alternate name: quotes
sub property of: quotes
domain: User
range: string

relationship status
type: Property
comment: Represents the user's relationship status.
alternate name: relationship_status
sub property of: relationship status
domain: User
range: string

religion
type: Property
comment: Represents the user's religion.
alternate name: religion
sub property of: religion
domain: User
range: string

shared login upgrade required by
type: Property
comment: Represents the time by which a shared-login upgrade is required for the user.
alternate name: shared_login_upgrade_required_by
sub property of: shared login upgrade required by
domain: User
range: dateTime

short name
type: Property
comment: Represents the user's short name.
alternate name: short_name
sub property of: short name
domain: User
range: string

significant other
type: Property
comment: Represents the user identified as the user's significant other.
alternate name: significant_other
sub property of: significant other
domain: User
range: User

sports
type: Property
comment: Represents the sports associated with the user.
alternate name: sports
sub property of: sports
domain: User
range: Experience

supports donate button in live video
type: Property
comment: Indicates whether the user supports a donate button in live video.
alternate name: supports_donate_button_in_live_video
sub property of: supports donate button in live video
domain: User
range: boolean

third party id
type: Property
comment: Represents the user's third-party identifier.
alternate name: third_party_id
sub property of: third party id
domain: User
range: string

timezone
type: Property
comment: Represents the user's timezone.
alternate name: timezone
domain: User
range: double

token for business
type: Property
comment: Represents the user's token for business.
alternate name: token_for_business
sub property of: token for business
domain: User
range: string

updated time
type: Property
comment: Represents the time when the user was updated.
alternate name: updated_time
domain: User
range: dateTime

verified
type: Property
comment: Indicates whether the user is verified.
alternate name: verified
sub property of: verified
domain: User
range: boolean

video upload limits
type: Property
comment: Represents the user's video upload limits.
alternate name: video_upload_limits
sub property of: video upload limits
domain: User
range: Video Upload Limits

website
type: Property
comment: Represents the user's website.
alternate name: website
domain: User
range: string

max
type: Property
comment: Represents the maximum value of the age range.
alternate name: max
sub property of: max
domain: Age Range
range: unsignedInt

min
type: Property
comment: Represents the minimum value of the age range.
alternate name: min
sub property of: min
domain: Age Range
range: unsignedInt

archived
type: Property
comment: Indicates whether the group is archived.
alternate name: archived
sub property of: archived
domain: Group
range: boolean

cover
type: Property
comment: Represents the group's cover photo.
alternate name: cover
domain: Group
range: Cover Photo

created time
type: Property
comment: Represents when the group was created.
alternate name: created_time
domain: Group
range: dateTime

description
type: Property
comment: Represents the group's description.
alternate name: description
sub property of: description
domain: Group
range: string

email
type: Property
comment: Represents the group's email address.
alternate name: email
domain: Group
range: string

icon
type: Property
comment: Represents the group's icon.
alternate name: icon
sub property of: icon
domain: Group
range: string

id
type: Property
comment: Represents the group's identifier.
alternate name: id
sub property of: id
domain: Group
range: string

install
type: Property
comment: Represents an unspecified object associated with the group's installation.
alternate name: install
sub property of: install
domain: Group
range: JSON

link
type: Property
comment: Represents the group's link.
alternate name: link
sub property of: link
domain: Group
range: string

member count
type: Property
comment: Represents the number of members in the group.
alternate name: member_count
sub property of: member count
domain: Group
range: unsignedInt

member request count
type: Property
comment: Represents the number of member requests for the group.
alternate name: member_request_count
sub property of: member request count
domain: Group
range: unsignedInt

name
type: Property
comment: Represents the group's name.
alternate name: name
sub property of: name
domain: Group
range: string

parent
type: Property
comment: Represents an unspecified parent object associated with the group.
alternate name: parent
sub property of: parent
domain: Group
range: JSON

permissions
type: Property
comment: Represents the permissions associated with the group.
alternate name: permissions
sub property of: permissions
domain: Group
range: string

privacy
type: Property
comment: Represents the group's privacy setting.
alternate name: privacy
domain: Group
range: string

purpose
type: Property
comment: Represents the group's purpose.
alternate name: purpose
sub property of: purpose
domain: Group
range: string

subdomain
type: Property
comment: Represents the group's subdomain.
alternate name: subdomain
sub property of: subdomain
domain: Group
range: string

updated time
type: Property
comment: Represents when the group was updated.
alternate name: updated_time
domain: Group
range: dateTime

venue
type: Property
comment: Represents the group's venue location.
alternate name: venue
sub property of: venue
domain: Group
range: Location

cover id
type: Property
comment: Identifies the cover associated with the cover photo.
alternate name: cover_id
sub property of: cover id
domain: Cover Photo
range: string

id
type: Property
comment: Identifies the cover photo.
alternate name: id
sub property of: id
domain: Cover Photo
range: string

offset x
type: Property
comment: Represents the horizontal offset of the cover photo.
alternate name: offset_x
sub property of: offset x
domain: Cover Photo
range: double

offset y
type: Property
comment: Represents the vertical offset of the cover photo.
alternate name: offset_y
sub property of: offset y
domain: Cover Photo
range: double

source
type: Property
comment: Provides the source associated with the cover photo.
alternate name: source
sub property of: source
domain: Cover Photo
range: string

city
type: Property
comment: Represents the city associated with the location.
alternate name: city
sub property of: city
domain: Location
range: string

city id
type: Property
comment: Identifies the city associated with the location.
alternate name: city_id
sub property of: city id
domain: Location
range: unsignedInt

country
type: Property
comment: Represents the country associated with the location.
alternate name: country
sub property of: country
domain: Location
range: string

country code
type: Property
comment: Represents the country code associated with the location.
alternate name: country_code
sub property of: country code
domain: Location
range: string

latitude
type: Property
comment: Represents the latitude of the location.
alternate name: latitude
sub property of: latitude
domain: Location
range: double

located in
type: Property
comment: Represents where the location is situated.
alternate name: located_in
sub property of: located in
domain: Location
range: string

longitude
type: Property
comment: Represents the longitude of the location.
alternate name: longitude
sub property of: longitude
domain: Location
range: double

name
type: Property
comment: Represents the name of the location.
alternate name: name
sub property of: name
domain: Location
range: string

region
type: Property
comment: Represents the region associated with the location.
alternate name: region
sub property of: region
domain: Location
range: string

region id
type: Property
comment: Identifies the region associated with the location.
alternate name: region_id
domain: Location
range: unsignedInt

state
type: Property
comment: Represents the state associated with the location.
alternate name: state
sub property of: state
domain: Location
range: string

street
type: Property
comment: Represents the street associated with the location.
alternate name: street
domain: Location
range: string

zip
type: Property
comment: Represents the ZIP code associated with the location.
alternate name: zip
sub property of: zip
domain: Location
range: string

offset x
type: Property
comment: Represents the horizontal offset of the cover photo.
alternate name: offset_x
sub property of: offset x
domain: User Cover Photo
range: double

offset y
type: Property
comment: Represents the vertical offset of the cover photo.
alternate name: offset_y
sub property of: offset y
domain: User Cover Photo
range: double

source
type: Property
comment: Represents the source of the cover photo.
alternate name: source
sub property of: source
domain: User Cover Photo
range: string

currency offset
type: Property
comment: Represents the offset associated with the currency.
alternate name: currency_offset
sub property of: currency offset
domain: Currency
range: unsignedInt

usd exchange
type: Property
comment: Represents the currency’s exchange value relative to USD.
alternate name: usd_exchange
sub property of: usd exchange
domain: Currency
range: double

usd exchange inverse
type: Property
comment: Represents the inverse exchange value relative to USD for the currency.
alternate name: usd_exchange_inverse
sub property of: usd exchange inverse
domain: Currency
range: double

user currency
type: Property
comment: Identifies the currency associated with the user.
alternate name: user_currency
sub property of: user currency
domain: Currency
range: string

classes
type: Property
comment: Lists the class experiences associated with the education experience.
alternate name: classes
sub property of: classes
domain: Education Experience
range: Experience

concentration
type: Property
comment: Identifies the concentration associated with the education experience.
alternate name: concentration
sub property of: concentration
domain: Education Experience
range: Page

degree
type: Property
comment: Identifies the degree associated with the education experience.
alternate name: degree
sub property of: degree
domain: Education Experience
range: Page

id
type: Property
comment: Identifies the education experience.
alternate name: id
sub property of: id
domain: Education Experience
range: string

school
type: Property
comment: Identifies the school associated with the education experience.
alternate name: school
sub property of: school
domain: Education Experience
range: Page

type
type: Property
comment: Represents the type of the education experience.
alternate name: type
domain: Education Experience
range: string

with
type: Property
comment: Lists the users associated with the education experience.
alternate name: with
sub property of: with
domain: Education Experience
range: User

year
type: Property
comment: Represents the year associated with the education experience.
alternate name: year
sub property of: year
domain: Education Experience
range: Page

description
type: Property
comment: Represents the experience's description.
alternate name: description
sub property of: description
domain: Experience
range: string

from
type: Property
comment: Identifies the object associated with the experience's origin.
alternate name: from
domain: Experience
range: JSON

id
type: Property
comment: Identifies the experience.
alternate name: id
sub property of: id
domain: Experience
range: string

name
type: Property
comment: Represents the experience's name.
alternate name: name
sub property of: name
domain: Experience
range: string

with
type: Property
comment: Identifies the users associated with the experience.
alternate name: with
sub property of: with
domain: Experience
range: User

mobile
type: Property
comment: Represents the mobile payment price points.
alternate name: mobile
sub property of: mobile
domain: Payment Pricepoints
range: JSON

length
type: Property
comment: Specifies a length limit for video uploads.
alternate name: length
domain: Video Upload Limits
range: unsignedInt

size
type: Property
comment: Specifies a size limit for video uploads.
alternate name: size
sub property of: size
domain: Video Upload Limits
range: int

error code
type: Property
comment: Identifies the campaign issue with an error code.
alternate name: error_code
sub property of: error code
domain: Ad Campaign Issues Info
range: int

error message
type: Property
comment: Contains the message describing the campaign issue.
alternate name: error_message
sub property of: error message
domain: Ad Campaign Issues Info
range: string

error summary
type: Property
comment: Contains a summary of the campaign issue.
alternate name: error_summary
sub property of: error summary
domain: Ad Campaign Issues Info
range: string

error type
type: Property
comment: Identifies the type of campaign issue.
alternate name: error_type
sub property of: error type
domain: Ad Campaign Issues Info
range: string

level
type: Property
comment: Indicates the level of the campaign issue.
alternate name: level
sub property of: level
domain: Ad Campaign Issues Info
range: string

mid
type: Property
comment: Contains the identifier associated with the campaign issue.
alternate name: mid
sub property of: mid
domain: Ad Campaign Issues Info
range: string

application id
type: Property
comment: Identifies the application associated with the promoted object.
alternate name: application_id
sub property of: application id
domain: Ad Promoted Object
range: string

boosted product set id
type: Property
comment: Identifies the product set associated with the boosted object.
alternate name: boosted_product_set_id
sub property of: boosted product set id
domain: Ad Promoted Object
range: string

conversion goal id
type: Property
comment: Identifies the conversion goal associated with the promoted object.
alternate name: conversion_goal_id
sub property of: conversion goal id
domain: Ad Promoted Object
range: string

custom attribution source ids
type: Property
comment: Identifies the custom attribution sources associated with the promoted object.
alternate name: custom_attribution_source_ids
sub property of: custom attribution source ids
domain: Ad Promoted Object
range: string

custom conversion id
type: Property
comment: Identifies the custom conversion associated with the promoted object.
alternate name: custom_conversion_id
sub property of: custom conversion id
domain: Ad Promoted Object
range: string

custom event str
type: Property
comment: Provides the custom event associated with the promoted object.
alternate name: custom_event_str
sub property of: custom event str
domain: Ad Promoted Object
range: string

custom event type
type: Property
comment: Identifies the custom event type associated with the promoted object.
alternate name: custom_event_type
sub property of: custom event type
domain: Ad Promoted Object
range: string
code list: AdPromotedObjectCustomEventType

dataset split id
type: Property
comment: An identifier for a dataset split associated with the promoted object.
alternate name: dataset_split_id
sub property of: dataset split id
domain: Ad Promoted Object
range: string

dataset split ids
type: Property
comment: A collection of identifiers for dataset splits associated with the promoted object.
alternate name: dataset_split_ids
sub property of: dataset split ids
domain: Ad Promoted Object
range: string

event id
type: Property
comment: An identifier for an event associated with the promoted object.
alternate name: event_id
sub property of: event id
domain: Ad Promoted Object
range: string

full funnel objective
type: Property
comment: The full-funnel advertising objective associated with the promoted object, such as awareness, engagement, leads, sales, or traffic.
alternate name: full_funnel_objective
sub property of: full funnel objective
domain: Ad Promoted Object
range: string
code list: AdPromotedObjectFullFunnelObjective

fundraiser campaign id
type: Property
comment: An identifier for a fundraiser campaign associated with the promoted object.
alternate name: fundraiser_campaign_id
sub property of: fundraiser campaign id
domain: Ad Promoted Object
range: string

instagram actor id
type: Property
comment: An identifier for an Instagram actor associated with the promoted object.
alternate name: instagram_actor_id
sub property of: instagram actor id
domain: Ad Promoted Object
range: string

job listing id
type: Property
comment: An identifier for a job listing associated with the promoted object.
alternate name: job_listing_id
sub property of: job listing id
domain: Ad Promoted Object
range: string

lead ads custom event str
type: Property
comment: A custom event value associated with lead ads.
alternate name: lead_ads_custom_event_str
sub property of: lead ads custom event str
domain: Ad Promoted Object
range: string

lead ads custom event type
type: Property
comment: The event type associated with a lead ads custom event.
alternate name: lead_ads_custom_event_type
sub property of: lead ads custom event type
domain: Ad Promoted Object
range: string
code list: AdPromotedObjectLeadAdsCustomEventType

lead ads follow up event
type: Property
comment: A follow-up event associated with lead ads.
alternate name: lead_ads_follow_up_event
sub property of: lead ads follow up event
domain: Ad Promoted Object
range: string

lead ads form event source type
type: Property
comment: The event source type associated with a lead ads form.
alternate name: lead_ads_form_event_source_type
sub property of: lead ads form event source type
domain: Ad Promoted Object
range: string

lead ads offsite conversion type
type: Property
comment: The offsite conversion type associated with lead ads.
alternate name: lead_ads_offsite_conversion_type
sub property of: lead ads offsite conversion type
domain: Ad Promoted Object
range: string

lead ads quality volume setting
type: Property
comment: A quality or volume setting associated with lead ads.
alternate name: lead_ads_quality_volume_setting
sub property of: lead ads quality volume setting
domain: Ad Promoted Object
range: string

lead ads selected pixel id
type: Property
comment: An identifier for the pixel selected for lead ads.
alternate name: lead_ads_selected_pixel_id
sub property of: lead ads selected pixel id
domain: Ad Promoted Object
range: string

live video destination
type: Property
comment: The destination associated with live video promotion.
alternate name: live_video_destination
sub property of: live video destination
domain: Ad Promoted Object
range: string

mcme conversion id
type: Property
comment: An identifier for an MCME conversion associated with the promoted object.
alternate name: mcme_conversion_id
sub property of: mcme conversion id
domain: Ad Promoted Object
range: string

multi event product
type: Property
comment: A product value associated with multiple events.
alternate name: multi_event_product
sub property of: multi event product
domain: Ad Promoted Object
range: int

object store url
type: Property
comment: A URL associated with the promoted object’s object store.
alternate name: object_store_url
sub property of: object store url
domain: Ad Promoted Object
range: string

object store urls
type: Property
comment: A collection of URLs associated with the promoted object’s object store.
alternate name: object_store_urls
sub property of: object store urls
domain: Ad Promoted Object
range: string

offer id
type: Property
comment: An identifier for an offer associated with the promoted object.
alternate name: offer_id
sub property of: offer id
domain: Ad Promoted Object
range: string

offline conversion data set id
type: Property
comment: An identifier for the offline conversion data set associated with the promoted object.
alternate name: offline_conversion_data_set_id
sub property of: offline conversion data set id
domain: Ad Promoted Object
range: string

offsite conversion event id
type: Property
comment: An identifier for an offsite conversion event associated with the promoted object.
alternate name: offsite_conversion_event_id
sub property of: offsite conversion event id
domain: Ad Promoted Object
range: string

omnichannel object
type: Property
comment: An omnichannel object associated with the promoted object.
alternate name: omnichannel_object
sub property of: omnichannel object
domain: Ad Promoted Object
range: JSON

page id
type: Property
comment: An identifier for a page associated with the promoted object.
alternate name: page_id
sub property of: page id
domain: Ad Promoted Object
range: string

passback application id
type: Property
comment: An identifier for an application associated with passback.
alternate name: passback_application_id
sub property of: passback application id
domain: Ad Promoted Object
range: string

passback pixel id
type: Property
comment: An identifier for a pixel associated with passback.
alternate name: passback_pixel_id
sub property of: passback pixel id
domain: Ad Promoted Object
range: string

pixel aggregation rule
type: Property
comment: An aggregation rule associated with a pixel.
alternate name: pixel_aggregation_rule
sub property of: pixel aggregation rule
domain: Ad Promoted Object
range: string

pixel id
type: Property
comment: An identifier for a pixel associated with the promoted object.
alternate name: pixel_id
sub property of: pixel id
domain: Ad Promoted Object
range: string

pixel rule
type: Property
comment: A rule associated with a pixel.
alternate name: pixel_rule
sub property of: pixel rule
domain: Ad Promoted Object
range: string

place page set
type: Property
comment: A place page set associated with the promoted object.
alternate name: place_page_set
sub property of: place page set
domain: Ad Promoted Object
range: Ad Place Page Set

place page set id
type: Property
comment: An identifier for a place page set associated with the promoted object.
alternate name: place_page_set_id
sub property of: place page set id
domain: Ad Promoted Object
range: string

product catalog id
type: Property
comment: An identifier for a product catalog associated with the promoted object.
alternate name: product_catalog_id
sub property of: product catalog id
domain: Ad Promoted Object
range: string

product item id
type: Property
comment: An identifier for a product item associated with the promoted object.
alternate name: product_item_id
sub property of: product item id
domain: Ad Promoted Object
range: string

product set
type: Property
comment: A product set associated with the promoted object.
alternate name: product_set
sub property of: product set
domain: Ad Promoted Object
range: Product Set

product set id
type: Property
comment: An identifier for a product set associated with the promoted object.
alternate name: product_set_id
sub property of: product set id
domain: Ad Promoted Object
range: string

product set optimization
type: Property
comment: An optimization setting associated with a product set.
alternate name: product_set_optimization
sub property of: product set optimization
domain: Ad Promoted Object
range: string

retention days
type: Property
comment: A retention period value associated with the promoted object.
alternate name: retention_days
sub property of: retention days
domain: Ad Promoted Object
range: string

smart pse enabled
type: Property
comment: Whether Smart PSE is enabled for the promoted object.
alternate name: smart_pse_enabled
sub property of: smart pse enabled
domain: Ad Promoted Object
range: boolean

smart pse setting
type: Property
comment: A Smart PSE setting associated with the promoted object.
alternate name: smart_pse_setting
sub property of: smart pse setting
domain: Ad Promoted Object
range: string

value semantic type
type: Property
comment: The semantic type associated with the promoted object’s value.
alternate name: value_semantic_type
sub property of: value semantic type
domain: Ad Promoted Object
range: string

variation
type: Property
comment: A variation associated with the promoted object.
alternate name: variation
sub property of: variation
domain: Ad Promoted Object
range: string

whats app business phone number id
type: Property
comment: An identifier for a WhatsApp Business phone number associated with the promoted object.
alternate name: whats_app_business_phone_number_id
sub property of: whats app business phone number id
domain: Ad Promoted Object
range: string

whatsapp phone number
type: Property
comment: A WhatsApp phone number associated with the promoted object.
alternate name: whatsapp_phone_number
sub property of: whatsapp phone number
domain: Ad Promoted Object
range: string

account id
type: Property
comment: Identifies the ad account associated with the page set.
alternate name: account_id
sub property of: account id
domain: Ad Place Page Set
range: string

id
type: Property
comment: Identifies the ad place page set.
alternate name: id
sub property of: id
domain: Ad Place Page Set
range: string

location types
type: Property
comment: Lists the location types associated with the page set.
alternate name: location_types
sub property of: location types
domain: Ad Place Page Set
range: string

name
type: Property
comment: Provides the name of the ad place page set.
alternate name: name
sub property of: name
domain: Ad Place Page Set
range: string

pages count
type: Property
comment: Indicates the number of pages in the page set.
alternate name: pages_count
sub property of: pages count
domain: Ad Place Page Set
range: int

parent page
type: Property
comment: Identifies the parent page associated with the page set.
alternate name: parent_page
sub property of: parent page
domain: Ad Place Page Set
range: Page

auto creation url
type: Property
comment: The URL associated with automatic creation of the product set.
alternate name: auto_creation_url
sub property of: auto creation url
domain: Product Set
range: string

filter
type: Property
comment: The filter associated with the product set.
alternate name: filter
sub property of: filter
domain: Product Set
range: string

id
type: Property
comment: The identifier of the product set.
alternate name: id
sub property of: id
domain: Product Set
range: string

latest metadata
type: Property
comment: The latest metadata associated with the product set.
alternate name: latest_metadata
sub property of: latest metadata
domain: Product Set
range: Product Set Metadata

live metadata
type: Property
comment: The live metadata associated with the product set.
alternate name: live_metadata
sub property of: live metadata
domain: Product Set
range: Product Set Metadata

name
type: Property
comment: The name of the product set.
alternate name: name
sub property of: name
domain: Product Set
range: string

ordering info
type: Property
comment: Ordering information associated with the product set.
alternate name: ordering_info
sub property of: ordering info
domain: Product Set
range: int

product catalog
type: Property
comment: The product catalog containing or associated with the product set.
alternate name: product_catalog
sub property of: product catalog
domain: Product Set
range: Product Catalog

product count
type: Property
comment: The number of products in the product set.
alternate name: product_count
domain: Product Set
range: unsignedInt

retailer id
type: Property
comment: The retailer identifier associated with the product set.
alternate name: retailer_id
sub property of: retailer id
domain: Product Set
range: string

cover image url
type: Property
comment: The URL of the cover image for the product set metadata.
alternate name: cover_image_url
sub property of: cover image url
domain: Product Set Metadata
range: string

description
type: Property
comment: The description of the product set.
alternate name: description
sub property of: description
domain: Product Set Metadata
range: string

external url
type: Property
comment: The external URL associated with the product set metadata.
alternate name: external_url
sub property of: external url
domain: Product Set Metadata
range: string

integrity review status
type: Property
comment: The integrity review status of the product set metadata.
alternate name: integrity_review_status
sub property of: integrity review status
domain: Product Set Metadata
range: string

blame field
type: Property
comment: The field associated with the issue identified by the recommendation.
alternate name: blame_field
sub property of: blame field
domain: Ad Recommendation
range: string

code
type: Property
comment: The code associated with the recommendation.
alternate name: code
sub property of: code
domain: Ad Recommendation
range: int

confidence
type: Property
comment: The confidence level assigned to the recommendation, which may be high, medium, or low.
alternate name: confidence
sub property of: confidence
domain: Ad Recommendation
range: string
code list: AdRecommendationConfidence

importance
type: Property
comment: The importance level assigned to the recommendation, which may be high, medium, or low.
alternate name: importance
sub property of: importance
domain: Ad Recommendation
range: string
code list: AdRecommendationImportance

message
type: Property
comment: The message provided with the recommendation.
alternate name: message
sub property of: message
domain: Ad Recommendation
range: string

recommendation data
type: Property
comment: Additional data associated with the recommendation.
alternate name: recommendation_data
sub property of: recommendation data
domain: Ad Recommendation
range: Ad Recommendation Data

title
type: Property
comment: The title of the recommendation.
alternate name: title
sub property of: title
domain: Ad Recommendation
range: string

value
type: Property
comment: A value associated with the recommendation.
alternate name: value
domain: Ad Recommendation
range: string

link
type: Property
comment: A link associated with the recommendation data.
alternate name: link
sub property of: link
domain: Ad Recommendation Data
range: string

event
type: Property
comment: Identifies the event used by the frequency control specification.
alternate name: event
domain: Ad Campaign Frequency Control Specs
range: string

interval days
type: Property
comment: Contains the interval in days used by the frequency control specification.
alternate name: interval_days
sub property of: interval days
domain: Ad Campaign Frequency Control Specs
range: unsignedInt

max frequency
type: Property
comment: Contains the maximum frequency used by the frequency control specification.
alternate name: max_frequency
sub property of: max frequency
domain: Ad Campaign Frequency Control Specs
range: unsignedInt

type
type: Property
comment: Identifies the type of frequency control specification.
alternate name: type
domain: Ad Campaign Frequency Control Specs
range: string

attribution windows
type: Property
comment: Lists the attribution windows associated with the campaign's learning-stage information.
alternate name: attribution_windows
sub property of: attribution windows
domain: Ad Campaign Learning Stage Info
range: string

cas segment
type: Property
comment: Identifies the CAS segment associated with the campaign's learning-stage information.
alternate name: cas_segment
sub property of: cas segment
domain: Ad Campaign Learning Stage Info
range: string

conversions
type: Property
comment: Contains the conversions associated with the campaign's learning-stage information.
alternate name: conversions
domain: Ad Campaign Learning Stage Info
range: unsignedInt

current budget prediction
type: Property
comment: Contains the current budget prediction for the campaign.
alternate name: current_budget_prediction
sub property of: current budget prediction
domain: Ad Campaign Learning Stage Info
range: JSON

dynamic lp conversions threshold
type: Property
comment: Contains the conversions threshold for dynamic learning-phase information.
alternate name: dynamic_lp_conversions_threshold
sub property of: dynamic lp conversions threshold
domain: Ad Campaign Learning Stage Info
range: unsignedInt

dynamic lp days threshold
type: Property
comment: Contains the days threshold for dynamic learning-phase information.
alternate name: dynamic_lp_days_threshold
sub property of: dynamic lp days threshold
domain: Ad Campaign Learning Stage Info
range: unsignedInt

dynamic lp status
type: Property
comment: Describes the status of the dynamic learning-phase information.
alternate name: dynamic_lp_status
sub property of: dynamic lp status
domain: Ad Campaign Learning Stage Info
range: string

is one to one cbo budget
type: Property
comment: Indicates whether the campaign uses a one-to-one CBO budget.
alternate name: is_one_to_one_cbo_budget
sub property of: is one to one cbo budget
domain: Ad Campaign Learning Stage Info
range: boolean

last sig edit ts
type: Property
comment: Contains the timestamp of the last significant edit.
alternate name: last_sig_edit_ts
sub property of: last sig edit ts
domain: Ad Campaign Learning Stage Info
range: int

recommended budget prediction
type: Property
comment: Contains the recommended budget prediction for the campaign.
alternate name: recommended_budget_prediction
sub property of: recommended budget prediction
domain: Ad Campaign Learning Stage Info
range: JSON

sigedit removal
type: Property
comment: Indicates whether significant-edit removal applies.
alternate name: sigedit_removal
sub property of: sigedit removal
domain: Ad Campaign Learning Stage Info
range: boolean

status
type: Property
comment: Describes the campaign's learning-stage status.
alternate name: status
domain: Ad Campaign Learning Stage Info
range: string

australia finserv beneficiary
type: Property
comment: The beneficiary identity for financial services in Australia.
alternate name: australia_finserv_beneficiary
sub property of: australia finserv beneficiary
domain: Regional Regulation Identities
range: string

australia finserv payer
type: Property
comment: The payer identity for financial services in Australia.
alternate name: australia_finserv_payer
sub property of: australia finserv payer
domain: Regional Regulation Identities
range: string

india finserv beneficiary
type: Property
comment: The beneficiary identity for financial services in India.
alternate name: india_finserv_beneficiary
sub property of: india finserv beneficiary
domain: Regional Regulation Identities
range: string

india finserv payer
type: Property
comment: The payer identity for financial services in India.
alternate name: india_finserv_payer
sub property of: india finserv payer
domain: Regional Regulation Identities
range: string

singapore universal beneficiary
type: Property
comment: The universal beneficiary identity for Singapore.
alternate name: singapore_universal_beneficiary
sub property of: singapore universal beneficiary
domain: Regional Regulation Identities
range: string

singapore universal payer
type: Property
comment: The universal payer identity for Singapore.
alternate name: singapore_universal_payer
sub property of: singapore universal payer
domain: Regional Regulation Identities
range: string

taiwan finserv beneficiary
type: Property
comment: The beneficiary identity for financial services in Taiwan.
alternate name: taiwan_finserv_beneficiary
sub property of: taiwan finserv beneficiary
domain: Regional Regulation Identities
range: string

taiwan finserv payer
type: Property
comment: The payer identity for financial services in Taiwan.
alternate name: taiwan_finserv_payer
sub property of: taiwan finserv payer
domain: Regional Regulation Identities
range: string

taiwan universal beneficiary
type: Property
comment: The universal beneficiary identity for Taiwan.
alternate name: taiwan_universal_beneficiary
sub property of: taiwan universal beneficiary
domain: Regional Regulation Identities
range: string

taiwan universal payer
type: Property
comment: The universal payer identity for Taiwan.
alternate name: taiwan_universal_payer
sub property of: taiwan universal payer
domain: Regional Regulation Identities
range: string

universal beneficiary
type: Property
comment: The universal beneficiary identity.
alternate name: universal_beneficiary
sub property of: universal beneficiary
domain: Regional Regulation Identities
range: string

universal payer
type: Property
comment: The universal payer identity.
alternate name: universal_payer
sub property of: universal payer
domain: Regional Regulation Identities
range: string

adgroup id
type: Property
comment: Identifies the ad group associated with the targeting.
alternate name: adgroup_id
sub property of: adgroup id
domain: Targeting
range: string

age max
type: Property
comment: Represents the maximum age in the targeting age range.
alternate name: age_max
sub property of: age max
domain: Targeting
range: unsignedInt

age min
type: Property
comment: Represents the minimum age in the targeting age range.
alternate name: age_min
sub property of: age min
domain: Targeting
range: unsignedInt

age range
type: Property
comment: Represents age-range values included in the targeting.
alternate name: age_range
domain: Targeting
range: unsignedInt

alternate auto targeting option
type: Property
comment: Represents an alternate automatic-targeting option.
alternate name: alternate_auto_targeting_option
sub property of: alternate auto targeting option
domain: Targeting
range: string

app install state
type: Property
comment: Represents the application installation state used in the targeting.
alternate name: app_install_state
sub property of: app install state
domain: Targeting
range: string

audience network positions
type: Property
comment: Represents selected Audience Network positions.
alternate name: audience_network_positions
sub property of: audience network positions
domain: Targeting
range: string

behaviors
type: Property
comment: Represents behaviors included in the targeting.
alternate name: behaviors
sub property of: behaviors
domain: Targeting
range: IDName

brand safety content filter levels
type: Property
comment: Represents brand-safety content filter levels used in the targeting.
alternate name: brand_safety_content_filter_levels
sub property of: brand safety content filter levels
domain: Targeting
range: string

catalog based targeting
type: Property
comment: Represents catalog-based targeting settings.
alternate name: catalog_based_targeting
sub property of: catalog based targeting
domain: Targeting
range: Catalog Based Targeting

cities
type: Property
comment: Represents cities included in the targeting.
alternate name: cities
domain: Targeting
range: IDName

college years
type: Property
comment: Represents college years included in the targeting.
alternate name: college_years
sub property of: college years
domain: Targeting
range: unsignedInt

connections
type: Property
comment: Represents connections included in the targeting.
alternate name: connections
domain: Targeting
range: Connections Targeting

contextual targeting categories
type: Property
comment: Represents contextual targeting categories.
alternate name: contextual_targeting_categories
sub property of: contextual targeting categories
domain: Targeting
range: IDName

countries
type: Property
comment: Represents countries included in the targeting.
alternate name: countries
sub property of: countries
domain: Targeting
range: string

country
type: Property
comment: Represents country values used in the targeting.
alternate name: country
sub property of: country
domain: Targeting
range: string

country groups
type: Property
comment: Represents country groups included in the targeting.
alternate name: country_groups
sub property of: country groups
domain: Targeting
range: string

custom audiences
type: Property
comment: Represents custom audiences included in the targeting.
alternate name: custom_audiences
domain: Targeting
range: Raw Custom Audience

device platforms
type: Property
comment: Represents device platforms included in the targeting, including desktop or mobile.
alternate name: device_platforms
sub property of: device platforms
domain: Targeting
range: string
code list: TargetingDevicePlatforms

direct install devices
type: Property
comment: Indicates whether direct-install devices are included in the targeting.
alternate name: direct_install_devices
sub property of: direct install devices
domain: Targeting
range: boolean

dynamic audience ids
type: Property
comment: Identifies dynamic audiences included in the targeting.
alternate name: dynamic_audience_ids
sub property of: dynamic audience ids
domain: Targeting
range: string

education majors
type: Property
comment: Represents education majors included in the targeting.
alternate name: education_majors
sub property of: education majors
domain: Targeting
range: IDName

education schools
type: Property
comment: Represents education schools included in the targeting.
alternate name: education_schools
sub property of: education schools
domain: Targeting
range: IDName

education statuses
type: Property
comment: Represents education statuses included in the targeting.
alternate name: education_statuses
sub property of: education statuses
domain: Targeting
range: unsignedInt

effective audience network positions
type: Property
comment: Represents the effective Audience Network positions.
alternate name: effective_audience_network_positions
sub property of: effective audience network positions
domain: Targeting
range: string

effective brand safety content filter levels
type: Property
comment: Represents the effective brand-safety content filter levels.
alternate name: effective_brand_safety_content_filter_levels
sub property of: effective brand safety content filter levels
domain: Targeting
range: string

effective device platforms
type: Property
comment: Represents the effective device platforms, including desktop or mobile.
alternate name: effective_device_platforms
sub property of: effective device platforms
domain: Targeting
range: string
code list: TargetingEffectiveDevicePlatforms

effective facebook positions
type: Property
comment: Represents the effective Facebook positions.
alternate name: effective_facebook_positions
sub property of: effective facebook positions
domain: Targeting
range: string

effective instagram positions
type: Property
comment: Represents the effective Instagram positions.
alternate name: effective_instagram_positions
sub property of: effective instagram positions
domain: Targeting
range: string

effective messenger positions
type: Property
comment: Represents the effective Messenger positions.
alternate name: effective_messenger_positions
sub property of: effective messenger positions
domain: Targeting
range: string

effective publisher platforms
type: Property
comment: Represents the effective publisher platforms.
alternate name: effective_publisher_platforms
sub property of: effective publisher platforms
domain: Targeting
range: string

effective threads positions
type: Property
comment: Represents the effective Threads positions.
alternate name: effective_threads_positions
sub property of: effective threads positions
domain: Targeting
range: string

effective whatsapp positions
type: Property
comment: Represents the effective WhatsApp positions.
alternate name: effective_whatsapp_positions
sub property of: effective whatsapp positions
domain: Targeting
range: string

engagement specs
type: Property
comment: Represents engagement specifications used in the targeting.
alternate name: engagement_specs
sub property of: engagement specs
domain: Targeting
range: Targeting Dynamic Rule

ethnic affinity
type: Property
comment: Represents ethnic affinities included in the targeting.
alternate name: ethnic_affinity
sub property of: ethnic affinity
domain: Targeting
range: IDName

exclude reached since
type: Property
comment: Represents values used to exclude people reached since a specified point.
alternate name: exclude_reached_since
sub property of: exclude reached since
domain: Targeting
range: string

excluded brand safety content types
type: Property
comment: Represents brand-safety content types excluded from the targeting.
alternate name: excluded_brand_safety_content_types
sub property of: excluded brand safety content types
domain: Targeting
range: string

excluded connections
type: Property
comment: Represents connections excluded from the targeting.
alternate name: excluded_connections
sub property of: excluded connections
domain: Targeting
range: Connections Targeting

excluded custom audiences
type: Property
comment: Represents custom audiences excluded from the targeting.
alternate name: excluded_custom_audiences
sub property of: excluded custom audiences
domain: Targeting
range: Raw Custom Audience

excluded dynamic audience ids
type: Property
comment: Identifies dynamic audiences excluded from the targeting.
alternate name: excluded_dynamic_audience_ids
sub property of: excluded dynamic audience ids
domain: Targeting
range: string

excluded engagement specs
type: Property
comment: Represents engagement specifications excluded from the targeting.
alternate name: excluded_engagement_specs
sub property of: excluded engagement specs
domain: Targeting
range: Targeting Dynamic Rule

excluded geo locations
type: Property
comment: Represents geographic locations excluded from the targeting.
alternate name: excluded_geo_locations
sub property of: excluded geo locations
domain: Targeting
range: Targeting Geo Location

excluded mobile device model
type: Property
comment: Represents mobile device models excluded from the targeting.
alternate name: excluded_mobile_device_model
sub property of: excluded mobile device model
domain: Targeting
range: string

excluded product audience specs
type: Property
comment: Represents product audience specifications excluded from the targeting.
alternate name: excluded_product_audience_specs
sub property of: excluded product audience specs
domain: Targeting
range: Targeting Product Audience Spec

excluded publisher categories
type: Property
comment: Represents publisher categories excluded from the targeting.
alternate name: excluded_publisher_categories
sub property of: excluded publisher categories
domain: Targeting
range: string

excluded publisher list ids
type: Property
comment: Identifies publisher lists excluded from the targeting.
alternate name: excluded_publisher_list_ids
sub property of: excluded publisher list ids
domain: Targeting
range: string

excluded user device
type: Property
comment: Represents user devices excluded from the targeting.
alternate name: excluded_user_device
sub property of: excluded user device
domain: Targeting
range: string

exclusions
type: Property
comment: Represents flexible targeting exclusions.
alternate name: exclusions
domain: Targeting
range: Flexible Targeting

facebook positions
type: Property
comment: Represents selected Facebook positions.
alternate name: facebook_positions
sub property of: facebook positions
domain: Targeting
range: string

family statuses
type: Property
comment: Represents family statuses included in the targeting.
alternate name: family_statuses
sub property of: family statuses
domain: Targeting
range: IDName

fb deal id
type: Property
comment: Identifies the Facebook deal associated with the targeting.
alternate name: fb_deal_id
sub property of: fb deal id
domain: Targeting
range: string

flexible spec
type: Property
comment: Represents flexible targeting specifications.
alternate name: flexible_spec
sub property of: flexible spec
domain: Targeting
range: Flexible Targeting

friends of connections
type: Property
comment: Represents friends of connections included in the targeting.
alternate name: friends_of_connections
domain: Targeting
range: Connections Targeting

genders
type: Property
comment: Represents genders included in the targeting.
alternate name: genders
sub property of: genders
domain: Targeting
range: unsignedInt

generation
type: Property
comment: Represents generations included in the targeting.
alternate name: generation
sub property of: generation
domain: Targeting
range: IDName

geo locations
type: Property
comment: Represents geographic locations included in the targeting.
alternate name: geo_locations
sub property of: geo locations
domain: Targeting
range: Targeting Geo Location

home ownership
type: Property
comment: Represents home-ownership categories included in the targeting.
alternate name: home_ownership
sub property of: home ownership
domain: Targeting
range: IDName

home type
type: Property
comment: Represents home types included in the targeting.
alternate name: home_type
sub property of: home type
domain: Targeting
range: IDName

home value
type: Property
comment: Represents home-value categories included in the targeting.
alternate name: home_value
sub property of: home value
domain: Targeting
range: IDName

household composition
type: Property
comment: Represents household compositions included in the targeting.
alternate name: household_composition
sub property of: household composition
domain: Targeting
range: IDName

income
type: Property
comment: Represents income categories included in the targeting.
alternate name: income
sub property of: income
domain: Targeting
range: IDName

industries
type: Property
comment: Represents industries included in the targeting.
alternate name: industries
sub property of: industries
domain: Targeting
range: IDName

instagram positions
type: Property
comment: Represents selected Instagram positions.
alternate name: instagram_positions
sub property of: instagram positions
domain: Targeting
range: string

install state application
type: Property
comment: Represents the application installation state used in the targeting.
alternate name: install_state_application
sub property of: install state application
domain: Targeting
range: string

instream video skippable excluded
type: Property
comment: Indicates whether skippable in-stream video placements are excluded.
alternate name: instream_video_skippable_excluded
sub property of: instream video skippable excluded
domain: Targeting
range: boolean

interested in
type: Property
comment: Represents interest categories included in the targeting.
alternate name: interested_in
sub property of: interested in
domain: Targeting
range: unsignedInt

interests
type: Property
comment: Represents interests included in the targeting.
alternate name: interests
sub property of: interests
domain: Targeting
range: IDName

is whatsapp destination ad
type: Property
comment: Indicates whether the ad has WhatsApp as its destination.
alternate name: is_whatsapp_destination_ad
sub property of: is whatsapp destination ad
domain: Targeting
range: boolean

keywords
type: Property
comment: Represents keywords included in the targeting.
alternate name: keywords
domain: Targeting
range: string

life events
type: Property
comment: Represents life events included in the targeting.
alternate name: life_events
sub property of: life events
domain: Targeting
range: IDName

locales
type: Property
comment: Represents locales included in the targeting.
alternate name: locales
sub property of: locales
domain: Targeting
range: unsignedInt

messenger positions
type: Property
comment: Represents selected Messenger positions.
alternate name: messenger_positions
sub property of: messenger positions
domain: Targeting
range: string

moms
type: Property
comment: Represents mother-related audience categories included in the targeting.
alternate name: moms
sub property of: moms
domain: Targeting
range: IDName

net worth
type: Property
comment: Represents net-worth categories included in the targeting.
alternate name: net_worth
sub property of: net worth
domain: Targeting
range: IDName

office type
type: Property
comment: Represents office types included in the targeting.
alternate name: office_type
sub property of: office type
domain: Targeting
range: IDName

place page set ids
type: Property
comment: Identifies place Page sets included in the targeting.
alternate name: place_page_set_ids
sub property of: place page set ids
domain: Targeting
range: string

political views
type: Property
comment: Represents political views included in the targeting.
alternate name: political_views
sub property of: political views
domain: Targeting
range: unsignedInt

politics
type: Property
comment: Represents political categories included in the targeting.
alternate name: politics
sub property of: politics
domain: Targeting
range: IDName

product audience specs
type: Property
comment: Represents product audience specifications included in the targeting.
alternate name: product_audience_specs
sub property of: product audience specs
domain: Targeting
range: Targeting Product Audience Spec

prospecting audience
type: Property
comment: Represents prospecting audience settings.
alternate name: prospecting_audience
sub property of: prospecting audience
domain: Targeting
range: Targeting Prospecting Audience

publisher platforms
type: Property
comment: Represents publisher platforms included in the targeting.
alternate name: publisher_platforms
sub property of: publisher platforms
domain: Targeting
range: string

radius
type: Property
comment: Represents the targeting radius.
alternate name: radius
domain: Targeting
range: string

regions
type: Property
comment: Represents regions included in the targeting.
alternate name: regions
domain: Targeting
range: IDName

relationship statuses
type: Property
comment: Represents relationship statuses included in the targeting.
alternate name: relationship_statuses
sub property of: relationship statuses
domain: Targeting
range: unsignedInt

site category
type: Property
comment: Represents site categories included in the targeting.
alternate name: site_category
sub property of: site category
domain: Targeting
range: string

subscriber universe
type: Property
comment: Represents subscriber-universe settings.
alternate name: subscriber_universe
sub property of: subscriber universe
domain: Targeting
range: Targeting Subscriber Universe

targeting automation
type: Property
comment: Represents targeting automation settings.
alternate name: targeting_automation
sub property of: targeting automation
domain: Targeting
range: Targeting Automation

targeting optimization
type: Property
comment: Represents the targeting optimization setting.
alternate name: targeting_optimization
sub property of: targeting optimization
domain: Targeting
range: string

targeting relaxation types
type: Property
comment: Represents targeting relaxation settings.
alternate name: targeting_relaxation_types
sub property of: targeting relaxation types
domain: Targeting
range: Targeting Relaxation

threads positions
type: Property
comment: Represents selected Threads positions.
alternate name: threads_positions
sub property of: threads positions
domain: Targeting
range: string

user adclusters
type: Property
comment: Represents user ad clusters included in the targeting.
alternate name: user_adclusters
sub property of: user adclusters
domain: Targeting
range: IDName

user age unknown
type: Property
comment: Indicates whether users of unknown age are included in the targeting.
alternate name: user_age_unknown
sub property of: user age unknown
domain: Targeting
range: boolean

user device
type: Property
comment: Represents the devices included in the targeting criteria.
alternate name: user_device
sub property of: user device
domain: Targeting
range: string

user event
type: Property
comment: Represents a user event included in the targeting criteria.
alternate name: user_event
sub property of: user event
domain: Targeting
range: unsignedInt

user os
type: Property
comment: Represents the operating systems included in the targeting criteria.
alternate name: user_os
sub property of: user os
domain: Targeting
range: string

whatsapp positions
type: Property
comment: Represents the WhatsApp positions included in the targeting criteria.
alternate name: whatsapp_positions
sub property of: whatsapp positions
domain: Targeting
range: string

wireless carrier
type: Property
comment: Represents the wireless carriers included in the targeting criteria.
alternate name: wireless_carrier
sub property of: wireless carrier
domain: Targeting
range: string

work employers
type: Property
comment: Represents the employers included in the targeting criteria.
alternate name: work_employers
sub property of: work employers
domain: Targeting
range: IDName

work positions
type: Property
comment: Represents the work positions included in the targeting criteria.
alternate name: work_positions
sub property of: work positions
domain: Targeting
range: IDName

zips
type: Property
comment: Represents the ZIP codes included in the targeting criteria.
alternate name: zips
domain: Targeting
range: string

id
type: Property
comment: Represents the identifier associated with the ID-and-name object.
alternate name: id
sub property of: id
domain: IDName
range: string

name
type: Property
comment: Represents the name associated with the ID-and-name object.
alternate name: name
sub property of: name
domain: IDName
range: string

geo targeting type
type: Property
comment: The geographic targeting type used by the catalog-based targeting configuration.
alternate name: geo_targeting_type
sub property of: geo targeting type
domain: Catalog Based Targeting
range: string

id
type: Property
comment: The identifier of the connections targeting configuration.
alternate name: id
sub property of: id
domain: Connections Targeting
range: string

name
type: Property
comment: The name of the connections targeting configuration.
alternate name: name
sub property of: name
domain: Connections Targeting
range: string

id
type: Property
comment: The identifier of the raw custom audience.
alternate name: id
sub property of: id
domain: Raw Custom Audience
range: string

name
type: Property
comment: The name of the raw custom audience.
alternate name: name
sub property of: name
domain: Raw Custom Audience
range: string

action type
type: Property
comment: Represents the type of action associated with the dynamic rule.
alternate name: action.type
domain: Targeting Dynamic Rule
range: string

ad group id
type: Property
comment: Identifies the ad group associated with the dynamic rule.
alternate name: ad_group_id
sub property of: ad group id
domain: Targeting Dynamic Rule
range: string

campaign group id
type: Property
comment: Identifies the campaign group associated with the dynamic rule.
alternate name: campaign_group_id
sub property of: campaign group id
domain: Targeting Dynamic Rule
range: string

campaign id
type: Property
comment: Identifies the campaign associated with the dynamic rule.
alternate name: campaign_id
sub property of: campaign id
domain: Targeting Dynamic Rule
range: string

impression count
type: Property
comment: Represents the impression count associated with the dynamic rule.
alternate name: impression_count
sub property of: impression count
domain: Targeting Dynamic Rule
range: string

page id
type: Property
comment: Identifies the page associated with the dynamic rule.
alternate name: page_id
sub property of: page id
domain: Targeting Dynamic Rule
range: string

post
type: Property
comment: Represents the post associated with the dynamic rule.
alternate name: post
sub property of: post
domain: Targeting Dynamic Rule
range: string

retention seconds
type: Property
comment: Represents the retention duration associated with the dynamic rule.
alternate name: retention_seconds
sub property of: retention seconds
domain: Targeting Dynamic Rule
range: string

cities
type: Property
comment: Contains the cities included in the geographic targeting.
alternate name: cities
domain: Targeting Geo Location
range: Targeting Geo Location City

countries
type: Property
comment: Contains the countries included in the geographic targeting.
alternate name: countries
sub property of: countries
domain: Targeting Geo Location
range: string

country groups
type: Property
comment: Contains the country groups included in the geographic targeting.
alternate name: country_groups
sub property of: country groups
domain: Targeting Geo Location
range: string

custom locations
type: Property
comment: Contains the custom locations included in the geographic targeting.
alternate name: custom_locations
sub property of: custom locations
domain: Targeting Geo Location
range: Targeting Geo Location Custom Location

electoral districts
type: Property
comment: Contains the electoral districts included in the geographic targeting.
alternate name: electoral_districts
sub property of: electoral districts
domain: Targeting Geo Location
range: Targeting Geo Location Electoral District

geo markets
type: Property
comment: Contains the geographic markets included in the geographic targeting.
alternate name: geo_markets
sub property of: geo markets
domain: Targeting Geo Location
range: Targeting Geo Location Market

large geo areas
type: Property
comment: Contains the large geographic areas included in the geographic targeting.
alternate name: large_geo_areas
sub property of: large geo areas
domain: Targeting Geo Location
range: Targeting Geo Location Geo Entities

location cluster ids
type: Property
comment: Contains the location clusters included in the geographic targeting.
alternate name: location_cluster_ids
sub property of: location cluster ids
domain: Targeting Geo Location
range: Targeting Geo Location Location Cluster

location types
type: Property
comment: Contains the location types included in the geographic targeting.
alternate name: location_types
sub property of: location types
domain: Targeting Geo Location
range: string

medium geo areas
type: Property
comment: Contains the medium geographic areas included in the geographic targeting.
alternate name: medium_geo_areas
sub property of: medium geo areas
domain: Targeting Geo Location
range: Targeting Geo Location Geo Entities

metro areas
type: Property
comment: Contains the metropolitan areas included in the geographic targeting.
alternate name: metro_areas
sub property of: metro areas
domain: Targeting Geo Location
range: Targeting Geo Location Geo Entities

neighborhoods
type: Property
comment: Contains the neighborhoods included in the geographic targeting.
alternate name: neighborhoods
domain: Targeting Geo Location
range: Targeting Geo Location Geo Entities

places
type: Property
comment: Contains the places included in the geographic targeting.
alternate name: places
sub property of: places
domain: Targeting Geo Location
range: Targeting Geo Location Place

political districts
type: Property
comment: Contains the political districts included in the geographic targeting.
alternate name: political_districts
sub property of: political districts
domain: Targeting Geo Location
range: Targeting Geo Location Political District

regions
type: Property
comment: Contains the regions included in the geographic targeting.
alternate name: regions
domain: Targeting Geo Location
range: Targeting Geo Location Region

small geo areas
type: Property
comment: Contains the small geographic areas included in the geographic targeting.
alternate name: small_geo_areas
sub property of: small geo areas
domain: Targeting Geo Location
range: Targeting Geo Location Geo Entities

subcities
type: Property
comment: Contains the subcities included in the geographic targeting.
alternate name: subcities
sub property of: subcities
domain: Targeting Geo Location
range: Targeting Geo Location Geo Entities

subneighborhoods
type: Property
comment: Contains the subneighborhoods included in the geographic targeting.
alternate name: subneighborhoods
sub property of: subneighborhoods
domain: Targeting Geo Location
range: Targeting Geo Location Geo Entities

zips
type: Property
comment: Contains the ZIP codes included in the geographic targeting.
alternate name: zips
domain: Targeting Geo Location
range: Targeting Geo Location Zip

country
type: Property
comment: Identifies the country associated with the city.
alternate name: country
sub property of: country
domain: Targeting Geo Location City
range: string

distance unit
type: Property
comment: Represents the distance unit associated with the city.
alternate name: distance_unit
sub property of: distance unit
domain: Targeting Geo Location City
range: string

key
type: Property
comment: Identifies the city.
alternate name: key
domain: Targeting Geo Location City
range: string

name
type: Property
comment: Represents the city name.
alternate name: name
sub property of: name
domain: Targeting Geo Location City
range: string

radius
type: Property
comment: Represents the city radius.
alternate name: radius
domain: Targeting Geo Location City
range: unsignedInt

region
type: Property
comment: Represents the region associated with the city.
alternate name: region
sub property of: region
domain: Targeting Geo Location City
range: string

region id
type: Property
comment: Identifies the region associated with the city.
alternate name: region_id
domain: Targeting Geo Location City
range: string

address string
type: Property
comment: Represents the address of the custom location.
alternate name: address_string
sub property of: address string
domain: Targeting Geo Location Custom Location
range: string

country
type: Property
comment: Identifies the country associated with the custom location.
alternate name: country
sub property of: country
domain: Targeting Geo Location Custom Location
range: string

country group
type: Property
comment: Represents the country group associated with the custom location.
alternate name: country_group
sub property of: country group
domain: Targeting Geo Location Custom Location
range: string

custom type
type: Property
comment: Represents the type of custom location.
alternate name: custom_type
sub property of: custom type
domain: Targeting Geo Location Custom Location
range: string

distance unit
type: Property
comment: Represents the distance unit associated with the custom location.
alternate name: distance_unit
sub property of: distance unit
domain: Targeting Geo Location Custom Location
range: string

key
type: Property
comment: Identifies the custom location.
alternate name: key
domain: Targeting Geo Location Custom Location
range: string

latitude
type: Property
comment: Represents the latitude of the custom location.
alternate name: latitude
sub property of: latitude
domain: Targeting Geo Location Custom Location
range: double

longitude
type: Property
comment: Represents the longitude of the custom location.
alternate name: longitude
sub property of: longitude
domain: Targeting Geo Location Custom Location
range: double

max population
type: Property
comment: Represents the maximum population associated with the custom location.
alternate name: max_population
sub property of: max population
domain: Targeting Geo Location Custom Location
range: int

min population
type: Property
comment: Represents the minimum population associated with the custom location.
alternate name: min_population
sub property of: min population
domain: Targeting Geo Location Custom Location
range: int

name
type: Property
comment: Represents the name of the custom location.
alternate name: name
sub property of: name
domain: Targeting Geo Location Custom Location
range: string

primary city id
type: Property
comment: Identifies the primary city associated with the custom location.
alternate name: primary_city_id
sub property of: primary city id
domain: Targeting Geo Location Custom Location
range: int

radius
type: Property
comment: Represents the radius of the custom location.
alternate name: radius
domain: Targeting Geo Location Custom Location
range: double

region id
type: Property
comment: Identifies the region associated with the custom location.
alternate name: region_id
domain: Targeting Geo Location Custom Location
range: int

country
type: Property
comment: Identifies the country associated with the electoral district.
alternate name: country
sub property of: country
domain: Targeting Geo Location Electoral District
range: string

deprecation code
type: Property
comment: Represents the deprecation code associated with the electoral district.
alternate name: deprecation_code
sub property of: deprecation code
domain: Targeting Geo Location Electoral District
range: string

electoral district
type: Property
comment: Represents the electoral district.
alternate name: electoral_district
sub property of: electoral district
domain: Targeting Geo Location Electoral District
range: string

key
type: Property
comment: Identifies the electoral district.
alternate name: key
domain: Targeting Geo Location Electoral District
range: string

name
type: Property
comment: Represents the electoral district name.
alternate name: name
sub property of: name
domain: Targeting Geo Location Electoral District
range: string

country
type: Property
comment: Identifies the country associated with the market.
alternate name: country
sub property of: country
domain: Targeting Geo Location Market
range: string

key
type: Property
comment: Identifies the market.
alternate name: key
domain: Targeting Geo Location Market
range: string

market type
type: Property
comment: Represents the type of market.
alternate name: market_type
sub property of: market type
domain: Targeting Geo Location Market
range: string

name
type: Property
comment: Represents the market name.
alternate name: name
sub property of: name
domain: Targeting Geo Location Market
range: string

country
type: Property
comment: Identifies the country associated with the geographic entity.
alternate name: country
sub property of: country
domain: Targeting Geo Location Geo Entities
range: string

key
type: Property
comment: Identifies the geographic entity.
alternate name: key
domain: Targeting Geo Location Geo Entities
range: string

name
type: Property
comment: Represents the geographic entity name.
alternate name: name
sub property of: name
domain: Targeting Geo Location Geo Entities
range: string

region
type: Property
comment: Represents the region associated with the geographic entity.
alternate name: region
sub property of: region
domain: Targeting Geo Location Geo Entities
range: string

region id
type: Property
comment: Identifies the region associated with the geographic entity.
alternate name: region_id
domain: Targeting Geo Location Geo Entities
range: string

key
type: Property
comment: Identifies the location cluster.
alternate name: key
domain: Targeting Geo Location Location Cluster
range: int

country
type: Property
comment: Identifies the country associated with the place.
alternate name: country
sub property of: country
domain: Targeting Geo Location Place
range: string

distance unit
type: Property
comment: Represents the distance unit associated with the place.
alternate name: distance_unit
sub property of: distance unit
domain: Targeting Geo Location Place
range: string

key
type: Property
comment: Identifies the place.
alternate name: key
domain: Targeting Geo Location Place
range: string

latitude
type: Property
comment: Represents the latitude of the place.
alternate name: latitude
sub property of: latitude
domain: Targeting Geo Location Place
range: double

longitude
type: Property
comment: Represents the longitude of the place.
alternate name: longitude
sub property of: longitude
domain: Targeting Geo Location Place
range: double

name
type: Property
comment: Represents the place name.
alternate name: name
sub property of: name
domain: Targeting Geo Location Place
range: string

primary city id
type: Property
comment: Identifies the primary city associated with the place.
alternate name: primary_city_id
sub property of: primary city id
domain: Targeting Geo Location Place
range: int

radius
type: Property
comment: Represents the radius of the place.
alternate name: radius
domain: Targeting Geo Location Place
range: double

region id
type: Property
comment: Identifies the region associated with the place.
alternate name: region_id
domain: Targeting Geo Location Place
range: int

country
type: Property
comment: Identifies the country associated with the political district.
alternate name: country
sub property of: country
domain: Targeting Geo Location Political District
range: string

key
type: Property
comment: Identifies the political district.
alternate name: key
domain: Targeting Geo Location Political District
range: string

name
type: Property
comment: Represents the political district name.
alternate name: name
sub property of: name
domain: Targeting Geo Location Political District
range: string

political district
type: Property
comment: Represents the political district.
alternate name: political_district
sub property of: political district
domain: Targeting Geo Location Political District
range: string

country
type: Property
comment: Identifies the country associated with the region.
alternate name: country
sub property of: country
domain: Targeting Geo Location Region
range: string

key
type: Property
comment: Identifies the region.
alternate name: key
domain: Targeting Geo Location Region
range: string

name
type: Property
comment: Represents the region name.
alternate name: name
sub property of: name
domain: Targeting Geo Location Region
range: string

country
type: Property
comment: Identifies the country associated with the ZIP code.
alternate name: country
sub property of: country
domain: Targeting Geo Location Zip
range: string

key
type: Property
comment: Identifies the ZIP code.
alternate name: key
domain: Targeting Geo Location Zip
range: string

name
type: Property
comment: Represents the ZIP code name.
alternate name: name
sub property of: name
domain: Targeting Geo Location Zip
range: string

primary city id
type: Property
comment: Identifies the primary city associated with the ZIP code.
alternate name: primary_city_id
sub property of: primary city id
domain: Targeting Geo Location Zip
range: int

region id
type: Property
comment: Identifies the region associated with the ZIP code.
alternate name: region_id
domain: Targeting Geo Location Zip
range: int

exclusions
type: Property
comment: Contains the product audience specifications excluded from the targeting.
alternate name: exclusions
domain: Targeting Product Audience Spec
range: Targeting Product Audience Sub Spec

inclusions
type: Property
comment: Contains the product audience specifications included in the targeting.
alternate name: inclusions
sub property of: inclusions
domain: Targeting Product Audience Spec
range: Targeting Product Audience Sub Spec

product set id
type: Property
comment: Identifies the product set associated with the audience specification.
alternate name: product_set_id
sub property of: product set id
domain: Targeting Product Audience Spec
range: string

min retention seconds
type: Property
comment: Represents the minimum retention duration associated with the product audience specification.
alternate name: min_retention_seconds
sub property of: min retention seconds
domain: Targeting Product Audience Sub Spec
range: string

retention seconds
type: Property
comment: Represents the retention duration associated with the product audience specification.
alternate name: retention_seconds
sub property of: retention seconds
domain: Targeting Product Audience Sub Spec
range: string

rule
type: Property
comment: Represents the rule associated with the product audience specification.
alternate name: rule
sub property of: rule
domain: Targeting Product Audience Sub Spec
range: string

behaviors
type: Property
comment: Represents the behaviors included in flexible targeting.
alternate name: behaviors
sub property of: behaviors
domain: Flexible Targeting
range: IDName

college years
type: Property
comment: Represents the college years included in flexible targeting.
alternate name: college_years
sub property of: college years
domain: Flexible Targeting
range: unsignedInt

connections
type: Property
comment: Represents the connections included in flexible targeting.
alternate name: connections
domain: Flexible Targeting
range: IDName

custom audiences
type: Property
comment: Represents the custom audiences included in flexible targeting.
alternate name: custom_audiences
domain: Flexible Targeting
range: IDName

education majors
type: Property
comment: Represents the education majors included in flexible targeting.
alternate name: education_majors
sub property of: education majors
domain: Flexible Targeting
range: IDName

education schools
type: Property
comment: Represents the education schools included in flexible targeting.
alternate name: education_schools
sub property of: education schools
domain: Flexible Targeting
range: IDName

education statuses
type: Property
comment: Represents the education statuses included in flexible targeting.
alternate name: education_statuses
sub property of: education statuses
domain: Flexible Targeting
range: unsignedInt

ethnic affinity
type: Property
comment: Represents the ethnic affinities included in flexible targeting.
alternate name: ethnic_affinity
sub property of: ethnic affinity
domain: Flexible Targeting
range: IDName

family statuses
type: Property
comment: Represents the family statuses included in flexible targeting.
alternate name: family_statuses
sub property of: family statuses
domain: Flexible Targeting
range: IDName

friends of connections
type: Property
comment: Represents the friends of connections included in flexible targeting.
alternate name: friends_of_connections
domain: Flexible Targeting
range: IDName

generation
type: Property
comment: Represents the generations included in flexible targeting.
alternate name: generation
sub property of: generation
domain: Flexible Targeting
range: IDName

home ownership
type: Property
comment: Represents the home ownership categories included in flexible targeting.
alternate name: home_ownership
sub property of: home ownership
domain: Flexible Targeting
range: IDName

home type
type: Property
comment: Represents the home types included in flexible targeting.
alternate name: home_type
sub property of: home type
domain: Flexible Targeting
range: IDName

home value
type: Property
comment: Represents the home value categories included in flexible targeting.
alternate name: home_value
sub property of: home value
domain: Flexible Targeting
range: IDName

household composition
type: Property
comment: Represents the household composition categories included in flexible targeting.
alternate name: household_composition
sub property of: household composition
domain: Flexible Targeting
range: IDName

income
type: Property
comment: Represents the income categories included in flexible targeting.
alternate name: income
sub property of: income
domain: Flexible Targeting
range: IDName

industries
type: Property
comment: Represents the industries included in flexible targeting.
alternate name: industries
sub property of: industries
domain: Flexible Targeting
range: IDName

interested in
type: Property
comment: Represents the categories of people or things targeted by the interested-in criteria.
alternate name: interested_in
sub property of: interested in
domain: Flexible Targeting
range: unsignedInt

interests
type: Property
comment: Represents the interests included in flexible targeting.
alternate name: interests
sub property of: interests
domain: Flexible Targeting
range: IDName

life events
type: Property
comment: Represents the life events included in flexible targeting.
alternate name: life_events
sub property of: life events
domain: Flexible Targeting
range: IDName

moms
type: Property
comment: Represents the mother-related categories included in flexible targeting.
alternate name: moms
sub property of: moms
domain: Flexible Targeting
range: IDName

net worth
type: Property
comment: Represents net-worth targeting criteria in FlexibleTargeting.
alternate name: net_worth
sub property of: net worth
domain: Flexible Targeting
range: IDName

office type
type: Property
comment: Represents office-type targeting criteria in FlexibleTargeting.
alternate name: office_type
sub property of: office type
domain: Flexible Targeting
range: IDName

politics
type: Property
comment: Represents political targeting criteria in FlexibleTargeting.
alternate name: politics
sub property of: politics
domain: Flexible Targeting
range: IDName

relationship statuses
type: Property
comment: Represents relationship-status targeting criteria in FlexibleTargeting.
alternate name: relationship_statuses
sub property of: relationship statuses
domain: Flexible Targeting
range: unsignedInt

user adclusters
type: Property
comment: Represents user ad-cluster targeting criteria in FlexibleTargeting.
alternate name: user_adclusters
sub property of: user adclusters
domain: Flexible Targeting
range: IDName

work employers
type: Property
comment: Represents employer-based targeting criteria in FlexibleTargeting.
alternate name: work_employers
sub property of: work employers
domain: Flexible Targeting
range: IDName

work positions
type: Property
comment: Represents work-position targeting criteria in FlexibleTargeting.
alternate name: work_positions
sub property of: work positions
domain: Flexible Targeting
range: IDName

sources
type: Property
comment: Represents the sources associated with the prospecting audience.
alternate name: sources
sub property of: sources
domain: Targeting Prospecting Audience
range: JSON

messaging customer base for whatsapp
type: Property
comment: Represents the messaging customer base for WhatsApp in the subscriber universe.
alternate name: messaging_customer_base_for_whatsapp
sub property of: messaging customer base for whatsapp
domain: Targeting Subscriber Universe
range: IDName

messenger subscriber pool
type: Property
comment: Represents the Messenger subscriber pool in the subscriber universe.
alternate name: messenger_subscriber_pool
sub property of: messenger subscriber pool
domain: Targeting Subscriber Universe
range: IDName

messenger subscriber source
type: Property
comment: Represents the source of Messenger subscribers in the subscriber universe.
alternate name: messenger_subscriber_source
sub property of: messenger subscriber source
domain: Targeting Subscriber Universe
range: IDName

whatsapp subscriber source
type: Property
comment: Represents the source of WhatsApp subscribers in the subscriber universe.
alternate name: whatsapp_subscriber_source
sub property of: whatsapp subscriber source
domain: Targeting Subscriber Universe
range: IDName

advantage audience
type: Property
comment: Represents the Advantage audience automation setting.
alternate name: advantage_audience
sub property of: advantage audience
domain: Targeting Automation
range: unsignedInt

creative audience pairing
type: Property
comment: Represents the creative-audience pairing automation setting.
alternate name: creative_audience_pairing
sub property of: creative audience pairing
domain: Targeting Automation
range: unsignedInt

individual setting
type: Property
comment: Represents an individual targeting automation setting.
alternate name: individual_setting
sub property of: individual setting
domain: Targeting Automation
range: JSON

shared audiences
type: Property
comment: Represents the shared audiences automation setting.
alternate name: shared_audiences
sub property of: shared audiences
domain: Targeting Automation
range: unsignedInt

value expression
type: Property
comment: Represents the value expression automation setting.
alternate name: value_expression
sub property of: value expression
domain: Targeting Automation
range: unsignedInt

custom audience
type: Property
comment: Represents the custom-audience setting for targeting relaxation.
alternate name: custom_audience
sub property of: custom audience
domain: Targeting Relaxation
range: unsignedInt

lookalike
type: Property
comment: Represents the lookalike setting for targeting relaxation.
alternate name: lookalike
sub property of: lookalike
domain: Targeting Relaxation
range: unsignedInt

audience network positions
type: Property
comment: Represents the Audience Network positions for the soft opt-out placement.
alternate name: audience_network_positions
sub property of: audience network positions
domain: Placement Soft Opt Out
range: string

facebook positions
type: Property
comment: Represents the Facebook positions for the soft opt-out placement.
alternate name: facebook_positions
sub property of: facebook positions
domain: Placement Soft Opt Out
range: string

instagram positions
type: Property
comment: Represents the Instagram positions for the soft opt-out placement.
alternate name: instagram_positions
sub property of: instagram positions
domain: Placement Soft Opt Out
range: string

messenger positions
type: Property
comment: Represents the Messenger positions for the soft opt-out placement.
alternate name: messenger_positions
sub property of: messenger positions
domain: Placement Soft Opt Out
range: string

oculus positions
type: Property
comment: Represents the Oculus positions for the soft opt-out placement.
alternate name: oculus_positions
sub property of: oculus positions
domain: Placement Soft Opt Out
range: string

threads positions
type: Property
comment: Represents the Threads positions for the soft opt-out placement.
alternate name: threads_positions
sub property of: threads positions
domain: Placement Soft Opt Out
range: string

whatsapp positions
type: Property
comment: Represents the WhatsApp positions for the soft opt-out placement.
alternate name: whatsapp_positions
sub property of: whatsapp positions
domain: Placement Soft Opt Out
range: string

is all trending
type: Property
comment: Indicates whether the trending-topics specification represents all trending topics.
alternate name: is_all_trending
sub property of: is all trending
domain: Trending Topics Spec
range: boolean

is special budget alloc
type: Property
comment: Indicates whether the trending-topics specification has special budget allocation.
alternate name: is_special_budget_alloc
sub property of: is special budget alloc
domain: Trending Topics Spec
range: boolean

trending topics
type: Property
comment: Represents the trending topics in the specification.
alternate name: trending_topics
sub property of: trending topics
domain: Trending Topics Spec
range: string

api enum
type: Property
comment: Represents the API enumeration associated with the Page category.
alternate name: api_enum
sub property of: api enum
domain: Page Category
range: string

fb page categories
type: Property
comment: Represents the Facebook Page categories associated with the Page category.
alternate name: fb_page_categories
sub property of: fb page categories
domain: Page Category
range: Page Category

id
type: Property
comment: Represents the identifier of the Page category.
alternate name: id
sub property of: id
domain: Page Category
range: string

name
type: Property
comment: Represents the name of the Page category.
alternate name: name
sub property of: name
domain: Page Category
range: string

biography
type: Property
comment: Represents the biography associated with the user.
alternate name: biography
sub property of: biography
domain: IGUser
range: string

business discovery
type: Property
comment: Contains business discovery information associated with the user.
alternate name: business_discovery
sub property of: business discovery
domain: IGUser
range: IGUser

collaborative media search
type: Property
comment: Contains collaborative media search information associated with the user.
alternate name: collaborative_media_search
sub property of: collaborative media search
domain: IGUser
range: Shadow IGUser Collaborative Media

followers count
type: Property
comment: Represents the number of followers associated with the user.
alternate name: followers_count
domain: IGUser
range: int

follows count
type: Property
comment: Represents the number of accounts followed by the user.
alternate name: follows_count
sub property of: follows count
domain: IGUser
range: int

has profile pic
type: Property
comment: Indicates whether the user has a profile picture.
alternate name: has_profile_pic
sub property of: has profile pic
domain: IGUser
range: boolean

id
type: Property
comment: Identifies the user.
alternate name: id
sub property of: id
domain: IGUser
range: string

ig id
type: Property
comment: Represents an Instagram identifier for the user.
alternate name: ig_id
domain: IGUser
range: int

is published
type: Property
comment: Indicates whether the user is published.
alternate name: is_published
sub property of: is published
domain: IGUser
range: boolean

legacy instagram user id
type: Property
comment: Represents a legacy Instagram identifier for the user.
alternate name: legacy_instagram_user_id
sub property of: legacy instagram user id
domain: IGUser
range: string

media count
type: Property
comment: Represents the number of media items associated with the user.
alternate name: media_count
sub property of: media count
domain: IGUser
range: int

mentioned comment
type: Property
comment: Contains the comment associated with a mention of the user.
alternate name: mentioned_comment
sub property of: mentioned comment
domain: IGUser
range: IGComment

mentioned media
type: Property
comment: Contains the media associated with a mention of the user.
alternate name: mentioned_media
sub property of: mentioned media
domain: IGUser
range: IGMedia

mini shop storefront
type: Property
comment: Contains the mini shop storefront associated with the user.
alternate name: mini_shop_storefront
sub property of: mini shop storefront
domain: IGUser
range: Shop

name
type: Property
comment: Represents the user's name.
alternate name: name
sub property of: name
domain: IGUser
range: string

owner business
type: Property
comment: Contains the business associated with the user as its owner.
alternate name: owner_business
sub property of: owner business
domain: IGUser
range: Business

profile picture url
type: Property
comment: Provides the URL of the user's profile picture.
alternate name: profile_picture_url
sub property of: profile picture url
domain: IGUser
range: string

shopping product tag eligibility
type: Property
comment: Indicates whether the user is eligible for shopping product tagging.
alternate name: shopping_product_tag_eligibility
sub property of: shopping product tag eligibility
domain: IGUser
range: boolean

shopping review status
type: Property
comment: Represents the user's shopping review status.
alternate name: shopping_review_status
sub property of: shopping review status
domain: IGUser
range: string

username
type: Property
comment: Represents the user's username.
alternate name: username
sub property of: username
domain: IGUser
range: string

website
type: Property
comment: Provides the website associated with the user.
alternate name: website
domain: IGUser
range: string

caption
type: Property
comment: The caption of the collaborative media.
alternate name: caption
sub property of: caption
domain: Shadow IGUser Collaborative Media
range: string

comments count
type: Property
comment: The number of comments associated with the collaborative media.
alternate name: comments_count
sub property of: comments count
domain: Shadow IGUser Collaborative Media
range: int

id
type: Property
comment: The identifier of the collaborative media.
alternate name: id
sub property of: id
domain: Shadow IGUser Collaborative Media
range: string

like count
type: Property
comment: The number of likes associated with the collaborative media.
alternate name: like_count
sub property of: like count
domain: Shadow IGUser Collaborative Media
range: int

media product type
type: Property
comment: The product type of the collaborative media.
alternate name: media_product_type
sub property of: media product type
domain: Shadow IGUser Collaborative Media
range: string

media type
type: Property
comment: The type of the collaborative media.
alternate name: media_type
sub property of: media type
domain: Shadow IGUser Collaborative Media
range: string

media url
type: Property
comment: The URL of the collaborative media.
alternate name: media_url
sub property of: media url
domain: Shadow IGUser Collaborative Media
range: string

permalink
type: Property
comment: The permalink of the collaborative media.
alternate name: permalink
sub property of: permalink
domain: Shadow IGUser Collaborative Media
range: string

reposts count
type: Property
comment: The number of reposts of the collaborative media.
alternate name: reposts_count
sub property of: reposts count
domain: Shadow IGUser Collaborative Media
range: int

saved count
type: Property
comment: The number of times the collaborative media was saved.
alternate name: saved_count
sub property of: saved count
domain: Shadow IGUser Collaborative Media
range: int

shares count
type: Property
comment: The number of shares of the collaborative media.
alternate name: shares_count
sub property of: shares count
domain: Shadow IGUser Collaborative Media
range: int

thumbnail url
type: Property
comment: The URL of the collaborative media thumbnail.
alternate name: thumbnail_url
sub property of: thumbnail url
domain: Shadow IGUser Collaborative Media
range: string

timestamp
type: Property
comment: The timestamp associated with the collaborative media.
alternate name: timestamp
sub property of: timestamp
domain: Shadow IGUser Collaborative Media
range: dateTime

total comments count
type: Property
comment: The total number of comments associated with the collaborative media.
alternate name: total_comments_count
sub property of: total comments count
domain: Shadow IGUser Collaborative Media
range: int

total like count
type: Property
comment: The total number of likes associated with the collaborative media.
alternate name: total_like_count
sub property of: total like count
domain: Shadow IGUser Collaborative Media
range: int

total views count
type: Property
comment: The total number of views of the collaborative media.
alternate name: total_views_count
sub property of: total views count
domain: Shadow IGUser Collaborative Media
range: int

username
type: Property
comment: The username associated with the collaborative media.
alternate name: username
sub property of: username
domain: Shadow IGUser Collaborative Media
range: string

from
type: Property
comment: Represents the user associated with the Instagram comment.
alternate name: from
domain: IGComment
range: IGComment From User

hidden
type: Property
comment: Indicates whether the Instagram comment is hidden.
alternate name: hidden
sub property of: hidden
domain: IGComment
range: boolean

id
type: Property
comment: Represents the Instagram comment's identifier.
alternate name: id
sub property of: id
domain: IGComment
range: string

legacy instagram comment id
type: Property
comment: Represents the legacy Instagram comment identifier.
alternate name: legacy_instagram_comment_id
sub property of: legacy instagram comment id
domain: IGComment
range: string

like count
type: Property
comment: Represents the number of likes on the Instagram comment.
alternate name: like_count
sub property of: like count
domain: IGComment
range: int

media
type: Property
comment: Represents the Instagram media associated with the comment.
alternate name: media
sub property of: media
domain: IGComment
range: IGMedia

parent id
type: Property
comment: Represents the identifier of the parent comment.
alternate name: parent_id
sub property of: parent id
domain: IGComment
range: string

text
type: Property
comment: Represents the text of the Instagram comment.
alternate name: text
sub property of: text
domain: IGComment
range: string

timestamp
type: Property
comment: Represents when the Instagram comment was created.
alternate name: timestamp
sub property of: timestamp
domain: IGComment
range: dateTime

user
type: Property
comment: Represents the Instagram user associated with the comment.
alternate name: user
sub property of: user
domain: IGComment
range: IGUser

username
type: Property
comment: Represents the username associated with the Instagram comment.
alternate name: username
sub property of: username
domain: IGComment
range: string

id
type: Property
comment: Represents the identifier of the user associated with the comment.
alternate name: id
sub property of: id
domain: IGComment From User
range: string

self ig scoped id
type: Property
comment: Represents the user's Instagram-scoped identifier.
alternate name: self_ig_scoped_id
sub property of: self ig scoped id
domain: IGComment From User
range: string

username
type: Property
comment: Represents the username of the user associated with the comment.
alternate name: username
sub property of: username
domain: IGComment From User
range: string

alt text
type: Property
comment: Represents the alternative text for the Instagram media.
alternate name: alt_text
sub property of: alt text
domain: IGMedia
range: string

audio id
type: Property
comment: Represents the identifier of the audio associated with the Instagram media.
alternate name: audio_id
sub property of: audio id
domain: IGMedia
range: string

boost eligibility info
type: Property
comment: Represents boost-eligibility information for the Instagram media.
alternate name: boost_eligibility_info
domain: IGMedia
range: IGMedia Boost Eligibility Info

caption
type: Property
comment: Represents the caption of the Instagram media.
alternate name: caption
sub property of: caption
domain: IGMedia
range: string

comments count
type: Property
comment: Represents the number of comments on the Instagram media.
alternate name: comments_count
sub property of: comments count
domain: IGMedia
range: int

copyright check information
type: Property
comment: Represents copyright-check match information for the Instagram media.
alternate name: copyright_check_information
domain: IGMedia
range: IGVideo Copyright Check Matches Information

current live viewer count
type: Property
comment: Represents the current number of viewers of the live Instagram media.
alternate name: current_live_viewer_count
sub property of: current live viewer count
domain: IGMedia
range: int

has poll
type: Property
comment: Indicates whether the Instagram media has a poll.
alternate name: has_poll
sub property of: has poll
domain: IGMedia
range: boolean

has slider
type: Property
comment: Indicates whether the Instagram media has a slider.
alternate name: has_slider
sub property of: has slider
domain: IGMedia
range: boolean

id
type: Property
comment: Represents the Instagram media's identifier.
alternate name: id
sub property of: id
domain: IGMedia
range: string

ig id
type: Property
comment: Represents the Instagram identifier of the media.
alternate name: ig_id
domain: IGMedia
range: string

is ai generated
type: Property
comment: Indicates whether the Instagram media is AI-generated.
alternate name: is_ai_generated
sub property of: is ai generated
domain: IGMedia
range: boolean

is comment enabled
type: Property
comment: Indicates whether commenting is enabled for the Instagram media.
alternate name: is_comment_enabled
sub property of: is comment enabled
domain: IGMedia
range: boolean

is shared to feed
type: Property
comment: Indicates whether the Instagram media is shared to the feed.
alternate name: is_shared_to_feed
sub property of: is shared to feed
domain: IGMedia
range: boolean

legacy instagram media id
type: Property
comment: Represents the legacy Instagram media identifier.
alternate name: legacy_instagram_media_id
sub property of: legacy instagram media id
domain: IGMedia
range: string

like count
type: Property
comment: Represents the number of likes on the Instagram media.
alternate name: like_count
sub property of: like count
domain: IGMedia
range: int

media audio type
type: Property
comment: Represents the audio type of the Instagram media.
alternate name: media_audio_type
sub property of: media audio type
domain: IGMedia
range: string

media product type
type: Property
comment: Represents the product type of the Instagram media.
alternate name: media_product_type
sub property of: media product type
domain: IGMedia
range: string

media type
type: Property
comment: Represents the type of the Instagram media.
alternate name: media_type
sub property of: media type
domain: IGMedia
range: string

media url
type: Property
comment: Represents the URL of the Instagram media.
alternate name: media_url
sub property of: media url
domain: IGMedia
range: string

owner
type: Property
comment: Represents the Instagram user who owns the media.
alternate name: owner
domain: IGMedia
range: IGUser

permalink
type: Property
comment: Represents the permanent link to the Instagram media.
alternate name: permalink
sub property of: permalink
domain: IGMedia
range: string

reposts count
type: Property
comment: Represents the number of reposts of the Instagram media.
alternate name: reposts_count
sub property of: reposts count
domain: IGMedia
range: int

saved count
type: Property
comment: Represents the number of times the Instagram media was saved.
alternate name: saved_count
sub property of: saved count
domain: IGMedia
range: int

shares count
type: Property
comment: Represents the number of shares of the Instagram media.
alternate name: shares_count
sub property of: shares count
domain: IGMedia
range: int

shortcode
type: Property
comment: Represents the shortcode of the Instagram media.
alternate name: shortcode
sub property of: shortcode
domain: IGMedia
range: string

thumbnail url
type: Property
comment: Represents the URL of the Instagram media thumbnail.
alternate name: thumbnail_url
sub property of: thumbnail url
domain: IGMedia
range: string

timestamp
type: Property
comment: Represents when the Instagram media was created.
alternate name: timestamp
sub property of: timestamp
domain: IGMedia
range: dateTime

total comments count
type: Property
comment: Represents the total number of comments on the Instagram media.
alternate name: total_comments_count
sub property of: total comments count
domain: IGMedia
range: int

total like count
type: Property
comment: Represents the total number of likes associated with the media.
alternate name: total_like_count
sub property of: total like count
domain: IGMedia
range: int

total views count
type: Property
comment: Represents the total number of views associated with the media.
alternate name: total_views_count
sub property of: total views count
domain: IGMedia
range: int

username
type: Property
comment: Identifies the username associated with the media.
alternate name: username
sub property of: username
domain: IGMedia
range: string

video title
type: Property
comment: Represents the title of the video media.
alternate name: video_title
sub property of: video title
domain: IGMedia
range: string

view count
type: Property
comment: Represents the number of views associated with the media.
alternate name: view_count
sub property of: view count
domain: IGMedia
range: int

boost ineligible reason
type: Property
comment: Describes the reason the media is not eligible for boosting.
alternate name: boost_ineligible_reason
sub property of: boost ineligible reason
domain: IGMedia Boost Eligibility Info
range: string

eligible to boost
type: Property
comment: Indicates whether the media is eligible for boosting.
alternate name: eligible_to_boost
sub property of: eligible to boost
domain: IGMedia Boost Eligibility Info
range: boolean

copyright matches
type: Property
comment: Contains the copyright matches identified for the video.
alternate name: copyright_matches
sub property of: copyright matches
domain: IGVideo Copyright Check Matches Information
range: JSON

status
type: Property
comment: Represents the status of the video copyright check.
alternate name: status
domain: IGVideo Copyright Check Matches Information
range: IGVideo Copyright Check Status

matches found
type: Property
comment: Indicates whether copyright matches were found.
alternate name: matches_found
sub property of: matches found
domain: IGVideo Copyright Check Status
range: boolean

status
type: Property
comment: Represents the status of the video copyright check.
alternate name: status
domain: IGVideo Copyright Check Status
range: string

commerce merchant settings
type: Property
comment: Represents the commerce merchant settings associated with the shop.
alternate name: commerce_merchant_settings
sub property of: commerce merchant settings
domain: Shop
range: Commerce Merchant Settings

fb sales channel
type: Property
comment: Represents the shop’s Facebook sales channel information.
alternate name: fb_sales_channel
sub property of: fb sales channel
domain: Shop
range: JSON

id
type: Property
comment: Identifies the shop.
alternate name: id
sub property of: id
domain: Shop
range: string

ig sales channel
type: Property
comment: Represents the shop’s Instagram sales channel information.
alternate name: ig_sales_channel
sub property of: ig sales channel
domain: Shop
range: JSON

shop status
type: Property
comment: Represents the shop’s status.
alternate name: shop_status
sub property of: shop status
domain: Shop
range: string

workspace
type: Property
comment: Represents the workspace associated with the shop.
alternate name: workspace
sub property of: workspace
domain: Shop
range: JSON

checkout config
type: Property
comment: The checkout configuration for the merchant.
alternate name: checkout_config
sub property of: checkout config
domain: Commerce Merchant Settings
range: string

contact email
type: Property
comment: The merchant's contact email address.
alternate name: contact_email
sub property of: contact email
domain: Commerce Merchant Settings
range: string

display name
type: Property
comment: The display name of the merchant.
alternate name: display_name
sub property of: display name
domain: Commerce Merchant Settings
range: string

facebook channel
type: Property
comment: The Facebook channel configuration for the merchant.
alternate name: facebook_channel
sub property of: facebook channel
domain: Commerce Merchant Settings
range: JSON

id
type: Property
comment: The identifier of the merchant settings.
alternate name: id
sub property of: id
domain: Commerce Merchant Settings
range: string

instagram channel
type: Property
comment: The Instagram channel configuration for the merchant.
alternate name: instagram_channel
sub property of: instagram channel
domain: Commerce Merchant Settings
range: JSON

korea ftc listing
type: Property
comment: The merchant's Korea FTC listing.
alternate name: korea_ftc_listing
sub property of: korea ftc listing
domain: Commerce Merchant Settings
range: string

merchant page
type: Property
comment: The profile representing the merchant's page.
alternate name: merchant_page
sub property of: merchant page
domain: Commerce Merchant Settings
range: Profile

merchant status
type: Property
comment: The merchant's status.
alternate name: merchant_status
sub property of: merchant status
domain: Commerce Merchant Settings
range: string

offsite iab checkout enabled countries
type: Property
comment: The countries where offsite IAB checkout is enabled for the merchant.
alternate name: offsite_iab_checkout_enabled_countries
sub property of: offsite iab checkout enabled countries
domain: Commerce Merchant Settings
range: string

payment provider
type: Property
comment: The payment provider associated with the merchant.
alternate name: payment_provider
sub property of: payment provider
domain: Commerce Merchant Settings
range: string

privacy policy localized
type: Property
comment: The merchant's localized privacy policy.
alternate name: privacy_policy_localized
sub property of: privacy policy localized
domain: Commerce Merchant Settings
range: string

shops ads setup
type: Property
comment: The merchant's Shops ads setup.
alternate name: shops_ads_setup
sub property of: shops ads setup
domain: Commerce Merchant Settings
range: JSON

terms
type: Property
comment: The merchant's terms.
alternate name: terms
sub property of: terms
domain: Commerce Merchant Settings
range: string

can post
type: Property
comment: Indicates whether the profile can post.
alternate name: can_post
sub property of: can post
domain: Profile
range: boolean

id
type: Property
comment: The identifier of the profile.
alternate name: id
sub property of: id
domain: Profile
range: string

link
type: Property
comment: The link associated with the profile.
alternate name: link
sub property of: link
domain: Profile
range: string

name
type: Property
comment: The name of the profile.
alternate name: name
sub property of: name
domain: Profile
range: string

pic
type: Property
comment: The profile picture.
alternate name: pic
sub property of: pic
domain: Profile
range: string

pic crop
type: Property
comment: The cropped profile picture and its associated source information.
alternate name: pic_crop
sub property of: pic crop
domain: Profile
range: Profile Picture Source

pic large
type: Property
comment: The large version of the profile picture.
alternate name: pic_large
sub property of: pic large
domain: Profile
range: string

pic small
type: Property
comment: The small version of the profile picture.
alternate name: pic_small
sub property of: pic small
domain: Profile
range: string

pic square
type: Property
comment: The square version of the profile picture.
alternate name: pic_square
sub property of: pic square
domain: Profile
range: string

profile type
type: Property
comment: The type of profile, such as an application, event, group, page, or user.
alternate name: profile_type
sub property of: profile type
domain: Profile
range: string
code list: ProfileProfileType

username
type: Property
comment: The username of the profile.
alternate name: username
sub property of: username
domain: Profile
range: string

bottom
type: Property
comment: The bottom boundary position of the profile picture source.
alternate name: bottom
sub property of: bottom
domain: Profile Picture Source
range: unsignedInt

cache key
type: Property
comment: The cache key associated with the profile picture source.
alternate name: cache_key
sub property of: cache key
domain: Profile Picture Source
range: string

height
type: Property
comment: The height of the profile picture source.
alternate name: height
sub property of: height
domain: Profile Picture Source
range: unsignedInt

is silhouette
type: Property
comment: Indicates whether the profile picture source is a silhouette.
alternate name: is_silhouette
sub property of: is silhouette
domain: Profile Picture Source
range: boolean

left
type: Property
comment: The left boundary position of the profile picture source.
alternate name: left
sub property of: left
domain: Profile Picture Source
range: unsignedInt

right
type: Property
comment: The right boundary position of the profile picture source.
alternate name: right
sub property of: right
domain: Profile Picture Source
range: unsignedInt

top
type: Property
comment: The top boundary position of the profile picture source.
alternate name: top
sub property of: top
domain: Profile Picture Source
range: unsignedInt

url
type: Property
comment: The URL of the profile picture source.
alternate name: url
sub property of: url
domain: Profile Picture Source
range: string

width
type: Property
comment: The width of the profile picture source.
alternate name: width
sub property of: width
domain: Profile Picture Source
range: unsignedInt

city
type: Property
comment: Represents the city in the mailing address.
alternate name: city
sub property of: city
domain: Mailing Address
range: string

city page
type: Property
comment: Contains the Page associated with the city in the mailing address.
alternate name: city_page
sub property of: city page
domain: Mailing Address
range: Page

country
type: Property
comment: Represents the country in the mailing address.
alternate name: country
sub property of: country
domain: Mailing Address
range: string

id
type: Property
comment: Identifies the mailing address.
alternate name: id
sub property of: id
domain: Mailing Address
range: string

postal code
type: Property
comment: Represents the postal code in the mailing address.
alternate name: postal_code
sub property of: postal code
domain: Mailing Address
range: string

region
type: Property
comment: Represents the region in the mailing address.
alternate name: region
sub property of: region
domain: Mailing Address
range: string

street1
type: Property
comment: Represents the primary street information in the mailing address.
alternate name: street1
sub property of: street1
domain: Mailing Address
range: string

street2
type: Property
comment: Represents additional street information in the mailing address.
alternate name: street2
sub property of: street2
domain: Mailing Address
range: string

l7attribution page view
type: Property
comment: Represents the seven-day attribution page-view value in copyright insights.
alternate name: l7_attribution_page_view
sub property of: l7attribution page view
domain: Copyright Attribution Insights
range: int

l7attribution page view delta
type: Property
comment: Represents the change in the seven-day attribution page-view value in copyright insights.
alternate name: l7_attribution_page_view_delta
sub property of: l7attribution page view delta
domain: Copyright Attribution Insights
range: double

l7attribution video view
type: Property
comment: Represents the seven-day attribution video-view value in copyright insights.
alternate name: l7_attribution_video_view
sub property of: l7attribution video view
domain: Copyright Attribution Insights
range: int

l7attribution video view delta
type: Property
comment: Represents the change in the seven-day attribution video-view value in copyright insights.
alternate name: l7_attribution_video_view_delta
sub property of: l7attribution video view delta
domain: Copyright Attribution Insights
range: double

metrics ending date
type: Property
comment: Represents the date on which the copyright insight metrics end.
alternate name: metrics_ending_date
sub property of: metrics ending date
domain: Copyright Attribution Insights
range: string

count
type: Property
comment: Represents the engagement count.
alternate name: count
sub property of: count
domain: Engagement
range: unsignedInt

count string
type: Property
comment: Represents the engagement count as a string.
alternate name: count_string
sub property of: count string
domain: Engagement
range: string

count string with like
type: Property
comment: Represents the engagement count as a string including likes.
alternate name: count_string_with_like
sub property of: count string with like
domain: Engagement
range: string

count string without like
type: Property
comment: Represents the engagement count as a string excluding likes.
alternate name: count_string_without_like
sub property of: count string without like
domain: Engagement
range: string

social sentence
type: Property
comment: Represents the social sentence for the engagement.
alternate name: social_sentence
sub property of: social sentence
domain: Engagement
range: string

social sentence with like
type: Property
comment: Represents the social sentence for the engagement including likes.
alternate name: social_sentence_with_like
sub property of: social sentence with like
domain: Engagement
range: string

social sentence without like
type: Property
comment: Represents the social sentence for the engagement excluding likes.
alternate name: social_sentence_without_like
sub property of: social sentence without like
domain: Engagement
range: string

ad breaks
type: Property
comment: Represents the ad breaks associated with the video.
alternate name: ad_breaks
sub property of: ad breaks
domain: Ad Video
range: int

admin creator
type: Property
comment: Identifies the administrator who created the video.
alternate name: admin_creator
sub property of: admin creator
domain: Ad Video
range: User

audio isrc
type: Property
comment: Identifies the audio recording associated with the video.
alternate name: audio_isrc
sub property of: audio isrc
domain: Ad Video
range: Audio Isrc

backdated time
type: Property
comment: Indicates the backdated time associated with the video.
alternate name: backdated_time
sub property of: backdated time
domain: Ad Video
range: dateTime

backdated time granularity
type: Property
comment: Represents the granularity of the video's backdated time.
alternate name: backdated_time_granularity
sub property of: backdated time granularity
domain: Ad Video
range: string

boost eligibility info
type: Property
comment: Provides information about the video's eligibility for boosting.
alternate name: boost_eligibility_info
domain: Ad Video
range: JSON

content category
type: Property
comment: Represents the category of the video content.
alternate name: content_category
sub property of: content category
domain: Ad Video
range: string

content tags
type: Property
comment: Contains tags associated with the video content.
alternate name: content_tags
sub property of: content tags
domain: Ad Video
range: string

copyright
type: Property
comment: Represents the copyright information for the video.
alternate name: copyright
sub property of: copyright
domain: Ad Video
range: Video Copyright

copyright check information
type: Property
comment: Provides information about the video's copyright check.
alternate name: copyright_check_information
domain: Ad Video
range: JSON

copyright monitoring status
type: Property
comment: Represents the copyright monitoring status of the video.
alternate name: copyright_monitoring_status
sub property of: copyright monitoring status
domain: Ad Video
range: string

created time
type: Property
comment: Indicates when the video was created.
alternate name: created_time
domain: Ad Video
range: dateTime

custom labels
type: Property
comment: Contains custom labels associated with the video.
alternate name: custom_labels
sub property of: custom labels
domain: Ad Video
range: string

description
type: Property
comment: Contains the description of the video.
alternate name: description
sub property of: description
domain: Ad Video
range: string

embed html
type: Property
comment: Represents HTML associated with embedding the ad video.
alternate name: embed_html
sub property of: embed html
domain: Ad Video
range: JSON

embeddable
type: Property
comment: Indicates whether the ad video is embeddable.
alternate name: embeddable
sub property of: embeddable
domain: Ad Video
range: boolean

event
type: Property
comment: Represents an event associated with the ad video.
alternate name: event
domain: Ad Video
range: Event

expiration
type: Property
comment: Represents expiration information for the ad video.
alternate name: expiration
domain: Ad Video
range: JSON

format
type: Property
comment: Represents a list of format information for the ad video.
alternate name: format
domain: Ad Video
range: JSON

from
type: Property
comment: Represents the entity associated with the ad video.
alternate name: from
domain: Ad Video
range: JSON

icon
type: Property
comment: Represents an icon associated with the ad video.
alternate name: icon
sub property of: icon
domain: Ad Video
range: string

id
type: Property
comment: Identifies the ad video.
alternate name: id
sub property of: id
domain: Ad Video
range: string

is crosspost video
type: Property
comment: Indicates whether the ad video is a cross-posted video.
alternate name: is_crosspost_video
sub property of: is crosspost video
domain: Ad Video
range: boolean

is crossposting eligible
type: Property
comment: Indicates whether the ad video is eligible for cross-posting.
alternate name: is_crossposting_eligible
sub property of: is crossposting eligible
domain: Ad Video
range: boolean

is episode
type: Property
comment: Indicates whether the ad video is an episode.
alternate name: is_episode
sub property of: is episode
domain: Ad Video
range: boolean

is instagram eligible
type: Property
comment: Indicates whether the ad video is eligible for Instagram.
alternate name: is_instagram_eligible
sub property of: is instagram eligible
domain: Ad Video
range: boolean

is reference only
type: Property
comment: Indicates whether the ad video is for reference only.
alternate name: is_reference_only
sub property of: is reference only
domain: Ad Video
range: boolean

length
type: Property
comment: Represents the length of the ad video.
alternate name: length
domain: Ad Video
range: double

live audience count
type: Property
comment: Represents the audience count for the live ad video.
alternate name: live_audience_count
sub property of: live audience count
domain: Ad Video
range: unsignedInt

live status
type: Property
comment: Represents the live status of the ad video.
alternate name: live_status
sub property of: live status
domain: Ad Video
range: string

music video copyright
type: Property
comment: Represents music video copyright information associated with the ad video.
alternate name: music_video_copyright
sub property of: music video copyright
domain: Ad Video
range: Music Video Copyright

permalink url
type: Property
comment: Represents the permanent URL for the ad video.
alternate name: permalink_url
sub property of: permalink url
domain: Ad Video
range: string

picture
type: Property
comment: Represents a picture associated with the ad video.
alternate name: picture
sub property of: picture
domain: Ad Video
range: string

place
type: Property
comment: Represents a place associated with the ad video.
alternate name: place
sub property of: place
domain: Ad Video
range: Place

post id
type: Property
comment: Identifies the post associated with the ad video.
alternate name: post_id
sub property of: post id
domain: Ad Video
range: string

post views
type: Property
comment: Represents the number of views of the associated post.
alternate name: post_views
sub property of: post views
domain: Ad Video
range: unsignedInt

premiere living room status
type: Property
comment: Represents the living room status of the video premiere.
alternate name: premiere_living_room_status
sub property of: premiere living room status
domain: Ad Video
range: string

privacy
type: Property
comment: Represents the privacy settings of the ad video.
alternate name: privacy
domain: Ad Video
range: Privacy

published
type: Property
comment: Indicates whether the ad video is published.
alternate name: published
sub property of: published
domain: Ad Video
range: boolean

replace audio status
type: Property
comment: Represents the status of audio replacement for the ad video.
alternate name: replace_audio_status
sub property of: replace audio status
domain: Ad Video
range: string

scheduled publish time
type: Property
comment: Represents the scheduled publication time of the ad video.
alternate name: scheduled_publish_time
domain: Ad Video
range: dateTime

selected audio spec
type: Property
comment: Represents the selected audio specification for the ad video.
alternate name: selected_audio_spec
sub property of: selected audio spec
domain: Ad Video
range: JSON

source
type: Property
comment: Represents the source of the ad video.
alternate name: source
sub property of: source
domain: Ad Video
range: string

spherical
type: Property
comment: Indicates whether the ad video is spherical.
alternate name: spherical
sub property of: spherical
domain: Ad Video
range: boolean

status
type: Property
comment: Represents the status of the ad video.
alternate name: status
domain: Ad Video
range: Video Status

title
type: Property
comment: Represents the title of the ad video.
alternate name: title
sub property of: title
domain: Ad Video
range: string

universal video id
type: Property
comment: Identifies the ad video across universal video records.
alternate name: universal_video_id
sub property of: universal video id
domain: Ad Video
range: string

updated time
type: Property
comment: Represents when the ad video was last updated.
alternate name: updated_time
domain: Ad Video
range: dateTime

views
type: Property
comment: Represents the number of views of the ad video.
alternate name: views
sub property of: views
domain: Ad Video
range: unsignedInt

all kg featured artists
type: Property
comment: Represents all featured artists in the knowledge graph information for the audio ISRC.
alternate name: all_kg_featured_artists
sub property of: all kg featured artists
domain: Audio Isrc
range: string

all kg main artists
type: Property
comment: Represents all main artists in the knowledge graph information for the audio ISRC.
alternate name: all_kg_main_artists
sub property of: all kg main artists
domain: Audio Isrc
range: string

artist profile picture url
type: Property
comment: Represents the profile picture URL of the artist associated with the audio ISRC.
alternate name: artist_profile_picture_url
sub property of: artist profile picture url
domain: Audio Isrc
range: string

canonical audio asset
type: Property
comment: Represents the canonical audio asset associated with the audio ISRC.
alternate name: canonical_audio_asset
sub property of: canonical audio asset
domain: Audio Isrc
range: Audio Asset

id
type: Property
comment: Identifies the audio ISRC record.
alternate name: id
sub property of: id
domain: Audio Isrc
range: string

isrc
type: Property
comment: Represents the International Standard Recording Code associated with the audio record.
alternate name: isrc
sub property of: isrc
domain: Audio Isrc
range: string

publishing rights data
type: Property
comment: Represents publishing rights information for the audio ISRC.
alternate name: publishing_rights_data
sub property of: publishing rights data
domain: Audio Isrc
range: JSON

top searchable artist id
type: Property
comment: Identifies the top searchable artist associated with the audio ISRC.
alternate name: top_searchable_artist_id
sub property of: top searchable artist id
domain: Audio Isrc
range: string

top searchable artist name
type: Property
comment: Represents the name of the top searchable artist associated with the audio ISRC.
alternate name: top_searchable_artist_name
sub property of: top searchable artist name
domain: Audio Isrc
range: string

top searchable artist profile pic url
type: Property
comment: Represents the profile picture URL of the top searchable artist associated with the audio ISRC.
alternate name: top_searchable_artist_profile_pic_url
sub property of: top searchable artist profile pic url
domain: Audio Isrc
range: string

all ddex featured artists
type: Property
comment: Represents all featured artists in the DDEX information for the audio asset.
alternate name: all_ddex_featured_artists
sub property of: all ddex featured artists
domain: Audio Asset
range: string

all ddex main artists
type: Property
comment: Represents all main artists in the DDEX information for the audio asset.
alternate name: all_ddex_main_artists
sub property of: all ddex main artists
domain: Audio Asset
range: string

audio cluster id
type: Property
comment: Identifies the audio cluster associated with the audio asset.
alternate name: audio_cluster_id
sub property of: audio cluster id
domain: Audio Asset
range: string

cover image source
type: Property
comment: Represents the source of the audio asset's cover image.
alternate name: cover_image_source
sub property of: cover image source
domain: Audio Asset
range: string

description
type: Property
comment: Represents the description of the audio asset.
alternate name: description
sub property of: description
domain: Audio Asset
range: string

display artist
type: Property
comment: Represents the artist displayed for the audio asset.
alternate name: display_artist
sub property of: display artist
domain: Audio Asset
range: string

download hd url
type: Property
comment: Represents the high-definition download URL for the audio asset.
alternate name: download_hd_url
sub property of: download hd url
domain: Audio Asset
range: string

download sd url
type: Property
comment: Represents the standard-definition download URL for the audio asset.
alternate name: download_sd_url
sub property of: download sd url
domain: Audio Asset
range: string

duration in ms
type: Property
comment: Represents the duration of the audio asset in milliseconds.
alternate name: duration_in_ms
sub property of: duration in ms
domain: Audio Asset
range: int

freeform genre
type: Property
comment: Represents the free-form genre of the audio asset.
alternate name: freeform_genre
sub property of: freeform genre
domain: Audio Asset
range: string

grid
type: Property
comment: Represents the grid associated with the audio asset.
alternate name: grid
sub property of: grid
domain: Audio Asset
range: string

id
type: Property
comment: Identifies the audio asset.
alternate name: id
sub property of: id
domain: Audio Asset
range: string

is test
type: Property
comment: Indicates whether the audio asset is a test asset.
alternate name: is_test
sub property of: is test
domain: Audio Asset
range: boolean

original release date
type: Property
comment: Represents the original release date of the audio asset.
alternate name: original_release_date
sub property of: original release date
domain: Audio Asset
range: dateTime

owner
type: Property
comment: Represents the page that owns the audio asset.
alternate name: owner
domain: Audio Asset
range: Page

parental warning type
type: Property
comment: Represents the parental warning type for the audio asset.
alternate name: parental_warning_type
sub property of: parental warning type
domain: Audio Asset
range: string

subtitle
type: Property
comment: Represents the subtitle of the audio asset.
alternate name: subtitle
sub property of: subtitle
domain: Audio Asset
range: string

title
type: Property
comment: Represents the title of the audio asset.
alternate name: title
sub property of: title
domain: Audio Asset
range: string

title with featured artists
type: Property
comment: Represents the audio asset title together with its featured artists.
alternate name: title_with_featured_artists
sub property of: title with featured artists
domain: Audio Asset
range: string

upc
type: Property
comment: Represents the universal product code of the audio asset.
alternate name: upc
sub property of: upc
domain: Audio Asset
range: string

content category
type: Property
comment: Represents the content category of the copyrighted video content.
alternate name: content_category
sub property of: content category
domain: Video Copyright
range: string

content protect protection disabled reason
type: Property
comment: Represents the reason content protection was disabled for the video copyright.
alternate name: content_protect_protection_disabled_reason
sub property of: content protect protection disabled reason
domain: Video Copyright
range: string

copyright content id
type: Property
comment: Represents the identifier of the copyrighted content.
alternate name: copyright_content_id
sub property of: copyright content id
domain: Video Copyright
range: string

creator
type: Property
comment: Represents the user who created the video copyright record.
alternate name: creator
sub property of: creator
domain: Video Copyright
range: User

disable protection by content protect status
type: Property
comment: Indicates whether protection is disabled according to the content-protection status.
alternate name: disable_protection_by_content_protect_status
sub property of: disable protection by content protect status
domain: Video Copyright
range: boolean

excluded ownership segments
type: Property
comment: Represents the ownership segments excluded from the video copyright.
alternate name: excluded_ownership_segments
sub property of: excluded ownership segments
domain: Video Copyright
range: Video Copyright Segment

id
type: Property
comment: Represents the video copyright identifier.
alternate name: id
sub property of: id
domain: Video Copyright
range: string

in conflict
type: Property
comment: Indicates whether the video copyright is in conflict.
alternate name: in_conflict
sub property of: in conflict
domain: Video Copyright
range: boolean

monitoring status
type: Property
comment: Represents the monitoring status of the video copyright.
alternate name: monitoring_status
sub property of: monitoring status
domain: Video Copyright
range: string

monitoring type
type: Property
comment: Represents the monitoring type of the video copyright.
alternate name: monitoring_type
sub property of: monitoring type
domain: Video Copyright
range: string

ownership countries
type: Property
comment: Represents the geographic ownership settings for the video copyright.
alternate name: ownership_countries
domain: Video Copyright
range: Video Copyright Geo Gate

reference file
type: Property
comment: Represents the reference file associated with the video copyright.
alternate name: reference_file
sub property of: reference file
domain: Video Copyright
range: Copyright Reference Container

reference file disabled
type: Property
comment: Indicates whether the reference file is disabled.
alternate name: reference_file_disabled
sub property of: reference file disabled
domain: Video Copyright
range: boolean

reference file disabled by ops
type: Property
comment: Indicates whether the reference file was disabled by operations.
alternate name: reference_file_disabled_by_ops
sub property of: reference file disabled by ops
domain: Video Copyright
range: boolean

reference owner id
type: Property
comment: Represents the identifier of the reference owner.
alternate name: reference_owner_id
sub property of: reference owner id
domain: Video Copyright
range: string

rule ids
type: Property
comment: Represents the copyright rules associated with the video copyright.
alternate name: rule_ids
sub property of: rule ids
domain: Video Copyright
range: Video Copyright Rule

tags
type: Property
comment: Represents the tags associated with the video copyright.
alternate name: tags
sub property of: tags
domain: Video Copyright
range: string

whitelisted ids
type: Property
comment: Represents the identifiers whitelisted for the video copyright.
alternate name: whitelisted_ids
sub property of: whitelisted ids
domain: Video Copyright
range: string

duration in sec
type: Property
comment: Specifies the duration of the video copyright segment in seconds.
alternate name: duration_in_sec
sub property of: duration in sec
domain: Video Copyright Segment
range: double

media type
type: Property
comment: Identifies the media type of the video copyright segment.
alternate name: media_type
sub property of: media type
domain: Video Copyright Segment
range: string

start time in sec
type: Property
comment: Specifies the segment's start time in seconds.
alternate name: start_time_in_sec
sub property of: start time in sec
domain: Video Copyright Segment
range: double

excluded countries
type: Property
comment: Represents the countries excluded by the copyright geographic gate.
alternate name: excluded_countries
sub property of: excluded countries
domain: Video Copyright Geo Gate
range: string

included countries
type: Property
comment: Represents the countries included by the copyright geographic gate.
alternate name: included_countries
sub property of: included countries
domain: Video Copyright Geo Gate
range: string

content type
type: Property
comment: Identifies the content type of the copyright reference.
alternate name: content_type
sub property of: content type
domain: Copyright Reference Container
range: string

copyright creation time
type: Property
comment: Represents when the copyright reference was created.
alternate name: copyright_creation_time
sub property of: copyright creation time
domain: Copyright Reference Container
range: dateTime

download hd url
type: Property
comment: Provides the URL associated with downloading the high-definition copyright reference.
alternate name: download_hd_url
sub property of: download hd url
domain: Copyright Reference Container
range: string

duration in sec
type: Property
comment: Represents the duration of the copyright reference in seconds.
alternate name: duration_in_sec
sub property of: duration in sec
domain: Copyright Reference Container
range: double

id
type: Property
comment: Identifies the copyright reference.
alternate name: id
sub property of: id
domain: Copyright Reference Container
range: string

iswc
type: Property
comment: Represents the ISWC associated with the copyright reference.
alternate name: iswc
sub property of: iswc
domain: Copyright Reference Container
range: string

metadata
type: Property
comment: Contains metadata associated with the copyright reference.
alternate name: metadata
sub property of: metadata
domain: Copyright Reference Container
range: JSON

playable video uri
type: Property
comment: Provides the URI for playing the video associated with the copyright reference.
alternate name: playable_video_uri
sub property of: playable video uri
domain: Copyright Reference Container
range: string

published time
type: Property
comment: Represents when the copyright reference was published.
alternate name: published_time
sub property of: published time
domain: Copyright Reference Container
range: dateTime

thumbnail url
type: Property
comment: Provides the URL for the thumbnail associated with the copyright reference.
alternate name: thumbnail_url
sub property of: thumbnail url
domain: Copyright Reference Container
range: string

title
type: Property
comment: Represents the title of the copyright reference.
alternate name: title
sub property of: title
domain: Copyright Reference Container
range: string

universal content id
type: Property
comment: Identifies the universal content associated with the copyright reference.
alternate name: universal_content_id
sub property of: universal content id
domain: Copyright Reference Container
range: string

writer names
type: Property
comment: Lists the names of writers associated with the copyright reference.
alternate name: writer_names
sub property of: writer names
domain: Copyright Reference Container
range: string

condition groups
type: Property
comment: Represents the condition groups in the copyright rule.
alternate name: condition_groups
sub property of: condition groups
domain: Video Copyright Rule
range: Video Copyright Condition Group

copyrights
type: Property
comment: Represents the copyrights associated with the copyright rule.
alternate name: copyrights
sub property of: copyrights
domain: Video Copyright Rule
range: string

created date
type: Property
comment: Represents the date when the copyright rule was created.
alternate name: created_date
sub property of: created date
domain: Video Copyright Rule
range: dateTime

creator
type: Property
comment: Represents the user who created the copyright rule.
alternate name: creator
sub property of: creator
domain: Video Copyright Rule
range: User

id
type: Property
comment: Represents the copyright rule identifier.
alternate name: id
sub property of: id
domain: Video Copyright Rule
range: string

is in migration
type: Property
comment: Indicates whether the copyright rule is in migration.
alternate name: is_in_migration
sub property of: is in migration
domain: Video Copyright Rule
range: boolean

name
type: Property
comment: Identifies the video copyright rule by name.
alternate name: name
sub property of: name
domain: Video Copyright Rule
range: string

validity status
type: Property
comment: Indicates the validity status of the video copyright rule.
alternate name: validity_status
sub property of: validity status
domain: Video Copyright Rule
range: string

action
type: Property
comment: Represents the action associated with the copyright condition group.
alternate name: action
sub property of: action
domain: Video Copyright Condition Group
range: string

conditions
type: Property
comment: Represents the conditions in the copyright condition group.
alternate name: conditions
sub property of: conditions
domain: Video Copyright Condition Group
range: JSON

validity status
type: Property
comment: Represents the validity status of the copyright condition group.
alternate name: validity_status
sub property of: validity status
domain: Video Copyright Condition Group
range: string

attending count
type: Property
comment: Represents the number of people attending the event.
alternate name: attending_count
sub property of: attending count
domain: Event
range: int

can guests invite
type: Property
comment: Indicates whether guests can invite people to the event.
alternate name: can_guests_invite
sub property of: can guests invite
domain: Event
range: boolean

category
type: Property
comment: Represents the category assigned to the event.
alternate name: category
sub property of: category
domain: Event
range: string
code list: EventCategory

cover
type: Property
comment: Provides the cover photo associated with the event.
alternate name: cover
domain: Event
range: Cover Photo

created time
type: Property
comment: Represents when the event was created.
alternate name: created_time
domain: Event
range: dateTime

declined count
type: Property
comment: Represents the number of people who declined the event.
alternate name: declined_count
sub property of: declined count
domain: Event
range: int

description
type: Property
comment: Represents the description of the event.
alternate name: description
sub property of: description
domain: Event
range: string

discount code enabled
type: Property
comment: Indicates whether discount codes are enabled for the event.
alternate name: discount_code_enabled
sub property of: discount code enabled
domain: Event
range: boolean

end time
type: Property
comment: Represents when the event ends.
alternate name: end_time
domain: Event
range: string

event times
type: Property
comment: Contains the event's child event times.
alternate name: event_times
sub property of: event times
domain: Event
range: Child Event

guest list enabled
type: Property
comment: Indicates whether the event's guest list is enabled.
alternate name: guest_list_enabled
sub property of: guest list enabled
domain: Event
range: boolean

id
type: Property
comment: Identifies the event.
alternate name: id
sub property of: id
domain: Event
range: string

interested count
type: Property
comment: Represents the number of people interested in the event.
alternate name: interested_count
sub property of: interested count
domain: Event
range: int

is canceled
type: Property
comment: Indicates whether the event is canceled.
alternate name: is_canceled
sub property of: is canceled
domain: Event
range: boolean

is draft
type: Property
comment: Indicates whether the event is a draft.
alternate name: is_draft
sub property of: is draft
domain: Event
range: boolean

is online
type: Property
comment: Indicates whether the event is online.
alternate name: is_online
sub property of: is online
domain: Event
range: boolean

is page owned
type: Property
comment: Indicates whether the event is owned by a page.
alternate name: is_page_owned
sub property of: is page owned
domain: Event
range: boolean

maybe count
type: Property
comment: Represents the number of people marked as maybe for the event.
alternate name: maybe_count
sub property of: maybe count
domain: Event
range: int

name
type: Property
comment: Represents the event's name.
alternate name: name
sub property of: name
domain: Event
range: string

noreply count
type: Property
comment: Represents the number of people who have not replied to the event.
alternate name: noreply_count
sub property of: noreply count
domain: Event
range: int

online event format
type: Property
comment: Represents the event's online format, including options such as Facebook Live, Horizon, Messenger Room, a third-party format, or no online format.
alternate name: online_event_format
sub property of: online event format
domain: Event
range: string
code list: EventOnlineEventFormat

online event third party url
type: Property
comment: Provides the URL for the event's third-party online format.
alternate name: online_event_third_party_url
sub property of: online event third party url
domain: Event
range: string

owner
type: Property
comment: Identifies the object that owns the event.
alternate name: owner
domain: Event
range: JSON

parent group
type: Property
comment: Identifies the group associated with the event.
alternate name: parent_group
sub property of: parent group
domain: Event
range: Group

place
type: Property
comment: Represents the place associated with the event.
alternate name: place
sub property of: place
domain: Event
range: Place

registration setting
type: Property
comment: Contains the event's registration settings.
alternate name: registration_setting
sub property of: registration setting
domain: Event
range: Event Registration Setting

scheduled publish time
type: Property
comment: Represents the scheduled time for publishing the event.
alternate name: scheduled_publish_time
domain: Event
range: string

start time
type: Property
comment: Represents when the event starts.
alternate name: start_time
domain: Event
range: string

ticket setting
type: Property
comment: Contains the event's ticket settings.
alternate name: ticket_setting
sub property of: ticket setting
domain: Event
range: Event Ticket Setting

ticket uri
type: Property
comment: Provides the event's ticket URL.
alternate name: ticket_uri
sub property of: ticket uri
domain: Event
range: string

ticket uri start sales time
type: Property
comment: Represents when ticket sales begin at the event's ticket URL.
alternate name: ticket_uri_start_sales_time
sub property of: ticket uri start sales time
domain: Event
range: string

ticketing privacy uri
type: Property
comment: Provides the URL for the event's ticketing privacy information.
alternate name: ticketing_privacy_uri
sub property of: ticketing privacy uri
domain: Event
range: string

ticketing terms uri
type: Property
comment: Provides the URL for the event's ticketing terms.
alternate name: ticketing_terms_uri
sub property of: ticketing terms uri
domain: Event
range: string

timezone
type: Property
comment: Represents the event's time zone.
alternate name: timezone
domain: Event
range: string

type
type: Property
comment: Represents the event's type, such as community, friends, group, private, public, or work-related.
alternate name: type
domain: Event
range: string
code list: EventType

updated time
type: Property
comment: Represents when the event was last updated.
alternate name: updated_time
domain: Event
range: dateTime

end time
type: Property
comment: The end time of the child event.
alternate name: end_time
domain: Child Event
range: string

id
type: Property
comment: The identifier of the child event.
alternate name: id
sub property of: id
domain: Child Event
range: string

start time
type: Property
comment: The start time of the child event.
alternate name: start_time
domain: Child Event
range: string

ticket uri
type: Property
comment: The URI for tickets to the child event.
alternate name: ticket_uri
sub property of: ticket uri
domain: Child Event
range: string

id
type: Property
comment: Represents the identifier of the place.
alternate name: id
sub property of: id
domain: Place
range: string

location
type: Property
comment: Represents the location of the place.
alternate name: location
domain: Place
range: Location

name
type: Property
comment: Represents the name of the place.
alternate name: name
sub property of: name
domain: Place
range: string

overall rating
type: Property
comment: Represents the place's overall rating.
alternate name: overall_rating
sub property of: overall rating
domain: Place
range: double

id
type: Property
comment: Identifies the event registration setting.
alternate name: id
sub property of: id
domain: Event Registration Setting
range: string

questions
type: Property
comment: Represents the questions associated with event registration.
alternate name: questions
sub property of: questions
domain: Event Registration Setting
range: string

target type
type: Property
comment: Represents the target type for the registration setting.
alternate name: target_type
sub property of: target type
domain: Event Registration Setting
range: string

ticket tier ids
type: Property
comment: Identifies the ticket tiers associated with the registration setting.
alternate name: ticket_tier_ids
sub property of: ticket tier ids
domain: Event Registration Setting
range: string

id
type: Property
comment: Identifies the event ticket setting.
alternate name: id
sub property of: id
domain: Event Ticket Setting
range: string

ticket delivery type
type: Property
comment: Represents how tickets are delivered.
alternate name: ticket_delivery_type
sub property of: ticket delivery type
domain: Event Ticket Setting
range: string

creation time
type: Property
comment: Represents when the music video copyright record was created.
alternate name: creation_time
sub property of: creation time
domain: Music Video Copyright
range: dateTime

displayed matches count
type: Property
comment: Represents the number of copyright matches displayed for the music video.
alternate name: displayed_matches_count
sub property of: displayed matches count
domain: Music Video Copyright
range: int

id
type: Property
comment: Identifies the music video copyright record.
alternate name: id
sub property of: id
domain: Music Video Copyright
range: string

in conflict
type: Property
comment: Indicates whether the music video copyright record is in conflict.
alternate name: in_conflict
sub property of: in conflict
domain: Music Video Copyright
range: boolean

isrc
type: Property
comment: Represents the ISRC associated with the music video copyright record.
alternate name: isrc
sub property of: isrc
domain: Music Video Copyright
range: string

match rule
type: Property
comment: Contains the video copyright rule associated with the music video copyright record.
alternate name: match_rule
sub property of: match rule
domain: Music Video Copyright
range: Video Copyright Rule

ownership countries
type: Property
comment: Contains the countries associated with ownership of the music video copyright.
alternate name: ownership_countries
domain: Music Video Copyright
range: string

reference file status
type: Property
comment: Represents the status of the copyright reference file.
alternate name: reference_file_status
sub property of: reference file status
domain: Music Video Copyright
range: string

ridge monitoring status
type: Property
comment: Represents the ridge monitoring status of the music video copyright record.
alternate name: ridge_monitoring_status
sub property of: ridge monitoring status
domain: Music Video Copyright
range: string

tags
type: Property
comment: Contains tags associated with the music video copyright record.
alternate name: tags
sub property of: tags
domain: Music Video Copyright
range: string

update time
type: Property
comment: Represents when the music video copyright record was updated.
alternate name: update_time
sub property of: update time
domain: Music Video Copyright
range: dateTime

video asset
type: Property
comment: Contains the video asset associated with the music video copyright record.
alternate name: video_asset
sub property of: video asset
domain: Music Video Copyright
range: Copyright Reference Container

whitelisted fb users
type: Property
comment: Contains Facebook users associated with the whitelist for the music video copyright record.
alternate name: whitelisted_fb_users
sub property of: whitelisted fb users
domain: Music Video Copyright
range: JSON

whitelisted ig users
type: Property
comment: Contains Instagram users associated with the whitelist for the music video copyright record.
alternate name: whitelisted_ig_users
sub property of: whitelisted ig users
domain: Music Video Copyright
range: string

allow
type: Property
comment: Represents what the Privacy model allows.
alternate name: allow
sub property of: allow
domain: Privacy
range: string

deny
type: Property
comment: Represents what the Privacy model denies.
alternate name: deny
sub property of: deny
domain: Privacy
range: string

description
type: Property
comment: A description of the privacy setting.
alternate name: description
sub property of: description
domain: Privacy
range: string

friends
type: Property
comment: The privacy setting related to friends.
alternate name: friends
sub property of: friends
domain: Privacy
range: string

networks
type: Property
comment: The privacy setting related to networks.
alternate name: networks
sub property of: networks
domain: Privacy
range: string

value
type: Property
comment: The value of the privacy setting.
alternate name: value
domain: Privacy
range: string

copyright check status
type: Property
comment: Indicates the status of the video's copyright check.
alternate name: copyright_check_status
sub property of: copyright check status
domain: Video Status
range: Video Copyright Check Status

processing phase
type: Property
comment: Provides the video's processing-phase status information.
alternate name: processing_phase
sub property of: processing phase
domain: Video Status
range: Video Status Processing Phase

processing progress
type: Property
comment: Indicates the video's processing progress.
alternate name: processing_progress
sub property of: processing progress
domain: Video Status
range: unsignedInt

publishing phase
type: Property
comment: Provides the video's publishing-phase status information.
alternate name: publishing_phase
sub property of: publishing phase
domain: Video Status
range: Video Status Publishing Phase

uploading phase
type: Property
comment: Provides the video's uploading-phase status information.
alternate name: uploading_phase
sub property of: uploading phase
domain: Video Status
range: Video Status Uploading Phase

video status
type: Property
comment: Indicates the video's status.
alternate name: video_status
sub property of: video status
domain: Video Status
range: string

matches found
type: Property
comment: Indicates whether matches were found during the copyright check.
alternate name: matches_found
sub property of: matches found
domain: Video Copyright Check Status
range: boolean

status
type: Property
comment: Represents the status of the copyright check.
alternate name: status
domain: Video Copyright Check Status
range: string

errors
type: Property
comment: Lists errors associated with the video's processing phase.
alternate name: errors
sub property of: errors
domain: Video Status Processing Phase
range: Video Status Error

status
type: Property
comment: Indicates the status of the video's processing phase.
alternate name: status
domain: Video Status Processing Phase
range: string

code
type: Property
comment: Identifies the code associated with a video status error.
alternate name: code
sub property of: code
domain: Video Status Error
range: int

message
type: Property
comment: Provides the message associated with a video status error.
alternate name: message
sub property of: message
domain: Video Status Error
range: string

errors
type: Property
comment: Lists errors associated with the video's publishing phase.
alternate name: errors
sub property of: errors
domain: Video Status Publishing Phase
range: Video Status Error

publish status
type: Property
comment: Indicates the video's publishing status.
alternate name: publish_status
sub property of: publish status
domain: Video Status Publishing Phase
range: string

publish time
type: Property
comment: Indicates the video's publish time.
alternate name: publish_time
sub property of: publish time
domain: Video Status Publishing Phase
range: dateTime

status
type: Property
comment: Indicates the status of the video's publishing phase.
alternate name: status
domain: Video Status Publishing Phase
range: string

bytes transferred
type: Property
comment: Indicates the amount of data transferred during the video's upload.
alternate name: bytes_transferred
sub property of: bytes transferred
domain: Video Status Uploading Phase
range: unsignedInt

errors
type: Property
comment: Lists errors associated with the video's uploading phase.
alternate name: errors
sub property of: errors
domain: Video Status Uploading Phase
range: Video Status Error

source file size
type: Property
comment: Indicates the size of the video's source file.
alternate name: source_file_size
sub property of: source file size
domain: Video Status Uploading Phase
range: unsignedInt

status
type: Property
comment: Indicates the status of the video's uploading phase.
alternate name: status
domain: Video Status Uploading Phase
range: string

app has leads permission
type: Property
comment: Indicates whether the app has leads permission.
alternate name: app_has_leads_permission
sub property of: app has leads permission
domain: Has Lead Access
range: boolean

can access lead
type: Property
comment: Indicates whether lead access is available.
alternate name: can_access_lead
sub property of: can access lead
domain: Has Lead Access
range: boolean

enabled lead access manager
type: Property
comment: Indicates whether the lead access manager is enabled.
alternate name: enabled_lead_access_manager
sub property of: enabled lead access manager
domain: Has Lead Access
range: boolean

failure reason
type: Property
comment: Represents the reason for a lead-access failure.
alternate name: failure_reason
sub property of: failure reason
domain: Has Lead Access
range: string

failure resolution
type: Property
comment: Represents the resolution for a lead-access failure.
alternate name: failure_resolution
sub property of: failure resolution
domain: Has Lead Access
range: string

is page admin
type: Property
comment: Indicates whether the user is a page administrator.
alternate name: is_page_admin
sub property of: is page admin
domain: Has Lead Access
range: boolean

page id
type: Property
comment: Represents the page identifier used for lead access.
alternate name: page_id
sub property of: page id
domain: Has Lead Access
range: string

user has leads permission
type: Property
comment: Indicates whether the user has leads permission.
alternate name: user_has_leads_permission
sub property of: user has leads permission
domain: Has Lead Access
range: boolean

user id
type: Property
comment: Represents the user identifier used for lead access.
alternate name: user_id
sub property of: user id
domain: Has Lead Access
range: string

hop v2
type: Property
comment: Indicates the status of the HOP v2 messaging feature.
alternate name: hop_v2
sub property of: hop v2
domain: Messaging Feature Status
range: boolean

ig multi app
type: Property
comment: Indicates the status of the Instagram multi-app messaging feature.
alternate name: ig_multi_app
sub property of: ig multi app
domain: Messaging Feature Status
range: boolean

msgr multi app
type: Property
comment: Indicates the status of the Messenger multi-app messaging feature.
alternate name: msgr_multi_app
sub property of: msgr multi app
domain: Messaging Feature Status
range: boolean

lot
type: Property
comment: Represents the Page's parking-lot parking information.
alternate name: lot
sub property of: lot
domain: Page Parking
range: unsignedInt

street
type: Property
comment: Represents the Page's street-parking information.
alternate name: street
domain: Page Parking
range: unsignedInt

valet
type: Property
comment: Represents the Page's valet-parking information.
alternate name: valet
sub property of: valet
domain: Page Parking
range: unsignedInt

amex
type: Property
comment: Represents the Page's American Express payment option.
alternate name: amex
sub property of: amex
domain: Page Payment Options
range: unsignedInt

cash only
type: Property
comment: Represents the Page's cash-only payment option.
alternate name: cash_only
sub property of: cash only
domain: Page Payment Options
range: unsignedInt

discover
type: Property
comment: Represents the Page's Discover payment option.
alternate name: discover
sub property of: discover
domain: Page Payment Options
range: unsignedInt

mastercard
type: Property
comment: Represents the Page's Mastercard payment option.
alternate name: mastercard
sub property of: mastercard
domain: Page Payment Options
range: unsignedInt

visa
type: Property
comment: Represents the Page's Visa payment option.
alternate name: visa
sub property of: visa
domain: Page Payment Options
range: unsignedInt

catering
type: Property
comment: Indicates whether the restaurant provides catering.
alternate name: catering
sub property of: catering
domain: Page Restaurant Services
range: boolean

delivery
type: Property
comment: Indicates whether the restaurant provides delivery.
alternate name: delivery
sub property of: delivery
domain: Page Restaurant Services
range: boolean

groups
type: Property
comment: Indicates whether the restaurant accommodates groups.
alternate name: groups
domain: Page Restaurant Services
range: boolean

kids
type: Property
comment: Indicates whether the restaurant provides services for kids.
alternate name: kids
sub property of: kids
domain: Page Restaurant Services
range: boolean

outdoor
type: Property
comment: Indicates whether the restaurant provides outdoor service.
alternate name: outdoor
sub property of: outdoor
domain: Page Restaurant Services
range: boolean

pickup
type: Property
comment: Indicates whether the restaurant provides pickup.
alternate name: pickup
sub property of: pickup
domain: Page Restaurant Services
range: boolean

reserve
type: Property
comment: Indicates whether the restaurant accepts reservations.
alternate name: reserve
sub property of: reserve
domain: Page Restaurant Services
range: boolean

takeout
type: Property
comment: Indicates whether the restaurant provides takeout.
alternate name: takeout
sub property of: takeout
domain: Page Restaurant Services
range: boolean

waiter
type: Property
comment: Indicates whether the restaurant provides waiter service.
alternate name: waiter
sub property of: waiter
domain: Page Restaurant Services
range: boolean

walkins
type: Property
comment: Indicates whether the restaurant accepts walk-ins.
alternate name: walkins
sub property of: walkins
domain: Page Restaurant Services
range: boolean

breakfast
type: Property
comment: Represents the restaurant's breakfast specialty information.
alternate name: breakfast
sub property of: breakfast
domain: Page Restaurant Specialties
range: unsignedInt

coffee
type: Property
comment: Represents the restaurant's coffee specialty information.
alternate name: coffee
sub property of: coffee
domain: Page Restaurant Specialties
range: unsignedInt

dinner
type: Property
comment: Represents the restaurant's dinner specialty information.
alternate name: dinner
sub property of: dinner
domain: Page Restaurant Specialties
range: unsignedInt

drinks
type: Property
comment: Represents the restaurant's drinks specialty information.
alternate name: drinks
sub property of: drinks
domain: Page Restaurant Specialties
range: unsignedInt

lunch
type: Property
comment: Represents the restaurant's lunch specialty information.
alternate name: lunch
sub property of: lunch
domain: Page Restaurant Specialties
range: unsignedInt

date
type: Property
comment: Represents the date associated with the Page's start information.
alternate name: date
sub property of: date
domain: Page Start Info
range: JSON

type
type: Property
comment: Represents the type of the Page's start information.
alternate name: type
domain: Page Start Info
range: string

has mobile app
type: Property
comment: Indicates whether the VoIP participant has a mobile app.
alternate name: has_mobile_app
sub property of: has mobile app
domain: Voip Info
range: boolean

has permission
type: Property
comment: Indicates whether the VoIP participant has permission.
alternate name: has_permission
sub property of: has permission
domain: Voip Info
range: boolean

is callable
type: Property
comment: Indicates whether the VoIP participant is callable.
alternate name: is_callable
sub property of: is callable
domain: Voip Info
range: boolean

is callable webrtc
type: Property
comment: Indicates whether the VoIP participant is callable using WebRTC.
alternate name: is_callable_webrtc
sub property of: is callable webrtc
domain: Voip Info
range: boolean

is pushable
type: Property
comment: Indicates whether the VoIP participant is pushable.
alternate name: is_pushable
sub property of: is pushable
domain: Voip Info
range: boolean

reason code
type: Property
comment: Identifies the code for the VoIP information's reason.
alternate name: reason_code
domain: Voip Info
range: unsignedInt

reason description
type: Property
comment: Describes the reason associated with the VoIP information.
alternate name: reason_description
sub property of: reason description
domain: Voip Info
range: string

carousel ad
type: Property
comment: Image transformation settings for carousel ads.
alternate name: carousel_ad
sub property of: carousel ad
domain: Product Catalog Image Settings
range: Product Catalog Image Settings Operation

single ad
type: Property
comment: Image transformation settings for single ads.
alternate name: single_ad
sub property of: single ad
domain: Product Catalog Image Settings
range: Product Catalog Image Settings Operation

transformation type
type: Property
comment: The type of image transformation used by the operation.
alternate name: transformation_type
sub property of: transformation type
domain: Product Catalog Image Settings Operation
range: string

id
type: Property
comment: Identifies the managed partner extended credit.
alternate name: id
sub property of: id
domain: Managed Partner Extended Credit
range: string

max balance
type: Property
comment: Represents the maximum balance associated with the managed partner extended credit.
alternate name: max_balance
sub property of: max balance
domain: Managed Partner Extended Credit
range: Currency Amount

receiving credit allocation config
type: Property
comment: Contains the configuration for receiving credit allocations.
alternate name: receiving_credit_allocation_config
sub property of: receiving credit allocation config
domain: Managed Partner Extended Credit
range: Extended Credit Allocation Config

amount
type: Property
comment: Represents the amount in the currency amount model.
alternate name: amount
domain: Currency Amount
range: string

amount in hundredths
type: Property
comment: Represents the amount expressed in hundredths in the currency amount model.
alternate name: amount_in_hundredths
sub property of: amount in hundredths
domain: Currency Amount
range: string

currency
type: Property
comment: Identifies the currency of the currency amount.
alternate name: currency
domain: Currency Amount
range: string

offsetted amount
type: Property
comment: Represents the offsetted amount in the currency amount model.
alternate name: offsetted_amount
sub property of: offsetted amount
domain: Currency Amount
range: string

currency amount
type: Property
comment: Represents the currency amount in the credit allocation configuration.
alternate name: currency_amount
sub property of: currency amount
domain: Extended Credit Allocation Config
range: Currency Amount

id
type: Property
comment: Identifies the credit allocation configuration.
alternate name: id
sub property of: id
domain: Extended Credit Allocation Config
range: string

liability type
type: Property
comment: Represents the type of liability in the credit allocation configuration.
alternate name: liability_type
sub property of: liability type
domain: Extended Credit Allocation Config
range: string

owning business
type: Property
comment: Identifies the business that owns the credit allocation configuration.
alternate name: owning_business
sub property of: owning business
domain: Extended Credit Allocation Config
range: Business

owning credential
type: Property
comment: Identifies the extended credit credential that owns the allocation configuration.
alternate name: owning_credential
sub property of: owning credential
domain: Extended Credit Allocation Config
range: Extended Credit

partition type
type: Property
comment: Represents the type of partition used by the credit allocation configuration.
alternate name: partition_type
sub property of: partition type
domain: Extended Credit Allocation Config
range: string

receiving business
type: Property
comment: Identifies the business receiving the credit allocation.
alternate name: receiving_business
sub property of: receiving business
domain: Extended Credit Allocation Config
range: Business

receiving credential
type: Property
comment: Identifies the extended credit credential receiving the allocation.
alternate name: receiving_credential
sub property of: receiving credential
domain: Extended Credit Allocation Config
range: Extended Credit

request status
type: Property
comment: Represents the status of the credit allocation request.
alternate name: request_status
sub property of: request status
domain: Extended Credit Allocation Config
range: string

send bill to
type: Property
comment: Represents where the bill is sent.
alternate name: send_bill_to
sub property of: send bill to
domain: Extended Credit Allocation Config
range: string

allocated amount
type: Property
comment: Represents the amount allocated to the extended credit.
alternate name: allocated_amount
sub property of: allocated amount
domain: Extended Credit
range: Currency Amount

balance
type: Property
comment: Represents the extended credit's balance.
alternate name: balance
domain: Extended Credit
range: Currency Amount

credit available
type: Property
comment: Represents the amount of credit available.
alternate name: credit_available
sub property of: credit available
domain: Extended Credit
range: Currency Amount

credit type
type: Property
comment: Represents the type of extended credit.
alternate name: credit_type
sub property of: credit type
domain: Extended Credit
range: string

id
type: Property
comment: Identifies the extended credit.
alternate name: id
sub property of: id
domain: Extended Credit
range: string

is access revoked
type: Property
comment: Indicates whether access to the extended credit is revoked.
alternate name: is_access_revoked
sub property of: is access revoked
domain: Extended Credit
range: boolean

is automated experience
type: Property
comment: Indicates whether the extended credit is associated with an automated experience.
alternate name: is_automated_experience
sub property of: is automated experience
domain: Extended Credit
range: boolean

legal entity name
type: Property
comment: Represents the name of the legal entity associated with the extended credit.
alternate name: legal_entity_name
sub property of: legal entity name
domain: Extended Credit
range: string

liable address
type: Property
comment: Represents the address of the party liable for the extended credit.
alternate name: liable_address
sub property of: liable address
domain: Extended Credit
range: CRMAddress

liable biz name
type: Property
comment: Represents the business name of the party liable for the extended credit.
alternate name: liable_biz_name
sub property of: liable biz name
domain: Extended Credit
range: string

max balance
type: Property
comment: Represents the maximum balance of the extended credit.
alternate name: max_balance
sub property of: max balance
domain: Extended Credit
range: Currency Amount

online max balance
type: Property
comment: Represents the maximum online balance of the extended credit.
alternate name: online_max_balance
sub property of: online max balance
domain: Extended Credit
range: Currency Amount

owner business
type: Property
comment: Identifies the business that owns the extended credit.
alternate name: owner_business
sub property of: owner business
domain: Extended Credit
range: Business

owner business name
type: Property
comment: Represents the name of the business that owns the extended credit.
alternate name: owner_business_name
sub property of: owner business name
domain: Extended Credit
range: string

partition from
type: Property
comment: Represents the source from which the extended credit is partitioned.
alternate name: partition_from
sub property of: partition from
domain: Extended Credit
range: string

receiving credit allocation config
type: Property
comment: Contains the credit allocation configuration for receiving credit.
alternate name: receiving_credit_allocation_config
sub property of: receiving credit allocation config
domain: Extended Credit
range: Extended Credit Allocation Config

send bill to address
type: Property
comment: Represents the address to which the bill is sent.
alternate name: send_bill_to_address
sub property of: send bill to address
domain: Extended Credit
range: CRMAddress

send bill to biz name
type: Property
comment: Represents the business name to which the bill is sent.
alternate name: send_bill_to_biz_name
sub property of: send bill to biz name
domain: Extended Credit
range: string

sold to address
type: Property
comment: Represents the address of the party to which the extended credit is sold.
alternate name: sold_to_address
sub property of: sold to address
domain: Extended Credit
range: CRMAddress

city
type: Property
comment: Represents the city in the CRM address.
alternate name: city
sub property of: city
domain: CRMAddress
range: string

cnpj tax id
type: Property
comment: Represents the CNPJ tax identifier in the CRM address.
alternate name: cnpj_tax_id
sub property of: cnpj tax id
domain: CRMAddress
range: string

country
type: Property
comment: Represents the country in the CRM address.
alternate name: country
sub property of: country
domain: CRMAddress
range: string

id
type: Property
comment: Identifies the CRM address.
alternate name: id
sub property of: id
domain: CRMAddress
range: string

postal code
type: Property
comment: Represents the postal code in the CRM address.
alternate name: postal_code
sub property of: postal code
domain: CRMAddress
range: string

registration label
type: Property
comment: Represents the label for the registration information in the CRM address.
alternate name: registration_label
sub property of: registration label
domain: CRMAddress
range: string

registration number
type: Property
comment: Represents the registration number in the CRM address.
alternate name: registration_number
sub property of: registration number
domain: CRMAddress
range: string

state
type: Property
comment: Represents the state in the CRM address.
alternate name: state
sub property of: state
domain: CRMAddress
range: string

street1
type: Property
comment: Represents the first street address line in the CRM address.
alternate name: street1
sub property of: street1
domain: CRMAddress
range: string

street2
type: Property
comment: Represents the second street address line in the CRM address.
alternate name: street2
sub property of: street2
domain: CRMAddress
range: string

street3
type: Property
comment: Represents the third street address line in the CRM address.
alternate name: street3
sub property of: street3
domain: CRMAddress
range: string

street4
type: Property
comment: Represents the fourth street address line in the CRM address.
alternate name: street4
sub property of: street4
domain: CRMAddress
range: string

validation status
type: Property
comment: Represents the validation status of the CRM address.
alternate name: validation_status
sub property of: validation status
domain: CRMAddress
range: string

vat tax id
type: Property
comment: Represents the VAT tax identifier in the CRM address.
alternate name: vat_tax_id
sub property of: vat tax id
domain: CRMAddress
range: string

is eligible
type: Property
comment: Whether the business is eligible for managed partnership.
alternate name: is_eligible
sub property of: is eligible
domain: Business Managed Partner Eligibility
range: boolean

reason code
type: Property
comment: The code for the reason associated with the managed-partner eligibility result.
alternate name: reason_code
domain: Business Managed Partner Eligibility
range: string

reason description
type: Property
comment: The description of the reason associated with the managed-partner eligibility result.
alternate name: reason_description
sub property of: reason description
domain: Business Managed Partner Eligibility
range: string

enable basket insight
type: Property
comment: Whether basket insight is enabled for the business partner.
alternate name: enable_basket_insight
sub property of: enable basket insight
domain: Business Partner Premium Options
range: boolean

enable extended audience retargeting
type: Property
comment: Whether extended audience retargeting is enabled for the business partner.
alternate name: enable_extended_audience_retargeting
sub property of: enable extended audience retargeting
domain: Business Partner Premium Options
range: boolean

retailer custom audience config
type: Property
comment: The retailer's custom audience configuration.
alternate name: retailer_custom_audience_config
sub property of: retailer custom audience config
domain: Business Partner Premium Options
range: JSON

status
type: Property
comment: Represents the status of marketing messages onboarding.
alternate name: status
domain: Marketing Messages Onboarding Status
range: string

time
type: Property
comment: Represents the time associated with the marketing messages onboarding status.
alternate name: time
sub property of: time
domain: Marketing Messages Onboarding Status
range: dateTime

audience type param name
type: Property
comment: Represents the parameter name for the audience type in the custom audience group.
alternate name: audience_type_param_name
sub property of: audience type param name
domain: Custom Audience Group
range: string

existing customer tag
type: Property
comment: Represents the tag for existing customers in the custom audience group.
alternate name: existing_customer_tag
sub property of: existing customer tag
domain: Custom Audience Group
range: string

new customer tag
type: Property
comment: Represents the tag for new customers in the custom audience group.
alternate name: new_customer_tag
sub property of: new customer tag
domain: Custom Audience Group
range: string

coupon
type: Property
comment: Represents a coupon associated with the funding source.
alternate name: coupon
sub property of: coupon
domain: Funding Source Details
range: Funding Source Details Coupon

coupons
type: Property
comment: Represents the coupons associated with the funding source.
alternate name: coupons
sub property of: coupons
domain: Funding Source Details
range: Funding Source Details Coupon

display string
type: Property
comment: Represents the display text for the funding source.
alternate name: display_string
sub property of: display string
domain: Funding Source Details
range: string

id
type: Property
comment: Represents the identifier of the funding source.
alternate name: id
sub property of: id
domain: Funding Source Details
range: string

type
type: Property
comment: Represents the type designation of the funding source.
alternate name: type
domain: Funding Source Details
range: int

amount
type: Property
comment: Represents the coupon amount.
alternate name: amount
domain: Funding Source Details Coupon
range: int

campaign ids
type: Property
comment: Represents the campaign identifiers associated with the coupon.
alternate name: campaign_ids
domain: Funding Source Details Coupon
range: int

child ad account id
type: Property
comment: Represents the child ad account identifier associated with the coupon.
alternate name: child_ad_account_id
sub property of: child ad account id
domain: Funding Source Details Coupon
range: string

child bm id
type: Property
comment: Represents the child business manager identifier associated with the coupon.
alternate name: child_bm_id
sub property of: child bm id
domain: Funding Source Details Coupon
range: string

coupon id
type: Property
comment: Represents the coupon identifier.
alternate name: coupon_id
sub property of: coupon id
domain: Funding Source Details Coupon
range: string

coupon tiering
type: Property
comment: Represents coupon tiering information.
alternate name: coupon_tiering
sub property of: coupon tiering
domain: Funding Source Details Coupon
range: Funding Source Details Coupon Tiering

currency
type: Property
comment: Represents the currency associated with the coupon.
alternate name: currency
domain: Funding Source Details Coupon
range: string

display amount
type: Property
comment: Represents the coupon amount in display form.
alternate name: display_amount
sub property of: display amount
domain: Funding Source Details Coupon
range: string

expiration
type: Property
comment: Represents the coupon expiration date and time.
alternate name: expiration
domain: Funding Source Details Coupon
range: dateTime

original amount
type: Property
comment: Represents the coupon's original amount.
alternate name: original_amount
sub property of: original amount
domain: Funding Source Details Coupon
range: int

original display amount
type: Property
comment: Represents the coupon's original amount in display form.
alternate name: original_display_amount
sub property of: original display amount
domain: Funding Source Details Coupon
range: string

start date
type: Property
comment: Represents the coupon start date and time.
alternate name: start_date
domain: Funding Source Details Coupon
range: dateTime

vendor id
type: Property
comment: Represents the identifier of the coupon vendor.
alternate name: vendor_id
sub property of: vendor id
domain: Funding Source Details Coupon
range: string

coupon tiering new
type: Property
comment: Represents an unspecified object for new-coupon tiering.
alternate name: coupon_tiering_new
sub property of: coupon tiering new
domain: Funding Source Details Coupon Tiering
range: JSON

coupon tiering reactivation
type: Property
comment: Represents an unspecified object for coupon-reactivation tiering.
alternate name: coupon_tiering_reactivation
sub property of: coupon tiering reactivation
domain: Funding Source Details Coupon Tiering
range: JSON

auto enroll
type: Property
comment: Indicates whether automatic enrollment is enabled for the invoice group.
alternate name: auto_enroll
sub property of: auto enroll
domain: Extended Credit Invoice Group
range: boolean

bill to address
type: Property
comment: Represents the address to be billed for the invoice group.
alternate name: bill_to_address
sub property of: bill to address
domain: Extended Credit Invoice Group
range: CRMAddress

customer po number
type: Property
comment: Represents the customer's purchase order number for the invoice group.
alternate name: customer_po_number
sub property of: customer po number
domain: Extended Credit Invoice Group
range: string

email
type: Property
comment: Contains an email associated with the invoice group.
alternate name: email
domain: Extended Credit Invoice Group
range: Extended Credit Email

emails
type: Property
comment: Contains the email addresses associated with the invoice group.
alternate name: emails
sub property of: emails
domain: Extended Credit Invoice Group
range: string

id
type: Property
comment: Identifies the invoice group.
alternate name: id
sub property of: id
domain: Extended Credit Invoice Group
range: string

liable address
type: Property
comment: Represents the address of the party liable for the invoice group.
alternate name: liable_address
sub property of: liable address
domain: Extended Credit Invoice Group
range: CRMAddress

name
type: Property
comment: Represents the invoice group's name.
alternate name: name
sub property of: name
domain: Extended Credit Invoice Group
range: string

sold to address
type: Property
comment: Represents the address of the party to which the invoice group is sold.
alternate name: sold_to_address
sub property of: sold to address
domain: Extended Credit Invoice Group
range: CRMAddress

email
type: Property
comment: Represents the email address associated with the extended credit.
alternate name: email
domain: Extended Credit Email
range: string

id
type: Property
comment: Identifies the extended credit email.
alternate name: id
sub property of: id
domain: Extended Credit Email
range: string

check name
type: Property
comment: Identifies the delivery check.
alternate name: check_name
sub property of: check name
domain: Delivery Check
range: string

description
type: Property
comment: Describes the delivery check.
alternate name: description
sub property of: description
domain: Delivery Check
range: string

extra info
type: Property
comment: Provides additional information about the delivery check.
alternate name: extra_info
sub property of: extra info
domain: Delivery Check
range: Delivery Check Extra Info

summary
type: Property
comment: Summarizes the delivery check.
alternate name: summary
sub property of: summary
domain: Delivery Check
range: string

adgroup ids
type: Property
comment: Lists the ad group identifiers associated with the delivery check information.
alternate name: adgroup_ids
sub property of: adgroup ids
domain: Delivery Check Extra Info
range: string

campaign ids
type: Property
comment: Lists the campaign identifiers associated with the delivery check information.
alternate name: campaign_ids
domain: Delivery Check Extra Info
range: string

countries
type: Property
comment: Lists the countries associated with the delivery check information.
alternate name: countries
sub property of: countries
domain: Delivery Check Extra Info
range: string

countries
type: Property
comment: The countries included in the reach and frequency specification.
alternate name: countries
sub property of: countries
domain: Reach Frequency Spec
range: string

default creation data
type: Property
comment: Default data associated with creating the reach and frequency specification.
alternate name: default_creation_data
sub property of: default creation data
domain: Reach Frequency Spec
range: JSON

global io max campaign duration
type: Property
comment: The global maximum campaign duration specified for the reach and frequency specification.
alternate name: global_io_max_campaign_duration
sub property of: global io max campaign duration
domain: Reach Frequency Spec
range: unsignedInt

max campaign duration
type: Property
comment: The maximum campaign duration specified for the reach and frequency specification.
alternate name: max_campaign_duration
sub property of: max campaign duration
domain: Reach Frequency Spec
range: JSON

max days to finish
type: Property
comment: The maximum number of days specified to finish the reach and frequency activity.
alternate name: max_days_to_finish
sub property of: max days to finish
domain: Reach Frequency Spec
range: JSON

max pause without prediction rerun
type: Property
comment: The maximum pause specified without rerunning a prediction.
alternate name: max_pause_without_prediction_rerun
sub property of: max pause without prediction rerun
domain: Reach Frequency Spec
range: JSON

min campaign duration
type: Property
comment: The minimum campaign duration specified for the reach and frequency specification.
alternate name: min_campaign_duration
sub property of: min campaign duration
domain: Reach Frequency Spec
range: JSON

min reach limits
type: Property
comment: The minimum reach limits specified for the reach and frequency specification.
alternate name: min_reach_limits
sub property of: min reach limits
domain: Reach Frequency Spec
range: JSON

whatsapp activation status
type: Property
comment: Represents the WhatsApp activation status in the marketing messages settings.
alternate name: whatsapp_activation_status
sub property of: whatsapp activation status
domain: Ad Account Marketing Messages Settings
range: string

action type
type: Property
comment: The types of actions included in the conversion action query.
alternate name: action.type
domain: Conversion Action Query
range: JSON

application
type: Property
comment: The applications included in the conversion action query.
alternate name: application
domain: Conversion Action Query
range: JSON

conversion id
type: Property
comment: The conversion identifiers included in the conversion action query.
alternate name: conversion_id
sub property of: conversion id
domain: Conversion Action Query
range: string

creative
type: Property
comment: The creatives included in the conversion action query.
alternate name: creative
domain: Conversion Action Query
range: JSON

dataset
type: Property
comment: The datasets included in the conversion action query.
alternate name: dataset
sub property of: dataset
domain: Conversion Action Query
range: string

dataset split
type: Property
comment: The dataset splits included in the conversion action query.
alternate name: dataset_split
sub property of: dataset split
domain: Conversion Action Query
range: string

event
type: Property
comment: The events included in the conversion action query.
alternate name: event
domain: Conversion Action Query
range: string

event creator
type: Property
comment: The creators associated with events in the conversion action query.
alternate name: event.creator
sub property of: event creator
domain: Conversion Action Query
range: string

event type
type: Property
comment: The event types included in the conversion action query.
alternate name: event_type
sub property of: event type
domain: Conversion Action Query
range: string

fb pixel
type: Property
comment: Identifies a Facebook pixel included in the conversion action query.
alternate name: fb_pixel
sub property of: fb pixel
domain: Conversion Action Query
range: string

fb pixel event
type: Property
comment: Identifies a Facebook pixel event included in the conversion action query.
alternate name: fb_pixel_event
sub property of: fb pixel event
domain: Conversion Action Query
range: string

leadgen
type: Property
comment: Identifies a lead-generation conversion action included in the query.
alternate name: leadgen
sub property of: leadgen
domain: Conversion Action Query
range: string

object
type: Property
comment: Identifies an object included in the conversion action query.
alternate name: object
sub property of: object
domain: Conversion Action Query
range: string

object domain
type: Property
comment: Identifies the domain associated with the object in the conversion action query.
alternate name: object.domain
sub property of: object domain
domain: Conversion Action Query
range: string

offer
type: Property
comment: Identifies an offer included in the conversion action query.
alternate name: offer
domain: Conversion Action Query
range: string

offer creator
type: Property
comment: Identifies the creator associated with the offer in the conversion action query.
alternate name: offer.creator
sub property of: offer creator
domain: Conversion Action Query
range: string

offsite pixel
type: Property
comment: Identifies an offsite pixel included in the conversion action query.
alternate name: offsite_pixel
sub property of: offsite pixel
domain: Conversion Action Query
range: string

page
type: Property
comment: Identifies a page included in the conversion action query.
alternate name: page
domain: Conversion Action Query
range: string

page parent
type: Property
comment: Identifies the parent page associated with the page in the conversion action query.
alternate name: page.parent
sub property of: page parent
domain: Conversion Action Query
range: string

post
type: Property
comment: Identifies a post included in the conversion action query.
alternate name: post
sub property of: post
domain: Conversion Action Query
range: string

post object
type: Property
comment: Identifies the object associated with the post in the conversion action query.
alternate name: post.object
sub property of: post object
domain: Conversion Action Query
range: string

post object wall
type: Property
comment: Identifies the wall associated with the post object in the conversion action query.
alternate name: post.object.wall
sub property of: post object wall
domain: Conversion Action Query
range: string

post wall
type: Property
comment: Identifies the wall associated with the post in the conversion action query.
alternate name: post.wall
sub property of: post wall
domain: Conversion Action Query
range: string

question
type: Property
comment: Identifies a question included in the conversion action query.
alternate name: question
sub property of: question
domain: Conversion Action Query
range: string

question creator
type: Property
comment: Identifies the creator associated with the question in the conversion action query.
alternate name: question.creator
sub property of: question creator
domain: Conversion Action Query
range: string

response
type: Property
comment: Identifies a response included in the conversion action query.
alternate name: response
sub property of: response
domain: Conversion Action Query
range: string

subtype
type: Property
comment: Identifies the subtype used in the conversion action query.
alternate name: subtype
sub property of: subtype
domain: Conversion Action Query
range: string

account id
type: Property
comment: Identifies the account associated with the ad creative.
alternate name: account_id
sub property of: account id
domain: Ad Creative
range: string

actor id
type: Property
comment: Identifies the actor associated with the ad creative.
alternate name: actor_id
sub property of: actor id
domain: Ad Creative
range: string

ad disclaimer spec
type: Property
comment: Contains the ad disclaimer specification for the creative.
alternate name: ad_disclaimer_spec
sub property of: ad disclaimer spec
domain: Ad Creative
range: Ad Creative Ad Disclaimer

adlabels
type: Property
comment: Lists the ad labels associated with the creative.
alternate name: adlabels
domain: Ad Creative
range: Ad Label

applink treatment
type: Property
comment: Contains the applink treatment associated with the creative.
alternate name: applink_treatment
sub property of: applink treatment
domain: Ad Creative
range: string

asset feed spec
type: Property
comment: Contains the asset feed specification for the creative.
alternate name: asset_feed_spec
sub property of: asset feed spec
domain: Ad Creative
range: Ad Asset Feed Spec

authorization category
type: Property
comment: Identifies the authorization category of the creative.
alternate name: authorization_category
sub property of: authorization category
domain: Ad Creative
range: string

auto update
type: Property
comment: Indicates whether auto-update applies to the creative.
alternate name: auto_update
sub property of: auto update
domain: Ad Creative
range: boolean

body
type: Property
comment: Contains the body text of the creative.
alternate name: body
sub property of: body
domain: Ad Creative
range: string

branded content
type: Property
comment: Contains the branded-content information for the creative.
alternate name: branded_content
sub property of: branded content
domain: Ad Creative
range: Ad Creative Branded Content Ads

branded content sponsor page id
type: Property
comment: Identifies the sponsor page for the creative's branded content.
alternate name: branded_content_sponsor_page_id
sub property of: branded content sponsor page id
domain: Ad Creative
range: string

bundle folder id
type: Property
comment: Identifies the bundle folder associated with the creative.
alternate name: bundle_folder_id
sub property of: bundle folder id
domain: Ad Creative
range: string

call to action
type: Property
comment: Contains the call-to-action information for the creative.
alternate name: call_to_action
sub property of: call to action
domain: Ad Creative
range: Ad Creative Link Data Call To Action

call to action type
type: Property
comment: Identifies the call-to-action type for the creative.
alternate name: call_to_action_type
sub property of: call to action type
domain: Ad Creative
range: string
code list: AdCreativeCallToActionType

categorization criteria
type: Property
comment: Contains the categorization criteria for the creative.
alternate name: categorization_criteria
sub property of: categorization criteria
domain: Ad Creative
range: string

category media source
type: Property
comment: Identifies the media source for the creative's category.
alternate name: category_media_source
sub property of: category media source
domain: Ad Creative
range: string

collaborative ads lsb image bank id
type: Property
comment: Identifies the image bank associated with the creative's collaborative ads LSB.
alternate name: collaborative_ads_lsb_image_bank_id
sub property of: collaborative ads lsb image bank id
domain: Ad Creative
range: string

contextual multi ads
type: Property
comment: Contains the contextual multi-ads information for the creative.
alternate name: contextual_multi_ads
sub property of: contextual multi ads
domain: Ad Creative
range: Ad Creative Contextual Multi Ads

creative sourcing spec
type: Property
comment: Contains the sourcing specification for the creative.
alternate name: creative_sourcing_spec
sub property of: creative sourcing spec
domain: Ad Creative
range: Ad Creative Sourcing Spec

degrees of freedom spec
type: Property
comment: Contains the degrees-of-freedom specification for the creative.
alternate name: degrees_of_freedom_spec
sub property of: degrees of freedom spec
domain: Ad Creative
range: Ad Creative Degrees Of Freedom Spec

destination set id
type: Property
comment: Identifies the destination set associated with the creative.
alternate name: destination_set_id
sub property of: destination set id
domain: Ad Creative
range: string

dynamic ad voice
type: Property
comment: Identifies the dynamic ad voice associated with the creative.
alternate name: dynamic_ad_voice
sub property of: dynamic ad voice
domain: Ad Creative
range: string

effective authorization category
type: Property
comment: Identifies the effective authorization category of the creative.
alternate name: effective_authorization_category
sub property of: effective authorization category
domain: Ad Creative
range: string

effective instagram media id
type: Property
comment: Identifies the effective Instagram media associated with the creative.
alternate name: effective_instagram_media_id
sub property of: effective instagram media id
domain: Ad Creative
range: string

effective object story id
type: Property
comment: Identifies the effective object story associated with the creative.
alternate name: effective_object_story_id
sub property of: effective object story id
domain: Ad Creative
range: string

enable direct install
type: Property
comment: Indicates whether direct installation is enabled for the creative.
alternate name: enable_direct_install
sub property of: enable direct install
domain: Ad Creative
range: boolean

enable launch instant app
type: Property
comment: Indicates whether launching an Instant App is enabled for the creative.
alternate name: enable_launch_instant_app
sub property of: enable launch instant app
domain: Ad Creative
range: boolean

facebook branded content
type: Property
comment: Branded-content information associated with the Facebook ad creative.
alternate name: facebook_branded_content
sub property of: facebook branded content
domain: Ad Creative
range: Ad Creative Facebook Branded Content

id
type: Property
comment: The identifier of the ad creative.
alternate name: id
sub property of: id
domain: Ad Creative
range: string

image crops
type: Property
comment: Crop information for an image used by the ad creative.
alternate name: image_crops
sub property of: image crops
domain: Ad Creative
range: Ads Image Crops

image hash
type: Property
comment: The hash associated with an image used by the ad creative.
alternate name: image_hash
sub property of: image hash
domain: Ad Creative
range: string

image url
type: Property
comment: The URL of an image used by the ad creative.
alternate name: image_url
sub property of: image url
domain: Ad Creative
range: string

instagram branded content
type: Property
comment: Branded-content information associated with the Instagram ad creative.
alternate name: instagram_branded_content
sub property of: instagram branded content
domain: Ad Creative
range: Ad Creative Instagram Branded Content

instagram permalink url
type: Property
comment: The permalink URL for the Instagram media associated with the ad creative.
alternate name: instagram_permalink_url
sub property of: instagram permalink url
domain: Ad Creative
range: string

instagram user id
type: Property
comment: The identifier of the Instagram user associated with the ad creative.
alternate name: instagram_user_id
sub property of: instagram user id
domain: Ad Creative
range: string

interactive components spec
type: Property
comment: The specification for interactive components in the ad creative.
alternate name: interactive_components_spec
sub property of: interactive components spec
domain: Ad Creative
range: Ad Creative Interactive Components Spec

link deep link url
type: Property
comment: The deep-link URL associated with the ad creative's link.
alternate name: link_deep_link_url
sub property of: link deep link url
domain: Ad Creative
range: string

link destination display url
type: Property
comment: The URL displayed as the destination for the ad creative's link.
alternate name: link_destination_display_url
sub property of: link destination display url
domain: Ad Creative
range: string

link og id
type: Property
comment: The identifier of the Open Graph object associated with the ad creative's link.
alternate name: link_og_id
sub property of: link og id
domain: Ad Creative
range: string

link url
type: Property
comment: The URL targeted by the ad creative's link.
alternate name: link_url
sub property of: link url
domain: Ad Creative
range: string

messenger sponsored message
type: Property
comment: The sponsored message associated with the ad creative in Messenger.
alternate name: messenger_sponsored_message
sub property of: messenger sponsored message
domain: Ad Creative
range: string

name
type: Property
comment: The name of the ad creative.
alternate name: name
sub property of: name
domain: Ad Creative
range: string

object id
type: Property
comment: The identifier of the object represented by the ad creative.
alternate name: object_id
sub property of: object id
domain: Ad Creative
range: string

object store url
type: Property
comment: The store URL associated with the object represented by the ad creative.
alternate name: object_store_url
sub property of: object store url
domain: Ad Creative
range: string

object story id
type: Property
comment: The identifier of the story object represented by the ad creative.
alternate name: object_story_id
sub property of: object story id
domain: Ad Creative
range: string

object story spec
type: Property
comment: The story specification represented by the ad creative.
alternate name: object_story_spec
sub property of: object story spec
domain: Ad Creative
range: Ad Creative Object Story Spec

object type
type: Property
comment: The type of object represented by the ad creative, such as an application, event, page, photo, post, or video.
alternate name: object_type
sub property of: object type
domain: Ad Creative
range: string
code list: AdCreativeObjectType

object url
type: Property
comment: The URL of the object represented by the ad creative.
alternate name: object_url
sub property of: object url
domain: Ad Creative
range: string

omnichannel link spec
type: Property
comment: The specification for the ad creative's omnichannel link.
alternate name: omnichannel_link_spec
sub property of: omnichannel link spec
domain: Ad Creative
range: Ad Creative Omnichannel Link Spec

page welcome message
type: Property
comment: The welcome message associated with the page represented by the ad creative.
alternate name: page_welcome_message
sub property of: page welcome message
domain: Ad Creative
range: string

photo album source object story id
type: Property
comment: The identifier of the source story object for the photo album used by the ad creative.
alternate name: photo_album_source_object_story_id
sub property of: photo album source object story id
domain: Ad Creative
range: string

place page set id
type: Property
comment: The identifier of the place page set associated with the ad creative.
alternate name: place_page_set_id
sub property of: place page set id
domain: Ad Creative
range: string

platform customizations
type: Property
comment: Platform-specific customizations for the ad creative.
alternate name: platform_customizations
sub property of: platform customizations
domain: Ad Creative
range: Ad Creative Platform Customization

playable asset id
type: Property
comment: The identifier of the playable asset associated with the ad creative.
alternate name: playable_asset_id
sub property of: playable asset id
domain: Ad Creative
range: string

portrait customizations
type: Property
comment: Portrait-format customizations for the ad creative.
alternate name: portrait_customizations
sub property of: portrait customizations
domain: Ad Creative
range: Ad Creative Portrait Customizations

product data
type: Property
comment: Product data associated with the ad creative.
alternate name: product_data
sub property of: product data
domain: Ad Creative
range: Ad Creative Product Data

product set id
type: Property
comment: The identifier of the product set associated with the ad creative.
alternate name: product_set_id
sub property of: product set id
domain: Ad Creative
range: string

recommender settings
type: Property
comment: Recommendation settings associated with the ad creative.
alternate name: recommender_settings
sub property of: recommender settings
domain: Ad Creative
range: Ad Creative Recommender Settings

regional regulation disclaimer spec
type: Property
comment: The regional regulatory disclaimer specification for the ad creative.
alternate name: regional_regulation_disclaimer_spec
sub property of: regional regulation disclaimer spec
domain: Ad Creative
range: Ad Creative Regional Regulation Disclaimer

source facebook post id
type: Property
comment: The identifier of the Facebook post used as the ad creative's source.
alternate name: source_facebook_post_id
sub property of: source facebook post id
domain: Ad Creative
range: string

source instagram media id
type: Property
comment: The identifier of the Instagram media used as the ad creative's source.
alternate name: source_instagram_media_id
sub property of: source instagram media id
domain: Ad Creative
range: string

status
type: Property
comment: The current status of the ad creative, such as active, deleted, in process, or with issues.
alternate name: status
domain: Ad Creative
range: string
code list: AdCreativeStatus

template url
type: Property
comment: The URL of the template associated with the ad creative.
alternate name: template_url
sub property of: template url
domain: Ad Creative
range: string

template url spec
type: Property
comment: The specification for the template URL associated with the ad creative.
alternate name: template_url_spec
sub property of: template url spec
domain: Ad Creative
range: Ad Creative Template URLSpec

thumbnail id
type: Property
comment: The identifier of the thumbnail associated with the ad creative.
alternate name: thumbnail_id
sub property of: thumbnail id
domain: Ad Creative
range: string

thumbnail url
type: Property
comment: The URL of the thumbnail associated with the ad creative.
alternate name: thumbnail_url
sub property of: thumbnail url
domain: Ad Creative
range: string

title
type: Property
comment: The title of the ad creative.
alternate name: title
sub property of: title
domain: Ad Creative
range: string

url tags
type: Property
comment: The tags associated with URLs in the ad creative.
alternate name: url_tags
sub property of: url tags
domain: Ad Creative
range: string

use page actor override
type: Property
comment: Whether the ad creative uses a page actor override.
alternate name: use_page_actor_override
sub property of: use page actor override
domain: Ad Creative
range: boolean

video id
type: Property
comment: The identifier of the video associated with the ad creative.
alternate name: video_id
domain: Ad Creative
range: string

destination spec
type: Property
comment: The specification for the destination of the ad creative.
alternate name: destination_spec
sub property of: destination spec
domain: Ad Creative
range: Ad Creative Destination Spec
added in version: v24

format transformation spec
type: Property
comment: The format transformation specifications associated with the ad creative.
alternate name: format_transformation_spec
sub property of: format transformation spec
domain: Ad Creative
range: Ad Creative Format Transformation Spec
added in version: v24

media sourcing spec
type: Property
comment: The specification for sourcing media for the ad creative.
alternate name: media_sourcing_spec
sub property of: media sourcing spec
domain: Ad Creative
range: Ad Creative Media Sourcing Spec
added in version: v24

marketing message structured spec
type: Property
comment: The structured specification for the marketing message in the ad creative.
alternate name: marketing_message_structured_spec
sub property of: marketing message structured spec
domain: Ad Creative
range: Ad Creative Marketing Message Structured Spec
added in version: v25

product suggestion settings
type: Property
comment: Settings for product suggestions associated with the ad creative.
alternate name: product_suggestion_settings
sub property of: product suggestion settings
domain: Ad Creative
range: Ad Creative Product Suggestion Settings
added in version: v25

text
type: Property
comment: The text of the ad disclaimer.
alternate name: text
sub property of: text
domain: Ad Creative Ad Disclaimer
range: string

title
type: Property
comment: The title of the ad disclaimer.
alternate name: title
sub property of: title
domain: Ad Creative Ad Disclaimer
range: string

url
type: Property
comment: The URL associated with the ad disclaimer.
alternate name: url
sub property of: url
domain: Ad Creative Ad Disclaimer
range: string

ad formats
type: Property
comment: Represents the ad formats available in the asset feed specification.
alternate name: ad_formats
sub property of: ad formats
domain: Ad Asset Feed Spec
range: string

additional data
type: Property
comment: Represents additional data associated with the asset feed specification.
alternate name: additional_data
sub property of: additional data
domain: Ad Asset Feed Spec
range: Ad Asset Feed Additional Data

app product page id
type: Property
comment: Represents the app product Page identifier in the asset feed specification.
alternate name: app_product_page_id
sub property of: app product page id
domain: Ad Asset Feed Spec
range: string

asset customization rules
type: Property
comment: Represents the asset customization rules in the asset feed specification.
alternate name: asset_customization_rules
sub property of: asset customization rules
domain: Ad Asset Feed Spec
range: Ad Asset Feed Spec Asset Customization Rule

audios
type: Property
comment: Represents audio objects in the asset feed specification.
alternate name: audios
sub property of: audios
domain: Ad Asset Feed Spec
range: JSON

autotranslate
type: Property
comment: Represents the autotranslation information in the asset feed specification.
alternate name: autotranslate
sub property of: autotranslate
domain: Ad Asset Feed Spec
range: string

bodies
type: Property
comment: Represents body-text assets in the asset feed specification.
alternate name: bodies
domain: Ad Asset Feed Spec
range: Ad Asset Feed Spec Body

call ads configuration
type: Property
comment: Represents the call ads configuration in the asset feed specification.
alternate name: call_ads_configuration
sub property of: call ads configuration
domain: Ad Asset Feed Spec
range: JSON

call to action types
type: Property
comment: Represents the call-to-action types available in the asset feed specification.
alternate name: call_to_action_types
sub property of: call to action types
domain: Ad Asset Feed Spec
range: string
code list: AdAssetFeedSpecCallToActionTypes

call to actions
type: Property
comment: Represents call-to-action assets in the asset feed specification.
alternate name: call_to_actions
sub property of: call to actions
domain: Ad Asset Feed Spec
range: Ad Asset Feed Spec Call To Action

captions
type: Property
comment: Represents caption assets in the asset feed specification.
alternate name: captions
sub property of: captions
domain: Ad Asset Feed Spec
range: Ad Asset Feed Spec Caption

carousels
type: Property
comment: Represents carousel assets in the asset feed specification.
alternate name: carousels
sub property of: carousels
domain: Ad Asset Feed Spec
range: Ad Asset Feed Spec Carousel

ctwa consent data
type: Property
comment: Represents click-to-WhatsApp consent data in the asset feed specification.
alternate name: ctwa_consent_data
sub property of: ctwa consent data
domain: Ad Asset Feed Spec
range: JSON

descriptions
type: Property
comment: Represents description assets in the asset feed specification.
alternate name: descriptions
domain: Ad Asset Feed Spec
range: Ad Asset Feed Spec Description

events
type: Property
comment: Represents event assets in the asset feed specification.
alternate name: events
sub property of: events
domain: Ad Asset Feed Spec
range: Ad Asset Feed Spec Events

groups
type: Property
comment: Represents group rules in the asset feed specification.
alternate name: groups
domain: Ad Asset Feed Spec
range: Ad Asset Feed Spec Group Rule

images
type: Property
comment: Represents image assets in the asset feed specification.
alternate name: images
domain: Ad Asset Feed Spec
range: Ad Asset Feed Spec Image

link urls
type: Property
comment: Represents link URL assets in the asset feed specification.
alternate name: link_urls
sub property of: link urls
domain: Ad Asset Feed Spec
range: Ad Asset Feed Spec Link Url

message extensions
type: Property
comment: Represents message extensions in the asset feed specification.
alternate name: message_extensions
sub property of: message extensions
domain: Ad Asset Feed Spec
range: Ad Asset Message Extensions

onsite destinations
type: Property
comment: Represents onsite destinations in the asset feed specification.
alternate name: onsite_destinations
sub property of: onsite destinations
domain: Ad Asset Feed Spec
range: Ad Asset Onsite Destinations

optimization type
type: Property
comment: Represents the optimization type in the asset feed specification.
alternate name: optimization_type
sub property of: optimization type
domain: Ad Asset Feed Spec
range: string

promotional metadata
type: Property
comment: Represents promotional metadata in the asset feed specification.
alternate name: promotional_metadata
sub property of: promotional metadata
domain: Ad Asset Feed Spec
range: JSON

reasons to shop
type: Property
comment: Indicates whether reasons to shop are included in the asset feed specification.
alternate name: reasons_to_shop
sub property of: reasons to shop
domain: Ad Asset Feed Spec
range: boolean

shops bundle
type: Property
comment: Indicates whether a Shops bundle is included in the asset feed specification.
alternate name: shops_bundle
sub property of: shops bundle
domain: Ad Asset Feed Spec
range: boolean

titles
type: Property
comment: Represents title assets in the asset feed specification.
alternate name: titles
domain: Ad Asset Feed Spec
range: Ad Asset Feed Spec Title

translations
type: Property
comment: Represents translation objects in the asset feed specification.
alternate name: translations
sub property of: translations
domain: Ad Asset Feed Spec
range: JSON

upcoming events
type: Property
comment: Represents upcoming event objects in the asset feed specification.
alternate name: upcoming_events
sub property of: upcoming events
domain: Ad Asset Feed Spec
range: JSON

videos
type: Property
comment: Represents video assets in the asset feed specification.
alternate name: videos
domain: Ad Asset Feed Spec
range: Ad Asset Feed Spec Video

web destination spec
type: Property
comment: Represents the web destination specification in the asset feed specification.
alternate name: web_destination_spec
sub property of: web destination spec
domain: Ad Asset Feed Spec
range: JSON

automated product tags
type: Property
comment: Indicates whether automated product tags are included in the additional ad asset data.
alternate name: automated_product_tags
sub property of: automated product tags
domain: Ad Asset Feed Additional Data
range: boolean

brand page id
type: Property
comment: Represents the identifier of the brand Page in the additional ad asset data.
alternate name: brand_page_id
sub property of: brand page id
domain: Ad Asset Feed Additional Data
range: string

is click to message
type: Property
comment: Indicates whether the additional ad asset data is for click-to-message.
alternate name: is_click_to_message
sub property of: is click to message
domain: Ad Asset Feed Additional Data
range: boolean

multi share end card
type: Property
comment: Indicates whether the additional ad asset data includes a multi-share end card.
alternate name: multi_share_end_card
sub property of: multi share end card
domain: Ad Asset Feed Additional Data
range: boolean

page welcome message
type: Property
comment: Represents the Page welcome message in the additional ad asset data.
alternate name: page_welcome_message
sub property of: page welcome message
domain: Ad Asset Feed Additional Data
range: string

partner app welcome message flow id
type: Property
comment: Represents the partner app welcome-message flow identifier in the additional ad asset data.
alternate name: partner_app_welcome_message_flow_id
sub property of: partner app welcome message flow id
domain: Ad Asset Feed Additional Data
range: string

body label
type: Property
comment: Represents the asset label assigned to the body in the customization rule.
alternate name: body_label
sub property of: body label
domain: Ad Asset Feed Spec Asset Customization Rule
range: Ad Asset Feed Spec Asset Label

call to action label
type: Property
comment: Represents the asset label assigned to the call to action in the customization rule.
alternate name: call_to_action_label
sub property of: call to action label
domain: Ad Asset Feed Spec Asset Customization Rule
range: Ad Asset Feed Spec Asset Label

call to action type label
type: Property
comment: Represents the asset label assigned to the call-to-action type in the customization rule.
alternate name: call_to_action_type_label
sub property of: call to action type label
domain: Ad Asset Feed Spec Asset Customization Rule
range: Ad Asset Feed Spec Asset Label

caption label
type: Property
comment: Represents the asset label assigned to the caption in the customization rule.
alternate name: caption_label
sub property of: caption label
domain: Ad Asset Feed Spec Asset Customization Rule
range: Ad Asset Feed Spec Asset Label

carousel label
type: Property
comment: Represents the asset label assigned to the carousel in the customization rule.
alternate name: carousel_label
sub property of: carousel label
domain: Ad Asset Feed Spec Asset Customization Rule
range: Ad Asset Feed Spec Asset Label

customization spec
type: Property
comment: Represents the customization specification for the asset customization rule.
alternate name: customization_spec
domain: Ad Asset Feed Spec Asset Customization Rule
range: Ad Asset Customization Rule Customization Spec

description label
type: Property
comment: Represents the asset label assigned to the description in the customization rule.
alternate name: description_label
sub property of: description label
domain: Ad Asset Feed Spec Asset Customization Rule
range: Ad Asset Feed Spec Asset Label

image label
type: Property
comment: Represents the asset label assigned to the image in the customization rule.
alternate name: image_label
sub property of: image label
domain: Ad Asset Feed Spec Asset Customization Rule
range: Ad Asset Feed Spec Asset Label

is default
type: Property
comment: Indicates whether the asset customization rule is the default rule.
alternate name: is_default
sub property of: is default
domain: Ad Asset Feed Spec Asset Customization Rule
range: boolean

link url label
type: Property
comment: Represents the asset label assigned to the link URL in the customization rule.
alternate name: link_url_label
sub property of: link url label
domain: Ad Asset Feed Spec Asset Customization Rule
range: Ad Asset Feed Spec Asset Label

priority
type: Property
comment: Represents the priority of the asset customization rule.
alternate name: priority
domain: Ad Asset Feed Spec Asset Customization Rule
range: int

title label
type: Property
comment: Represents the asset label assigned to the title in the customization rule.
alternate name: title_label
sub property of: title label
domain: Ad Asset Feed Spec Asset Customization Rule
range: Ad Asset Feed Spec Asset Label

video label
type: Property
comment: Represents the asset label assigned to the video in the customization rule.
alternate name: video_label
sub property of: video label
domain: Ad Asset Feed Spec Asset Customization Rule
range: Ad Asset Feed Spec Asset Label

id
type: Property
comment: Represents the identifier of an ad asset label.
alternate name: id
sub property of: id
domain: Ad Asset Feed Spec Asset Label
range: string

name
type: Property
comment: Represents the name of an ad asset label.
alternate name: name
sub property of: name
domain: Ad Asset Feed Spec Asset Label
range: string

age max
type: Property
comment: Represents the maximum age in the customization specification.
alternate name: age_max
sub property of: age max
domain: Ad Asset Customization Rule Customization Spec
range: unsignedInt

age min
type: Property
comment: Represents the minimum age in the customization specification.
alternate name: age_min
sub property of: age min
domain: Ad Asset Customization Rule Customization Spec
range: unsignedInt

audience network positions
type: Property
comment: Represents the Audience Network positions in the customization specification.
alternate name: audience_network_positions
sub property of: audience network positions
domain: Ad Asset Customization Rule Customization Spec
range: string

device platforms
type: Property
comment: Represents the device platforms targeted by the customization specification, including desktop or mobile.
alternate name: device_platforms
sub property of: device platforms
domain: Ad Asset Customization Rule Customization Spec
range: string
code list: AdAssetCustomizationRuleCustomizationSpecDevicePlatforms

facebook positions
type: Property
comment: Represents the Facebook positions in the customization specification.
alternate name: facebook_positions
sub property of: facebook positions
domain: Ad Asset Customization Rule Customization Spec
range: string

geo locations
type: Property
comment: Represents the geographic locations in the customization specification.
alternate name: geo_locations
sub property of: geo locations
domain: Ad Asset Customization Rule Customization Spec
range: Targeting Geo Location

instagram positions
type: Property
comment: Represents the Instagram positions in the customization specification.
alternate name: instagram_positions
sub property of: instagram positions
domain: Ad Asset Customization Rule Customization Spec
range: string

locales
type: Property
comment: Represents the locales in the customization specification.
alternate name: locales
sub property of: locales
domain: Ad Asset Customization Rule Customization Spec
range: unsignedInt

messenger positions
type: Property
comment: Represents the Messenger positions in the customization specification.
alternate name: messenger_positions
sub property of: messenger positions
domain: Ad Asset Customization Rule Customization Spec
range: string

publisher platforms
type: Property
comment: Represents the publisher platforms in the customization specification.
alternate name: publisher_platforms
sub property of: publisher platforms
domain: Ad Asset Customization Rule Customization Spec
range: string

threads positions
type: Property
comment: Represents the Threads positions in the customization specification.
alternate name: threads_positions
sub property of: threads positions
domain: Ad Asset Customization Rule Customization Spec
range: string

adlabels
type: Property
comment: Represents the ad asset labels associated with the body.
alternate name: adlabels
domain: Ad Asset Feed Spec Body
range: Ad Asset Feed Spec Asset Label

text
type: Property
comment: Represents the body text.
alternate name: text
sub property of: text
domain: Ad Asset Feed Spec Body
range: string

url tags
type: Property
comment: Represents the URL tags associated with the body.
alternate name: url_tags
sub property of: url tags
domain: Ad Asset Feed Spec Body
range: string

adlabels
type: Property
comment: Represents the ad asset labels associated with the call to action.
alternate name: adlabels
domain: Ad Asset Feed Spec Call To Action
range: Ad Asset Feed Spec Asset Label

type
type: Property
comment: Represents the type of the call to action.
alternate name: type
domain: Ad Asset Feed Spec Call To Action
range: string

value
type: Property
comment: Represents the value associated with the call to action.
alternate name: value
domain: Ad Asset Feed Spec Call To Action
range: Ad Creative Link Data Call To Action Value

android url
type: Property
comment: Contains the URL associated with the Android destination.
alternate name: android_url
sub property of: android url
domain: Ad Creative Link Data Call To Action Value
range: string

app destination
type: Property
comment: Specifies the destination within an application.
alternate name: app_destination
sub property of: app destination
domain: Ad Creative Link Data Call To Action Value
range: string

app link
type: Property
comment: Contains the app link associated with the call-to-action destination.
alternate name: app_link
sub property of: app link
domain: Ad Creative Link Data Call To Action Value
range: string

application
type: Property
comment: Identifies the application associated with the call-to-action destination.
alternate name: application
domain: Ad Creative Link Data Call To Action Value
range: string

event id
type: Property
comment: Identifies the event associated with the call-to-action destination.
alternate name: event_id
sub property of: event id
domain: Ad Creative Link Data Call To Action Value
range: string

ios url
type: Property
comment: Contains the URL associated with the iOS destination.
alternate name: ios_url
sub property of: ios url
domain: Ad Creative Link Data Call To Action Value
range: string

land on whatsapp catalog
type: Property
comment: Specifies whether the destination lands on a WhatsApp catalog.
alternate name: land_on_whatsapp_catalog
sub property of: land on whatsapp catalog
domain: Ad Creative Link Data Call To Action Value
range: int

land on whatsapp profile
type: Property
comment: Specifies whether the destination lands on a WhatsApp profile.
alternate name: land_on_whatsapp_profile
sub property of: land on whatsapp profile
domain: Ad Creative Link Data Call To Action Value
range: int

lead gen form id
type: Property
comment: Identifies the lead-generation form associated with the call to action.
alternate name: lead_gen_form_id
sub property of: lead gen form id
domain: Ad Creative Link Data Call To Action Value
range: string

link
type: Property
comment: Contains the link associated with the call-to-action destination.
alternate name: link
sub property of: link
domain: Ad Creative Link Data Call To Action Value
range: string

link caption
type: Property
comment: Contains the caption for the call-to-action link.
alternate name: link_caption
sub property of: link caption
domain: Ad Creative Link Data Call To Action Value
range: string

link format
type: Property
comment: Specifies the format of the call-to-action link.
alternate name: link_format
sub property of: link format
domain: Ad Creative Link Data Call To Action Value
range: string

object store urls
type: Property
comment: Contains object-store URLs associated with the call-to-action value.
alternate name: object_store_urls
sub property of: object store urls
domain: Ad Creative Link Data Call To Action Value
range: string

page
type: Property
comment: Identifies the Page associated with the call-to-action destination.
alternate name: page
domain: Ad Creative Link Data Call To Action Value
range: string

product link
type: Property
comment: Contains the product link associated with the call to action.
alternate name: product_link
sub property of: product link
domain: Ad Creative Link Data Call To Action Value
range: string

whatsapp number
type: Property
comment: Contains the WhatsApp number associated with the call-to-action destination.
alternate name: whatsapp_number
sub property of: whatsapp number
domain: Ad Creative Link Data Call To Action Value
range: string

adlabels
type: Property
comment: Represents the ad asset labels associated with the caption.
alternate name: adlabels
domain: Ad Asset Feed Spec Caption
range: Ad Asset Feed Spec Asset Label

text
type: Property
comment: Represents the caption text.
alternate name: text
sub property of: text
domain: Ad Asset Feed Spec Caption
range: string

url tags
type: Property
comment: Represents the URL tags associated with the caption.
alternate name: url_tags
sub property of: url tags
domain: Ad Asset Feed Spec Caption
range: string

adlabels
type: Property
comment: Represents the ad asset labels associated with the carousel.
alternate name: adlabels
domain: Ad Asset Feed Spec Carousel
range: Ad Asset Feed Spec Asset Label

child attachments
type: Property
comment: Represents the child attachments in the carousel.
alternate name: child_attachments
domain: Ad Asset Feed Spec Carousel
range: Ad Asset Feed Spec Carousel Child Attachment

multi share end card
type: Property
comment: Indicates whether the carousel includes a multi-share end card.
alternate name: multi_share_end_card
sub property of: multi share end card
domain: Ad Asset Feed Spec Carousel
range: boolean

multi share optimized
type: Property
comment: Indicates whether the carousel is optimized for multi-share.
alternate name: multi_share_optimized
sub property of: multi share optimized
domain: Ad Asset Feed Spec Carousel
range: boolean

body label
type: Property
comment: Represents the asset label assigned to the child attachment's body.
alternate name: body_label
sub property of: body label
domain: Ad Asset Feed Spec Carousel Child Attachment
range: Ad Asset Feed Spec Asset Label

call to action type label
type: Property
comment: Represents the asset label assigned to the child attachment's call-to-action type.
alternate name: call_to_action_type_label
sub property of: call to action type label
domain: Ad Asset Feed Spec Carousel Child Attachment
range: Ad Asset Feed Spec Asset Label

caption label
type: Property
comment: Represents the asset label assigned to the child attachment's caption.
alternate name: caption_label
sub property of: caption label
domain: Ad Asset Feed Spec Carousel Child Attachment
range: Ad Asset Feed Spec Asset Label

description label
type: Property
comment: Represents the asset label assigned to the child attachment's description.
alternate name: description_label
sub property of: description label
domain: Ad Asset Feed Spec Carousel Child Attachment
range: Ad Asset Feed Spec Asset Label

image label
type: Property
comment: Represents the asset label assigned to the child attachment's image.
alternate name: image_label
sub property of: image label
domain: Ad Asset Feed Spec Carousel Child Attachment
range: Ad Asset Feed Spec Asset Label

link url label
type: Property
comment: Represents the asset label assigned to the child attachment's link URL.
alternate name: link_url_label
sub property of: link url label
domain: Ad Asset Feed Spec Carousel Child Attachment
range: Ad Asset Feed Spec Asset Label

phone data ids label
type: Property
comment: Represents the asset label assigned to the child attachment's phone data identifiers.
alternate name: phone_data_ids_label
sub property of: phone data ids label
domain: Ad Asset Feed Spec Carousel Child Attachment
range: Ad Asset Feed Spec Asset Label

static card
type: Property
comment: Indicates whether the carousel child attachment is static.
alternate name: static_card
sub property of: static card
domain: Ad Asset Feed Spec Carousel Child Attachment
range: boolean

title label
type: Property
comment: Identifies the asset label associated with the carousel child attachment's title.
alternate name: title_label
sub property of: title label
domain: Ad Asset Feed Spec Carousel Child Attachment
range: Ad Asset Feed Spec Asset Label

video label
type: Property
comment: Identifies the asset label associated with the carousel child attachment's video.
alternate name: video_label
sub property of: video label
domain: Ad Asset Feed Spec Carousel Child Attachment
range: Ad Asset Feed Spec Asset Label

adlabels
type: Property
comment: Lists the asset labels associated with the description.
alternate name: adlabels
domain: Ad Asset Feed Spec Description
range: Ad Asset Feed Spec Asset Label

text
type: Property
comment: Contains the description text.
alternate name: text
sub property of: text
domain: Ad Asset Feed Spec Description
range: string

url tags
type: Property
comment: Contains URL tags associated with the description.
alternate name: url_tags
sub property of: url tags
domain: Ad Asset Feed Spec Description
range: string

id
type: Property
comment: Identifies the event in the asset feed specification.
alternate name: id
sub property of: id
domain: Ad Asset Feed Spec Events
range: string

body label
type: Property
comment: Identifies the asset label used for the body in the group rule.
alternate name: body_label
sub property of: body label
domain: Ad Asset Feed Spec Group Rule
range: Ad Asset Feed Spec Asset Label

caption label
type: Property
comment: Identifies the asset label used for the caption in the group rule.
alternate name: caption_label
sub property of: caption label
domain: Ad Asset Feed Spec Group Rule
range: Ad Asset Feed Spec Asset Label

description label
type: Property
comment: Identifies the asset label used for the description in the group rule.
alternate name: description_label
sub property of: description label
domain: Ad Asset Feed Spec Group Rule
range: Ad Asset Feed Spec Asset Label

image label
type: Property
comment: Identifies the asset label used for the image in the group rule.
alternate name: image_label
sub property of: image label
domain: Ad Asset Feed Spec Group Rule
range: Ad Asset Feed Spec Asset Label

link url label
type: Property
comment: Identifies the asset label used for the link URL in the group rule.
alternate name: link_url_label
sub property of: link url label
domain: Ad Asset Feed Spec Group Rule
range: Ad Asset Feed Spec Asset Label

title label
type: Property
comment: Identifies the asset label used for the title in the group rule.
alternate name: title_label
sub property of: title label
domain: Ad Asset Feed Spec Group Rule
range: Ad Asset Feed Spec Asset Label

video label
type: Property
comment: Identifies the asset label used for the video in the group rule.
alternate name: video_label
sub property of: video label
domain: Ad Asset Feed Spec Group Rule
range: Ad Asset Feed Spec Asset Label

adlabels
type: Property
comment: Lists the asset labels associated with the image.
alternate name: adlabels
domain: Ad Asset Feed Spec Image
range: Ad Asset Feed Spec Asset Label

hash
type: Property
comment: Contains the hash associated with the image.
alternate name: hash
sub property of: hash
domain: Ad Asset Feed Spec Image
range: string

image crops
type: Property
comment: Contains the crop information associated with the image.
alternate name: image_crops
sub property of: image crops
domain: Ad Asset Feed Spec Image
range: Ads Image Crops

url
type: Property
comment: Contains the image URL.
alternate name: url
sub property of: url
domain: Ad Asset Feed Spec Image
range: string

url tags
type: Property
comment: Contains URL tags associated with the image.
alternate name: url_tags
sub property of: url tags
domain: Ad Asset Feed Spec Image
range: string

100x100
type: Property
comment: Represents image crop data for the 100x100 variant.
alternate name: 100x100
sub property of: 100x100
domain: Ads Image Crops
range: JSON

100x72
type: Property
comment: Represents image crop data for the 100x72 variant.
alternate name: 100x72
sub property of: 100x72
domain: Ads Image Crops
range: JSON

191x100
type: Property
comment: Represents image crop data for the 191x100 variant.
alternate name: 191x100
sub property of: 191x100
domain: Ads Image Crops
range: JSON

300x400
type: Property
comment: Represents image crop data for the 300x400 variant.
alternate name: 300x400
sub property of: 300x400
domain: Ads Image Crops
range: JSON

400x150
type: Property
comment: Represents image crop data for the 400x150 variant.
alternate name: 400x150
sub property of: 400x150
domain: Ads Image Crops
range: JSON

400x500
type: Property
comment: Represents image crop data for the 400x500 variant.
alternate name: 400x500
sub property of: 400x500
domain: Ads Image Crops
range: JSON

600x360
type: Property
comment: Represents image crop data for the 600x360 variant.
alternate name: 600x360
sub property of: 600x360
domain: Ads Image Crops
range: JSON

90x160
type: Property
comment: Represents image crop data for the 90x160 variant.
alternate name: 90x160
sub property of: 90x160
domain: Ads Image Crops
range: JSON

adlabels
type: Property
comment: Lists the asset labels associated with the link URL.
alternate name: adlabels
domain: Ad Asset Feed Spec Link Url
range: Ad Asset Feed Spec Asset Label

android url
type: Property
comment: Contains the Android URL associated with the link.
alternate name: android_url
sub property of: android url
domain: Ad Asset Feed Spec Link Url
range: string

carousel see more url
type: Property
comment: Contains the see-more URL associated with the carousel link.
alternate name: carousel_see_more_url
sub property of: carousel see more url
domain: Ad Asset Feed Spec Link Url
range: string

deeplink url
type: Property
comment: Contains the deep link URL associated with the link.
alternate name: deeplink_url
sub property of: deeplink url
domain: Ad Asset Feed Spec Link Url
range: string

display url
type: Property
comment: Contains the display URL associated with the link.
alternate name: display_url
sub property of: display url
domain: Ad Asset Feed Spec Link Url
range: string

ios url
type: Property
comment: Contains the iOS URL associated with the link.
alternate name: ios_url
sub property of: ios url
domain: Ad Asset Feed Spec Link Url
range: string

object store urls
type: Property
comment: Lists the object-store URLs associated with the link.
alternate name: object_store_urls
sub property of: object store urls
domain: Ad Asset Feed Spec Link Url
range: string

url tags
type: Property
comment: Contains URL tags associated with the link.
alternate name: url_tags
sub property of: url tags
domain: Ad Asset Feed Spec Link Url
range: string

website url
type: Property
comment: Contains the website URL associated with the link.
alternate name: website_url
sub property of: website url
domain: Ad Asset Feed Spec Link Url
range: string

type
type: Property
comment: Identifies the type of message extension.
alternate name: type
domain: Ad Asset Message Extensions
range: string

auto optimization
type: Property
comment: Contains the auto-optimization setting for the onsite destination.
alternate name: auto_optimization
sub property of: auto optimization
domain: Ad Asset Onsite Destinations
range: string

details page product id
type: Property
comment: Identifies the product for the onsite details page.
alternate name: details_page_product_id
sub property of: details page product id
domain: Ad Asset Onsite Destinations
range: string

shop collection product set id
type: Property
comment: Identifies the product set for the shop collection.
alternate name: shop_collection_product_set_id
sub property of: shop collection product set id
domain: Ad Asset Onsite Destinations
range: string

source
type: Property
comment: Identifies the source of the onsite destination.
alternate name: source
sub property of: source
domain: Ad Asset Onsite Destinations
range: string

storefront shop id
type: Property
comment: Identifies the storefront shop associated with the onsite destination.
alternate name: storefront_shop_id
sub property of: storefront shop id
domain: Ad Asset Onsite Destinations
range: string

adlabels
type: Property
comment: Lists the asset labels associated with the title.
alternate name: adlabels
domain: Ad Asset Feed Spec Title
range: Ad Asset Feed Spec Asset Label

text
type: Property
comment: Contains the title text.
alternate name: text
sub property of: text
domain: Ad Asset Feed Spec Title
range: string

url tags
type: Property
comment: Contains URL tags associated with the title.
alternate name: url_tags
sub property of: url tags
domain: Ad Asset Feed Spec Title
range: string

adlabels
type: Property
comment: Lists the asset labels associated with the video.
alternate name: adlabels
domain: Ad Asset Feed Spec Video
range: Ad Asset Feed Spec Asset Label

caption ids
type: Property
comment: Lists the caption identifiers associated with the video.
alternate name: caption_ids
sub property of: caption ids
domain: Ad Asset Feed Spec Video
range: string

thumbnail hash
type: Property
comment: Contains the hash associated with the video's thumbnail.
alternate name: thumbnail_hash
sub property of: thumbnail hash
domain: Ad Asset Feed Spec Video
range: string

thumbnail url
type: Property
comment: Contains the URL of the video's thumbnail.
alternate name: thumbnail_url
sub property of: thumbnail url
domain: Ad Asset Feed Spec Video
range: string

url tags
type: Property
comment: Contains URL tags associated with the video.
alternate name: url_tags
sub property of: url tags
domain: Ad Asset Feed Spec Video
range: string

video id
type: Property
comment: Identifies the video.
alternate name: video_id
domain: Ad Asset Feed Spec Video
range: string

acting business id
type: Property
comment: The identifier of the business acting in the branded-content ad.
alternate name: acting_business_id
sub property of: acting business id
domain: Ad Creative Branded Content Ads
range: string

ad format
type: Property
comment: The format designation of the branded-content ad.
alternate name: ad_format
sub property of: ad format
domain: Ad Creative Branded Content Ads
range: int

automated adgroup creation
type: Property
comment: Whether automated ad-group creation is specified for the branded-content ad.
alternate name: automated_adgroup_creation
sub property of: automated adgroup creation
domain: Ad Creative Branded Content Ads
range: boolean

content search input
type: Property
comment: The content search input associated with the branded-content ad.
alternate name: content_search_input
sub property of: content search input
domain: Ad Creative Branded Content Ads
range: string

creator ad permission type
type: Property
comment: The type of ad permission associated with the creator of the branded-content ad.
alternate name: creator_ad_permission_type
sub property of: creator ad permission type
domain: Ad Creative Branded Content Ads
range: string

deliver dynamic partner content
type: Property
comment: Whether dynamic partner content is specified for delivery in the branded-content ad.
alternate name: deliver_dynamic_partner_content
sub property of: deliver dynamic partner content
domain: Ad Creative Branded Content Ads
range: boolean

facebook boost post access token
type: Property
comment: The access token associated with boosting the Facebook post for the branded-content ad.
alternate name: facebook_boost_post_access_token
sub property of: facebook boost post access token
domain: Ad Creative Branded Content Ads
range: string

instagram boost post access token
type: Property
comment: The access token associated with boosting the Instagram post for the branded-content ad.
alternate name: instagram_boost_post_access_token
sub property of: instagram boost post access token
domain: Ad Creative Branded Content Ads
range: string

is mca internal
type: Property
comment: Whether the branded-content ad is marked as internal to MCA.
alternate name: is_mca_internal
sub property of: is mca internal
domain: Ad Creative Branded Content Ads
range: boolean

parent source facebook post id
type: Property
comment: The identifier of the parent Facebook post used as a source for the branded-content ad.
alternate name: parent_source_facebook_post_id
sub property of: parent source facebook post id
domain: Ad Creative Branded Content Ads
range: string

parent source instagram media id
type: Property
comment: The identifier of the parent Instagram media used as a source for the branded-content ad.
alternate name: parent_source_instagram_media_id
sub property of: parent source instagram media id
domain: Ad Creative Branded Content Ads
range: string

partners
type: Property
comment: The partners associated with the branded-content ad.
alternate name: partners
sub property of: partners
domain: Ad Creative Branded Content Ads
range: Ad Creative Branded Content Ads Partners

product set partner selection status
type: Property
comment: The partner-selection status for the product set associated with the branded-content ad.
alternate name: product_set_partner_selection_status
sub property of: product set partner selection status
domain: Ad Creative Branded Content Ads
range: string

promoted page id
type: Property
comment: The identifier of the page promoted by the branded-content ad.
alternate name: promoted_page_id
sub property of: promoted page id
domain: Ad Creative Branded Content Ads
range: string

testimonial
type: Property
comment: The testimonial associated with the branded-content ad.
alternate name: testimonial
sub property of: testimonial
domain: Ad Creative Branded Content Ads
range: string

testimonial locale
type: Property
comment: The locale of the testimonial associated with the branded-content ad.
alternate name: testimonial_locale
sub property of: testimonial locale
domain: Ad Creative Branded Content Ads
range: string

ui version
type: Property
comment: The user-interface version specified for the branded-content ad.
alternate name: ui_version
sub property of: ui version
domain: Ad Creative Branded Content Ads
range: int

fb page id
type: Property
comment: The identifier of the partner's Facebook page.
alternate name: fb_page_id
sub property of: fb page id
domain: Ad Creative Branded Content Ads Partners
range: string

has create ads access
type: Property
comment: Whether the partner has create-ads access.
alternate name: has_create_ads_access
sub property of: has create ads access
domain: Ad Creative Branded Content Ads Partners
range: boolean

identity type
type: Property
comment: The identity type of the branded-content ad partner.
alternate name: identity_type
sub property of: identity type
domain: Ad Creative Branded Content Ads Partners
range: string

ig asset id
type: Property
comment: The identifier of the partner's Instagram asset.
alternate name: ig_asset_id
sub property of: ig asset id
domain: Ad Creative Branded Content Ads Partners
range: string

ig user id
type: Property
comment: The identifier of the partner's Instagram user.
alternate name: ig_user_id
sub property of: ig user id
domain: Ad Creative Branded Content Ads Partners
range: string

type
type: Property
comment: Specifies the call-to-action action, such as buying, signing up, learning more, or opening a link.
alternate name: type
domain: Ad Creative Link Data Call To Action
range: string
code list: AdCreativeLinkDataCallToActionType

value
type: Property
comment: Contains the destination and related configuration for the call to action.
alternate name: value
domain: Ad Creative Link Data Call To Action
range: Ad Creative Link Data Call To Action Value

enroll status
type: Property
comment: The enrollment status for contextual multi-ads.
alternate name: enroll_status
sub property of: enroll status
domain: Ad Creative Contextual Multi Ads
range: string

ad extensions relevancy spec
type: Property
comment: Represents the relevancy specification for ad extensions.
alternate name: ad_extensions_relevancy_spec
sub property of: ad extensions relevancy spec
domain: Ad Creative Sourcing Spec
range: JSON

associated product set id
type: Property
comment: Identifies the product set associated with the sourcing specification.
alternate name: associated_product_set_id
sub property of: associated product set id
domain: Ad Creative Sourcing Spec
range: string

brand
type: Property
comment: Represents the brand associated with the sourcing specification.
alternate name: brand
sub property of: brand
domain: Ad Creative Sourcing Spec
range: JSON

destination screenshot spec
type: Property
comment: Represents the destination screenshot specification.
alternate name: destination_screenshot_spec
sub property of: destination screenshot spec
domain: Ad Creative Sourcing Spec
range: JSON

duplication source
type: Property
comment: Identifies the source of the duplicated creative.
alternate name: duplication_source
sub property of: duplication source
domain: Ad Creative Sourcing Spec
range: string

dynamic site links spec
type: Property
comment: Represents the specification for dynamic site links.
alternate name: dynamic_site_links_spec
sub property of: dynamic site links spec
domain: Ad Creative Sourcing Spec
range: JSON

enable social feedback preservation
type: Property
comment: Indicates whether social feedback preservation is enabled.
alternate name: enable_social_feedback_preservation
sub property of: enable social feedback preservation
domain: Ad Creative Sourcing Spec
range: boolean

featured offering spec
type: Property
comment: Represents the featured offering specification.
alternate name: featured_offering_spec
sub property of: featured offering spec
domain: Ad Creative Sourcing Spec
range: JSON

intent
type: Property
comment: Represents the intent associated with the sourcing specification.
alternate name: intent
sub property of: intent
domain: Ad Creative Sourcing Spec
range: JSON

ncs testimonial
type: Property
comment: Represents the NCS testimonial associated with the sourcing specification.
alternate name: ncs_testimonial
sub property of: ncs testimonial
domain: Ad Creative Sourcing Spec
range: JSON

pca spec
type: Property
comment: Represents the PCA specification.
alternate name: pca_spec
sub property of: pca spec
domain: Ad Creative Sourcing Spec
range: JSON

product media metadata spec
type: Property
comment: Represents metadata for product media.
alternate name: product_media_metadata_spec
sub property of: product media metadata spec
domain: Ad Creative Sourcing Spec
range: JSON

promotion metadata spec
type: Property
comment: Contains promotion metadata for the sourcing specification.
alternate name: promotion_metadata_spec
sub property of: promotion metadata spec
domain: Ad Creative Sourcing Spec
range: Ad Creative Promotion Metadata Spec

site links data consented
type: Property
comment: Represents consent for site links data.
alternate name: site_links_data_consented
sub property of: site links data consented
domain: Ad Creative Sourcing Spec
range: JSON

site links spec
type: Property
comment: Contains site link specifications for the sourcing specification.
alternate name: site_links_spec
sub property of: site links spec
domain: Ad Creative Sourcing Spec
range: Ad Creative Site Links Spec

source url
type: Property
comment: Contains the source URL for the sourcing specification.
alternate name: source_url
sub property of: source url
domain: Ad Creative Sourcing Spec
range: string

website media spec
type: Property
comment: Represents the website media specification.
alternate name: website_media_spec
sub property of: website media spec
domain: Ad Creative Sourcing Spec
range: JSON

website summary spec
type: Property
comment: Represents the website summary specification.
alternate name: website_summary_spec
sub property of: website summary spec
domain: Ad Creative Sourcing Spec
range: JSON

end date
type: Property
comment: Represents the end date of the promotion.
alternate name: end_date
sub property of: end date
domain: Ad Creative Promotion Metadata Spec
range: int

id
type: Property
comment: Identifies the promotion.
alternate name: id
sub property of: id
domain: Ad Creative Promotion Metadata Spec
range: string

promotion source
type: Property
comment: Identifies the source of the promotion.
alternate name: promotion_source
sub property of: promotion source
domain: Ad Creative Promotion Metadata Spec
range: string

promotion type
type: Property
comment: Identifies the type of the promotion.
alternate name: promotion_type
sub property of: promotion type
domain: Ad Creative Promotion Metadata Spec
range: string

promotion value
type: Property
comment: Represents the value of the promotion.
alternate name: promotion_value
sub property of: promotion value
domain: Ad Creative Promotion Metadata Spec
range: double

required code
type: Property
comment: Contains the code required for the promotion.
alternate name: required_code
sub property of: required code
domain: Ad Creative Promotion Metadata Spec
range: string

start date
type: Property
comment: Represents the start date of the promotion.
alternate name: start_date
domain: Ad Creative Promotion Metadata Spec
range: int

is defaulting eligible
type: Property
comment: Indicates whether the site link is eligible for defaulting.
alternate name: is_defaulting_eligible
sub property of: is defaulting eligible
domain: Ad Creative Site Links Spec
range: boolean

is site link sticky
type: Property
comment: Indicates whether the site link is sticky.
alternate name: is_site_link_sticky
sub property of: is site link sticky
domain: Ad Creative Site Links Spec
range: boolean

site link classification
type: Property
comment: Identifies the classification of the site link.
alternate name: site_link_classification
sub property of: site link classification
domain: Ad Creative Site Links Spec
range: string

site link extra metadata
type: Property
comment: Contains extra metadata for the site link.
alternate name: site_link_extra_metadata
sub property of: site link extra metadata
domain: Ad Creative Site Links Spec
range: string

site link hash
type: Property
comment: Identifies the site link by its hash.
alternate name: site_link_hash
sub property of: site link hash
domain: Ad Creative Site Links Spec
range: string

site link id
type: Property
comment: Identifies the site link.
alternate name: site_link_id
sub property of: site link id
domain: Ad Creative Site Links Spec
range: string

site link image hash
type: Property
comment: Identifies the image associated with the site link by its hash.
alternate name: site_link_image_hash
sub property of: site link image hash
domain: Ad Creative Site Links Spec
range: string

site link image url
type: Property
comment: Contains the URL of the image associated with the site link.
alternate name: site_link_image_url
sub property of: site link image url
domain: Ad Creative Site Links Spec
range: string

site link language
type: Property
comment: Identifies the language of the site link.
alternate name: site_link_language
sub property of: site link language
domain: Ad Creative Site Links Spec
range: string

site link original url
type: Property
comment: Contains the original URL of the site link.
alternate name: site_link_original_url
sub property of: site link original url
domain: Ad Creative Site Links Spec
range: string

site link recommendation type
type: Property
comment: Identifies the recommendation type for the site link.
alternate name: site_link_recommendation_type
sub property of: site link recommendation type
domain: Ad Creative Site Links Spec
range: string

site link title
type: Property
comment: Contains the title of the site link.
alternate name: site_link_title
sub property of: site link title
domain: Ad Creative Site Links Spec
range: string

site link url
type: Property
comment: Contains the URL of the site link.
alternate name: site_link_url
sub property of: site link url
domain: Ad Creative Site Links Spec
range: string

site link url anchor
type: Property
comment: Contains the anchor associated with the site link URL.
alternate name: site_link_url_anchor
sub property of: site link url anchor
domain: Ad Creative Site Links Spec
range: string

site link url recommender type
type: Property
comment: Identifies the recommender type for the site link URL.
alternate name: site_link_url_recommender_type
sub property of: site link url recommender type
domain: Ad Creative Site Links Spec
range: string

site link website data source
type: Property
comment: Identifies the website data source for the site link.
alternate name: site_link_website_data_source
sub property of: site link website data source
domain: Ad Creative Site Links Spec
range: string

ad handle type
type: Property
comment: The ad handle type specified in the degrees-of-freedom specification.
alternate name: ad_handle_type
sub property of: ad handle type
domain: Ad Creative Degrees Of Freedom Spec
range: string

creative features spec
type: Property
comment: The creative-features specification within the degrees-of-freedom specification.
alternate name: creative_features_spec
sub property of: creative features spec
domain: Ad Creative Degrees Of Freedom Spec
range: Ad Creative Features Spec

degrees of freedom type
type: Property
comment: The degrees-of-freedom type specified for the ad creative.
alternate name: degrees_of_freedom_type
sub property of: degrees of freedom type
domain: Ad Creative Degrees Of Freedom Spec
range: string

image transformation types
type: Property
comment: The image transformation types specified for the ad creative.
alternate name: image_transformation_types
sub property of: image transformation types
domain: Ad Creative Degrees Of Freedom Spec
range: string

multi media transformation type
type: Property
comment: The multi-media transformation type specified for the ad creative.
alternate name: multi_media_transformation_type
sub property of: multi media transformation type
domain: Ad Creative Degrees Of Freedom Spec
range: string

stories transformation types
type: Property
comment: The Stories transformation types specified for the ad creative.
alternate name: stories_transformation_types
sub property of: stories transformation types
domain: Ad Creative Degrees Of Freedom Spec
range: string

text transformation types
type: Property
comment: The text transformation types specified for the ad creative.
alternate name: text_transformation_types
sub property of: text transformation types
domain: Ad Creative Degrees Of Freedom Spec
range: string

video transformation types
type: Property
comment: The video transformation types specified for the ad creative.
alternate name: video_transformation_types
sub property of: video transformation types
domain: Ad Creative Degrees Of Freedom Spec
range: string

adapt to placement
type: Property
comment: Details for the creative feature that adapts content to placement.
alternate name: adapt_to_placement
sub property of: adapt to placement
domain: Ad Creative Features Spec
range: Ad Creative Feature Details

add text overlay
type: Property
comment: Details for the creative feature that adds a text overlay.
alternate name: add_text_overlay
sub property of: add text overlay
domain: Ad Creative Features Spec
range: Ad Creative Feature Details

ads with benefits
type: Property
comment: Details for the ads-with-benefits creative feature.
alternate name: ads_with_benefits
sub property of: ads with benefits
domain: Ad Creative Features Spec
range: Ad Creative Feature Details

advantage plus creative
type: Property
comment: Details for the Advantage+ creative feature.
alternate name: advantage_plus_creative
sub property of: advantage plus creative
domain: Ad Creative Features Spec
range: Ad Creative Feature Details

app highlights
type: Property
comment: Details for the app-highlights creative feature.
alternate name: app_highlights
sub property of: app highlights
domain: Ad Creative Features Spec
range: Ad Creative Feature Details

audio
type: Property
comment: Details for the audio creative feature.
alternate name: audio
sub property of: audio
domain: Ad Creative Features Spec
range: Ad Creative Feature Details

auto promotion tag
type: Property
comment: Details for the automatic promotion tag creative feature.
alternate name: auto_promotion_tag
sub property of: auto promotion tag
domain: Ad Creative Features Spec
range: Ad Creative Feature Details

biz ai
type: Property
comment: Details for the business AI creative feature.
alternate name: biz_ai
sub property of: biz ai
domain: Ad Creative Features Spec
range: Ad Creative Feature Details

carousel to video
type: Property
comment: Details for the creative feature that converts a carousel to video.
alternate name: carousel_to_video
sub property of: carousel to video
domain: Ad Creative Features Spec
range: Ad Creative Feature Details

catalog feed tag
type: Property
comment: Details for the catalog feed tag creative feature.
alternate name: catalog_feed_tag
sub property of: catalog feed tag
domain: Ad Creative Features Spec
range: Ad Creative Feature Details

creative stickers
type: Property
comment: Details for the creative stickers feature.
alternate name: creative_stickers
sub property of: creative stickers
domain: Ad Creative Features Spec
range: Ad Creative Feature Details

customize product recommendation
type: Property
comment: Details for the creative feature that customizes product recommendations.
alternate name: customize_product_recommendation
sub property of: customize product recommendation
domain: Ad Creative Features Spec
range: Ad Creative Feature Details

cv transformation
type: Property
comment: Details for the CV transformation creative feature.
alternate name: cv_transformation
sub property of: cv transformation
domain: Ad Creative Features Spec
range: Ad Creative Feature Details

description automation
type: Property
comment: Details for the automated description creative feature.
alternate name: description_automation
sub property of: description automation
domain: Ad Creative Features Spec
range: Ad Creative Feature Details

dha optimization
type: Property
comment: Details for the DHA optimization creative feature.
alternate name: dha_optimization
sub property of: dha optimization
domain: Ad Creative Features Spec
range: Ad Creative Feature Details

dynamic cta text
type: Property
comment: Details for the dynamic call-to-action text creative feature.
alternate name: dynamic_cta_text
sub property of: dynamic cta text
domain: Ad Creative Features Spec
range: Ad Creative Feature Details

dynamic partner content
type: Property
comment: Details for the dynamic partner content creative feature.
alternate name: dynamic_partner_content
sub property of: dynamic partner content
domain: Ad Creative Features Spec
range: Ad Creative Feature Details

enable ncs testimonials
type: Property
comment: Details for the creative feature that enables NCS testimonials.
alternate name: enable_ncs_testimonials
sub property of: enable ncs testimonials
domain: Ad Creative Features Spec
range: Ad Creative Feature Details

enhance cta
type: Property
comment: Details for the call-to-action enhancement creative feature.
alternate name: enhance_cta
sub property of: enhance cta
domain: Ad Creative Features Spec
range: Ad Creative Feature Details

fb feed tag
type: Property
comment: Details for the Facebook feed tag creative feature.
alternate name: fb_feed_tag
sub property of: fb feed tag
domain: Ad Creative Features Spec
range: Ad Creative Feature Details

fb reels tag
type: Property
comment: Details for the Facebook Reels tag creative feature.
alternate name: fb_reels_tag
sub property of: fb reels tag
domain: Ad Creative Features Spec
range: Ad Creative Feature Details

fb story tag
type: Property
comment: Details for the Facebook story tag creative feature.
alternate name: fb_story_tag
sub property of: fb story tag
domain: Ad Creative Features Spec
range: Ad Creative Feature Details

feed caption optimization
type: Property
comment: Details for the feed caption optimization creative feature.
alternate name: feed_caption_optimization
sub property of: feed caption optimization
domain: Ad Creative Features Spec
range: Ad Creative Feature Details

generate cta
type: Property
comment: Details for the call-to-action generation creative feature.
alternate name: generate_cta
sub property of: generate cta
domain: Ad Creative Features Spec
range: Ad Creative Feature Details

hide price
type: Property
comment: Details for the creative feature that hides the price.
alternate name: hide_price
sub property of: hide price
domain: Ad Creative Features Spec
range: Ad Creative Feature Details

hyperlink formatting
type: Property
comment: Details for the hyperlink formatting creative feature.
alternate name: hyperlink_formatting
sub property of: hyperlink formatting
domain: Ad Creative Features Spec
range: Ad Creative Feature Details

ig feed tag
type: Property
comment: Details for the Instagram feed tag creative feature.
alternate name: ig_feed_tag
sub property of: ig feed tag
domain: Ad Creative Features Spec
range: Ad Creative Feature Details

ig glados feed
type: Property
comment: Details for the Instagram GLaDOS feed creative feature.
alternate name: ig_glados_feed
sub property of: ig glados feed
domain: Ad Creative Features Spec
range: Ad Creative Feature Details

ig reels tag
type: Property
comment: Details for the Instagram Reels tag creative feature.
alternate name: ig_reels_tag
sub property of: ig reels tag
domain: Ad Creative Features Spec
range: Ad Creative Feature Details

ig stream tag
type: Property
comment: Details for the Instagram stream tag creative feature.
alternate name: ig_stream_tag
sub property of: ig stream tag
domain: Ad Creative Features Spec
range: Ad Creative Feature Details

ig video native subtitle
type: Property
comment: Details for the Instagram video native subtitle creative feature.
alternate name: ig_video_native_subtitle
sub property of: ig video native subtitle
domain: Ad Creative Features Spec
range: Ad Creative Feature Details

image animation
type: Property
comment: Details for the image animation creative feature.
alternate name: image_animation
sub property of: image animation
domain: Ad Creative Features Spec
range: Ad Creative Feature Details

image auto crop
type: Property
comment: Details for the automatic image cropping creative feature.
alternate name: image_auto_crop
sub property of: image auto crop
domain: Ad Creative Features Spec
range: Ad Creative Feature Details

image background gen
type: Property
comment: Details for the image background generation creative feature.
alternate name: image_background_gen
sub property of: image background gen
domain: Ad Creative Features Spec
range: Ad Creative Feature Details

image banner
type: Property
comment: Details for the image banner creative feature.
alternate name: image_banner
sub property of: image banner
domain: Ad Creative Features Spec
range: Ad Creative Feature Details

image brightness and contrast
type: Property
comment: Details for the image brightness and contrast creative feature.
alternate name: image_brightness_and_contrast
sub property of: image brightness and contrast
domain: Ad Creative Features Spec
range: Ad Creative Feature Details

image end card
type: Property
comment: Details for the image end-card creative feature.
alternate name: image_end_card
sub property of: image end card
domain: Ad Creative Features Spec
range: Ad Creative Feature Details

image enhancement
type: Property
comment: Details for the image enhancement creative feature.
alternate name: image_enhancement
sub property of: image enhancement
domain: Ad Creative Features Spec
range: Ad Creative Feature Details

image templates
type: Property
comment: Details for the image templates creative feature.
alternate name: image_templates
sub property of: image templates
domain: Ad Creative Features Spec
range: Ad Creative Feature Details

image text translation
type: Property
comment: Details for the image text translation creative feature.
alternate name: image_text_translation
sub property of: image text translation
domain: Ad Creative Features Spec
range: Ad Creative Feature Details

image touchups
type: Property
comment: Details for the image touchup creative feature.
alternate name: image_touchups
sub property of: image touchups
domain: Ad Creative Features Spec
range: Ad Creative Feature Details

image uncrop
type: Property
comment: Details for the image uncropping creative feature.
alternate name: image_uncrop
sub property of: image uncrop
domain: Ad Creative Features Spec
range: Ad Creative Feature Details

inline comment
type: Property
comment: Details for the inline comment creative feature.
alternate name: inline_comment
sub property of: inline comment
domain: Ad Creative Features Spec
range: Ad Creative Feature Details

local store extension
type: Property
comment: Details for the local store extension creative feature.
alternate name: local_store_extension
sub property of: local store extension
domain: Ad Creative Features Spec
range: Ad Creative Feature Details

media liquidity animated image
type: Property
comment: Details for the animated image media liquidity creative feature.
alternate name: media_liquidity_animated_image
sub property of: media liquidity animated image
domain: Ad Creative Features Spec
range: Ad Creative Feature Details

media order
type: Property
comment: Details for the media ordering creative feature.
alternate name: media_order
sub property of: media order
domain: Ad Creative Features Spec
range: Ad Creative Feature Details

media type automation
type: Property
comment: Details for the media type automation creative feature.
alternate name: media_type_automation
sub property of: media type automation
domain: Ad Creative Features Spec
range: Ad Creative Feature Details

multi creative post carousel
type: Property
comment: Details for the multi-creative post carousel feature.
alternate name: multi_creative_post_carousel
sub property of: multi creative post carousel
domain: Ad Creative Features Spec
range: Ad Creative Feature Details

multi photo to video
type: Property
comment: Details for the creative feature that converts multiple photos to video.
alternate name: multi_photo_to_video
sub property of: multi photo to video
domain: Ad Creative Features Spec
range: Ad Creative Feature Details

music generation
type: Property
comment: Details for the music generation creative feature.
alternate name: music_generation
sub property of: music generation
domain: Ad Creative Features Spec
range: Ad Creative Feature Details

pac genai recomposition
type: Property
comment: Details for the PAC generative AI recomposition creative feature.
alternate name: pac_genai_recomposition
sub property of: pac genai recomposition
domain: Ad Creative Features Spec
range: Ad Creative Feature Details

pac recomposition
type: Property
comment: Details for the PAC recomposition creative feature.
alternate name: pac_recomposition
sub property of: pac recomposition
domain: Ad Creative Features Spec
range: Ad Creative Feature Details

pac relaxation
type: Property
comment: Details for the PAC relaxation creative feature.
alternate name: pac_relaxation
sub property of: pac relaxation
domain: Ad Creative Features Spec
range: Ad Creative Feature Details

product browsing
type: Property
comment: Details for the product browsing creative feature.
alternate name: product_browsing
sub property of: product browsing
domain: Ad Creative Features Spec
range: Ad Creative Feature Details

product extensions
type: Property
comment: Details for the product extensions creative feature.
alternate name: product_extensions
sub property of: product extensions
domain: Ad Creative Features Spec
range: Ad Creative Feature Details

product metadata automation
type: Property
comment: Details for the product metadata automation creative feature.
alternate name: product_metadata_automation
sub property of: product metadata automation
domain: Ad Creative Features Spec
range: Ad Creative Feature Details

product tags
type: Property
comment: Details for the product tags creative feature.
alternate name: product_tags
sub property of: product tags
domain: Ad Creative Features Spec
range: Ad Creative Feature Details

profile card
type: Property
comment: Details for the profile card creative feature.
alternate name: profile_card
sub property of: profile card
domain: Ad Creative Features Spec
range: Ad Creative Feature Details

profile extension
type: Property
comment: Details for the profile extension creative feature.
alternate name: profile_extension
sub property of: profile extension
domain: Ad Creative Features Spec
range: Ad Creative Feature Details

replace media text
type: Property
comment: Details for the creative feature that replaces media text.
alternate name: replace_media_text
sub property of: replace media text
domain: Ad Creative Features Spec
range: Ad Creative Feature Details

reveal details over time
type: Property
comment: Details for the creative feature that reveals details over time.
alternate name: reveal_details_over_time
sub property of: reveal details over time
domain: Ad Creative Features Spec
range: Ad Creative Feature Details

show destination blurbs
type: Property
comment: Details for the creative feature that shows destination blurbs.
alternate name: show_destination_blurbs
sub property of: show destination blurbs
domain: Ad Creative Features Spec
range: Ad Creative Feature Details

show summary
type: Property
comment: Details for the creative feature that shows a summary.
alternate name: show_summary
sub property of: show summary
domain: Ad Creative Features Spec
range: Ad Creative Feature Details

site extensions
type: Property
comment: Details for the site extensions creative feature.
alternate name: site_extensions
sub property of: site extensions
domain: Ad Creative Features Spec
range: Ad Creative Feature Details

standard enhancements
type: Property
comment: Details for the standard enhancements creative feature.
alternate name: standard_enhancements
sub property of: standard enhancements
domain: Ad Creative Features Spec
range: Ad Creative Feature Details

standard enhancements catalog
type: Property
comment: Details for the standard catalog enhancements creative feature.
alternate name: standard_enhancements_catalog
sub property of: standard enhancements catalog
domain: Ad Creative Features Spec
range: Ad Creative Feature Details

text extraction for headline
type: Property
comment: Details for the text extraction feature for headlines.
alternate name: text_extraction_for_headline
sub property of: text extraction for headline
domain: Ad Creative Features Spec
range: Ad Creative Feature Details

text extraction for tap target
type: Property
comment: Details for the text extraction feature for tap targets.
alternate name: text_extraction_for_tap_target
sub property of: text extraction for tap target
domain: Ad Creative Features Spec
range: Ad Creative Feature Details

text formatting optimization
type: Property
comment: Details for the text formatting optimization creative feature.
alternate name: text_formatting_optimization
sub property of: text formatting optimization
domain: Ad Creative Features Spec
range: Ad Creative Feature Details

text generation
type: Property
comment: Details for the text generation creative feature.
alternate name: text_generation
sub property of: text generation
domain: Ad Creative Features Spec
range: Ad Creative Feature Details

text optimizations
type: Property
comment: Details for the text optimization creative feature.
alternate name: text_optimizations
sub property of: text optimizations
domain: Ad Creative Features Spec
range: Ad Creative Feature Details

text overlay translation
type: Property
comment: Details for the text overlay translation creative feature.
alternate name: text_overlay_translation
sub property of: text overlay translation
domain: Ad Creative Features Spec
range: Ad Creative Feature Details

text translation
type: Property
comment: Details for the text translation creative feature.
alternate name: text_translation
sub property of: text translation
domain: Ad Creative Features Spec
range: Ad Creative Feature Details

translate voiceover
type: Property
comment: Details for the voiceover translation creative feature.
alternate name: translate_voiceover
sub property of: translate voiceover
domain: Ad Creative Features Spec
range: Ad Creative Feature Details

video auto crop
type: Property
comment: Details for the automatic video cropping creative feature.
alternate name: video_auto_crop
sub property of: video auto crop
domain: Ad Creative Features Spec
range: Ad Creative Feature Details

video filtering
type: Property
comment: Details for the video filtering creative feature.
alternate name: video_filtering
sub property of: video filtering
domain: Ad Creative Features Spec
range: Ad Creative Feature Details

video highlight
type: Property
comment: Details for the video highlight creative feature.
alternate name: video_highlight
sub property of: video highlight
domain: Ad Creative Features Spec
range: Ad Creative Feature Details

video highlights
type: Property
comment: Details for the video highlights creative feature.
alternate name: video_highlights
sub property of: video highlights
domain: Ad Creative Features Spec
range: Ad Creative Feature Details

video to image
type: Property
comment: Details for the creative feature that converts video to an image.
alternate name: video_to_image
sub property of: video to image
domain: Ad Creative Features Spec
range: Ad Creative Feature Details

video uncrop
type: Property
comment: Details for the video uncropping creative feature.
alternate name: video_uncrop
sub property of: video uncrop
domain: Ad Creative Features Spec
range: Ad Creative Feature Details

video uncrop9x16to9x18
type: Property
comment: Details for the creative feature that uncrops video from 9x16 to 9x18.
alternate name: video_uncrop_9x16_to_9x18
sub property of: video uncrop9x16to9x18
domain: Ad Creative Features Spec
range: Ad Creative Feature Details

wa mm image filtering
type: Property
comment: Details for the WhatsApp multimedia image filtering creative feature.
alternate name: wa_mm_image_filtering
sub property of: wa mm image filtering
domain: Ad Creative Features Spec
range: Ad Creative Feature Details

wa mm text truncation length
type: Property
comment: Details for the WhatsApp multimedia text truncation length creative feature.
alternate name: wa_mm_text_truncation_length
sub property of: wa mm text truncation length
domain: Ad Creative Features Spec
range: Ad Creative Feature Details

customizations
type: Property
comment: The customizations associated with the creative feature.
alternate name: customizations
domain: Ad Creative Feature Details
range: Ad Creative Feature Customizations

enroll status
type: Property
comment: The enrollment status of the creative feature.
alternate name: enroll_status
sub property of: enroll status
domain: Ad Creative Feature Details
range: string

aspect ratio config
type: Property
comment: The aspect-ratio configuration for the creative feature customizations.
alternate name: aspect_ratio_config
sub property of: aspect ratio config
domain: Ad Creative Feature Customizations
range: JSON

background color
type: Property
comment: The background color for the creative feature customizations.
alternate name: background_color
sub property of: background color
domain: Ad Creative Feature Customizations
range: string

catalog feed tag name
type: Property
comment: The tag name for the catalog feed in the creative feature customizations.
alternate name: catalog_feed_tag_name
sub property of: catalog feed tag name
domain: Ad Creative Feature Customizations
range: string

fb feed tag name
type: Property
comment: The tag name for the Facebook Feed in the creative feature customizations.
alternate name: fb_feed_tag_name
sub property of: fb feed tag name
domain: Ad Creative Feature Customizations
range: string

fb reels tag name
type: Property
comment: The tag name for Facebook Reels in the creative feature customizations.
alternate name: fb_reels_tag_name
sub property of: fb reels tag name
domain: Ad Creative Feature Customizations
range: string

fb story tag name
type: Property
comment: The tag name for Facebook Stories in the creative feature customizations.
alternate name: fb_story_tag_name
sub property of: fb story tag name
domain: Ad Creative Feature Customizations
range: string

font name
type: Property
comment: The font name used for the creative customization.
alternate name: font_name
sub property of: font name
domain: Ad Creative Feature Customizations
range: string

ig feed tag name
type: Property
comment: The tag name associated with the Instagram feed customization.
alternate name: ig_feed_tag_name
sub property of: ig feed tag name
domain: Ad Creative Feature Customizations
range: string

ig reels tag name
type: Property
comment: The tag name associated with the Instagram Reels customization.
alternate name: ig_reels_tag_name
sub property of: ig reels tag name
domain: Ad Creative Feature Customizations
range: string

ig stream tag name
type: Property
comment: The tag name associated with the Instagram stream customization.
alternate name: ig_stream_tag_name
sub property of: ig stream tag name
domain: Ad Creative Feature Customizations
range: string

image crop style
type: Property
comment: The crop style used for the image customization.
alternate name: image_crop_style
sub property of: image crop style
domain: Ad Creative Feature Customizations
range: string

pe carousel
type: Property
comment: The carousel customization details.
alternate name: pe_carousel
sub property of: pe carousel
domain: Ad Creative Feature Customizations
range: JSON

recomposition type
type: Property
comment: The type of recomposition specified for the creative.
alternate name: recomposition_type
sub property of: recomposition type
domain: Ad Creative Feature Customizations
range: JSON

showcase card display
type: Property
comment: The display configuration for the showcase card.
alternate name: showcase_card_display
sub property of: showcase card display
domain: Ad Creative Feature Customizations
range: string

text extraction
type: Property
comment: The text extraction customization details.
alternate name: text_extraction
sub property of: text extraction
domain: Ad Creative Feature Customizations
range: JSON

text style
type: Property
comment: The text style used for the creative customization.
alternate name: text_style
sub property of: text style
domain: Ad Creative Feature Customizations
range: string

shared to sponsor status
type: Property
comment: The status of sharing the Facebook branded content with the sponsor.
alternate name: shared_to_sponsor_status
sub property of: shared to sponsor status
domain: Ad Creative Facebook Branded Content
range: string

sponsor page id
type: Property
comment: The identifier of the sponsor's Facebook page.
alternate name: sponsor_page_id
sub property of: sponsor page id
domain: Ad Creative Facebook Branded Content
range: string

sponsor relationship
type: Property
comment: The relationship with the sponsor specified for the Facebook branded content.
alternate name: sponsor_relationship
sub property of: sponsor relationship
domain: Ad Creative Facebook Branded Content
range: string

sponsor id
type: Property
comment: The identifier of the sponsor associated with the Instagram branded content.
alternate name: sponsor_id
sub property of: sponsor id
domain: Ad Creative Instagram Branded Content
range: string

child attachments
type: Property
comment: The child attachments associated with the interactive components specification.
alternate name: child_attachments
domain: Ad Creative Interactive Components Spec
range: JSON

components
type: Property
comment: Contains the interactive component objects associated with the specification.
alternate name: components
sub property of: components
domain: Ad Creative Interactive Components Spec
range: JSON

instagram user id
type: Property
comment: Identifies the Instagram user associated with the object story.
alternate name: instagram_user_id
sub property of: instagram user id
domain: Ad Creative Object Story Spec
range: string

link data
type: Property
comment: Contains link data for the object story.
alternate name: link_data
sub property of: link data
domain: Ad Creative Object Story Spec
range: Ad Creative Link Data

page id
type: Property
comment: Identifies the Page associated with the object story.
alternate name: page_id
sub property of: page id
domain: Ad Creative Object Story Spec
range: string

photo data
type: Property
comment: Contains photo data for the object story.
alternate name: photo_data
sub property of: photo data
domain: Ad Creative Object Story Spec
range: Ad Creative Photo Data

product data
type: Property
comment: Contains product data for the object story.
alternate name: product_data
sub property of: product data
domain: Ad Creative Object Story Spec
range: Ad Creative Product Data

template data
type: Property
comment: Contains template link data for the object story.
alternate name: template_data
sub property of: template data
domain: Ad Creative Object Story Spec
range: Ad Creative Link Data

text data
type: Property
comment: Contains text data for the object story.
alternate name: text_data
sub property of: text data
domain: Ad Creative Object Story Spec
range: Ad Creative Text Data

video data
type: Property
comment: Contains video data for the object story.
alternate name: video_data
sub property of: video data
domain: Ad Creative Object Story Spec
range: Ad Creative Video Data

whats app business phone number
type: Property
comment: Identifies the WhatsApp Business phone number associated with the object story.
alternate name: whats_app_business_phone_number
sub property of: whats app business phone number
domain: Ad Creative Object Story Spec
range: string

ad context
type: Property
comment: Represents contextual information associated with the ad.
alternate name: ad_context
sub property of: ad context
domain: Ad Creative Link Data
range: string

additional image index
type: Property
comment: Identifies an additional image by its index.
alternate name: additional_image_index
sub property of: additional image index
domain: Ad Creative Link Data
range: int

app link spec
type: Property
comment: Contains app-link details for the link creative.
alternate name: app_link_spec
sub property of: app link spec
domain: Ad Creative Link Data
range: Ad Creative Link Data App Link Spec

attachment style
type: Property
comment: Specifies the attachment style used by the link creative.
alternate name: attachment_style
sub property of: attachment style
domain: Ad Creative Link Data
range: string

automated product tags
type: Property
comment: Indicates whether automated product tags are used.
alternate name: automated_product_tags
sub property of: automated product tags
domain: Ad Creative Link Data
range: boolean

boosted product set id
type: Property
comment: Identifies the product set associated with the boosted creative.
alternate name: boosted_product_set_id
sub property of: boosted product set id
domain: Ad Creative Link Data
range: string

branded content shared to sponsor status
type: Property
comment: Represents the sharing status of branded content with the sponsor.
alternate name: branded_content_shared_to_sponsor_status
sub property of: branded content shared to sponsor status
domain: Ad Creative Link Data
range: string

branded content sponsor page id
type: Property
comment: Identifies the Page serving as the branded-content sponsor.
alternate name: branded_content_sponsor_page_id
sub property of: branded content sponsor page id
domain: Ad Creative Link Data
range: string

call to action
type: Property
comment: Contains the creative's call-to-action configuration.
alternate name: call_to_action
sub property of: call to action
domain: Ad Creative Link Data
range: Ad Creative Link Data Call To Action

caption
type: Property
comment: Contains the caption associated with the link creative.
alternate name: caption
sub property of: caption
domain: Ad Creative Link Data
range: string

child attachments
type: Property
comment: Contains the child attachments included in the link creative.
alternate name: child_attachments
domain: Ad Creative Link Data
range: Ad Creative Link Data Child Attachment

collection thumbnails
type: Property
comment: Contains thumbnail information for the collection.
alternate name: collection_thumbnails
sub property of: collection thumbnails
domain: Ad Creative Link Data
range: Ad Creative Collection Thumbnail Info

customization rules spec
type: Property
comment: Contains the rules used to customize the creative.
alternate name: customization_rules_spec
sub property of: customization rules spec
domain: Ad Creative Link Data
range: Ad Customization Rule Spec

description
type: Property
comment: Contains the description associated with the link creative.
alternate name: description
sub property of: description
domain: Ad Creative Link Data
range: string

event id
type: Property
comment: Identifies the event associated with the link creative.
alternate name: event_id
sub property of: event id
domain: Ad Creative Link Data
range: string

force single link
type: Property
comment: Indicates whether the creative is constrained to a single link.
alternate name: force_single_link
sub property of: force single link
domain: Ad Creative Link Data
range: boolean

format option
type: Property
comment: Specifies the link creative format, such as a carousel, collection video, or single image.
alternate name: format_option
sub property of: format option
domain: Ad Creative Link Data
range: string
code list: AdCreativeLinkDataFormatOption

image crops
type: Property
comment: Contains crop settings for the creative image.
alternate name: image_crops
sub property of: image crops
domain: Ad Creative Link Data
range: Ads Image Crops

image hash
type: Property
comment: Identifies the creative image by its hash.
alternate name: image_hash
sub property of: image hash
domain: Ad Creative Link Data
range: string

image layer specs
type: Property
comment: Contains the image layers applied to the creative.
alternate name: image_layer_specs
sub property of: image layer specs
domain: Ad Creative Link Data
range: Ad Creative Link Data Image Layer Spec

image overlay spec
type: Property
comment: Contains the overlay configuration for the creative image.
alternate name: image_overlay_spec
sub property of: image overlay spec
domain: Ad Creative Link Data
range: Ad Creative Link Data Image Overlay Spec

is local expansion
type: Property
comment: Indicates whether the creative represents a local expansion.
alternate name: is_local_expansion
sub property of: is local expansion
domain: Ad Creative Link Data
range: boolean

link
type: Property
comment: Contains the destination link for the creative.
alternate name: link
sub property of: link
domain: Ad Creative Link Data
range: string

message
type: Property
comment: Contains the message associated with the link creative.
alternate name: message
sub property of: message
domain: Ad Creative Link Data
range: string

multi share end card
type: Property
comment: Indicates whether a multi-share end card is used.
alternate name: multi_share_end_card
sub property of: multi share end card
domain: Ad Creative Link Data
range: boolean

multi share optimized
type: Property
comment: Indicates whether the multi-share creative is optimized.
alternate name: multi_share_optimized
sub property of: multi share optimized
domain: Ad Creative Link Data
range: boolean

name
type: Property
comment: Contains the name associated with the link creative.
alternate name: name
sub property of: name
domain: Ad Creative Link Data
range: string

offer id
type: Property
comment: Identifies the offer associated with the link creative.
alternate name: offer_id
sub property of: offer id
domain: Ad Creative Link Data
range: string

page welcome message
type: Property
comment: Contains the welcome message associated with the Page experience.
alternate name: page_welcome_message
sub property of: page welcome message
domain: Ad Creative Link Data
range: string

picture
type: Property
comment: Contains the picture associated with the link creative.
alternate name: picture
sub property of: picture
domain: Ad Creative Link Data
range: string

post click configuration
type: Property
comment: Contains the configuration for the experience after a click.
alternate name: post_click_configuration
sub property of: post click configuration
domain: Ad Creative Link Data
range: Ad Creative Post Click Configuration

preferred image tags
type: Property
comment: Contains preferred tags for images used by the creative.
alternate name: preferred_image_tags
sub property of: preferred image tags
domain: Ad Creative Link Data
range: string

preferred video tags
type: Property
comment: Contains preferred tags for videos used by the creative.
alternate name: preferred_video_tags
sub property of: preferred video tags
domain: Ad Creative Link Data
range: string

retailer item ids
type: Property
comment: Contains the retailer item identifiers associated with the creative.
alternate name: retailer_item_ids
sub property of: retailer item ids
domain: Ad Creative Link Data
range: string

show multiple images
type: Property
comment: Indicates whether multiple images are shown.
alternate name: show_multiple_images
sub property of: show multiple images
domain: Ad Creative Link Data
range: boolean

smart pse enabled
type: Property
comment: Indicates whether Smart PSE is enabled.
alternate name: smart_pse_enabled
sub property of: smart pse enabled
domain: Ad Creative Link Data
range: boolean

static fallback spec
type: Property
comment: Contains the static fallback configuration for the creative.
alternate name: static_fallback_spec
sub property of: static fallback spec
domain: Ad Creative Link Data
range: Ad Creative Static Fallback Spec

use flexible image aspect ratio
type: Property
comment: Indicates whether a flexible image aspect ratio is used.
alternate name: use_flexible_image_aspect_ratio
sub property of: use flexible image aspect ratio
domain: Ad Creative Link Data
range: boolean

android
type: Property
comment: Contains app-link entries for Android.
alternate name: android
domain: Ad Creative Link Data App Link Spec
range: Android App Link

ios
type: Property
comment: Contains app-link entries for iOS.
alternate name: ios
domain: Ad Creative Link Data App Link Spec
range: Ios App Link

ipad
type: Property
comment: Contains app-link entries for iPad.
alternate name: ipad
domain: Ad Creative Link Data App Link Spec
range: Ios App Link

iphone
type: Property
comment: Contains app-link entries for iPhone.
alternate name: iphone
domain: Ad Creative Link Data App Link Spec
range: Ios App Link

app name
type: Property
comment: Represents the name of the Android application.
alternate name: app_name
sub property of: app name
domain: Android App Link
range: string

class
type: Property
comment: Represents the Android application class.
alternate name: class
sub property of: class
domain: Android App Link
range: string

package
type: Property
comment: Represents the Android application package.
alternate name: package
sub property of: package
domain: Android App Link
range: string

url
type: Property
comment: Represents the URL associated with the Android application link.
alternate name: url
sub property of: url
domain: Android App Link
range: string

app name
type: Property
comment: Represents the name of the iOS app.
alternate name: app_name
sub property of: app name
domain: Ios App Link
range: string

app store id
type: Property
comment: Identifies the iOS app in the App Store.
alternate name: app_store_id
sub property of: app store id
domain: Ios App Link
range: string

url
type: Property
comment: Provides the URL associated with the iOS app link.
alternate name: url
sub property of: url
domain: Ios App Link
range: string

android url
type: Property
comment: Contains the URL associated with the attachment's Android destination.
alternate name: android_url
sub property of: android url
domain: Ad Creative Link Data Child Attachment
range: string

call to action
type: Property
comment: Contains the call-to-action configuration for the child attachment.
alternate name: call_to_action
sub property of: call to action
domain: Ad Creative Link Data Child Attachment
range: Ad Creative Link Data Call To Action

caption
type: Property
comment: Contains the caption associated with the child attachment.
alternate name: caption
sub property of: caption
domain: Ad Creative Link Data Child Attachment
range: string

description
type: Property
comment: Contains the description associated with the child attachment.
alternate name: description
sub property of: description
domain: Ad Creative Link Data Child Attachment
range: string

ig media id
type: Property
comment: Identifies the Instagram media associated with the child attachment.
alternate name: ig_media_id
sub property of: ig media id
domain: Ad Creative Link Data Child Attachment
range: string

image crops
type: Property
comment: Contains crop settings for the child attachment image.
alternate name: image_crops
sub property of: image crops
domain: Ad Creative Link Data Child Attachment
range: Ads Image Crops

image hash
type: Property
comment: Identifies the child attachment image by its hash.
alternate name: image_hash
sub property of: image hash
domain: Ad Creative Link Data Child Attachment
range: string

ios url
type: Property
comment: Contains the URL associated with the attachment's iOS destination.
alternate name: ios_url
sub property of: ios url
domain: Ad Creative Link Data Child Attachment
range: string

link
type: Property
comment: Contains the destination link for the child attachment.
alternate name: link
sub property of: link
domain: Ad Creative Link Data Child Attachment
range: string

marketing message buttons
type: Property
comment: Contains the marketing message button objects associated with the child attachment.
alternate name: marketing_message_buttons
sub property of: marketing message buttons
domain: Ad Creative Link Data Child Attachment
range: JSON

name
type: Property
comment: Contains the name associated with the child attachment.
alternate name: name
sub property of: name
domain: Ad Creative Link Data Child Attachment
range: string

picture
type: Property
comment: Contains the picture associated with the child attachment.
alternate name: picture
sub property of: picture
domain: Ad Creative Link Data Child Attachment
range: string

place data
type: Property
comment: Contains place information associated with the child attachment.
alternate name: place_data
sub property of: place data
domain: Ad Creative Link Data Child Attachment
range: Ad Creative Place Data

static card
type: Property
comment: Indicates whether the child attachment is a static card.
alternate name: static_card
sub property of: static card
domain: Ad Creative Link Data Child Attachment
range: boolean

video id
type: Property
comment: Identifies the video associated with the child attachment.
alternate name: video_id
domain: Ad Creative Link Data Child Attachment
range: string

address string
type: Property
comment: Contains the address associated with the place.
alternate name: address_string
sub property of: address string
domain: Ad Creative Place Data
range: string

label
type: Property
comment: Contains the label associated with the place.
alternate name: label
sub property of: label
domain: Ad Creative Place Data
range: string

latitude
type: Property
comment: Represents the latitude of the place.
alternate name: latitude
sub property of: latitude
domain: Ad Creative Place Data
range: double

location source id
type: Property
comment: Identifies the source location for the place.
alternate name: location_source_id
sub property of: location source id
domain: Ad Creative Place Data
range: string

longitude
type: Property
comment: Represents the longitude of the place.
alternate name: longitude
sub property of: longitude
domain: Ad Creative Place Data
range: double

type
type: Property
comment: Identifies the type of the place.
alternate name: type
domain: Ad Creative Place Data
range: string

element child index
type: Property
comment: The child index of the collection element represented by the thumbnail.
alternate name: element_child_index
sub property of: element child index
domain: Ad Creative Collection Thumbnail Info
range: int

element crops
type: Property
comment: Crop information for the collection element represented by the thumbnail.
alternate name: element_crops
sub property of: element crops
domain: Ad Creative Collection Thumbnail Info
range: Ads Image Crops

element id
type: Property
comment: The identifier of the collection element represented by the thumbnail.
alternate name: element_id
sub property of: element id
domain: Ad Creative Collection Thumbnail Info
range: string

caption
type: Property
comment: Provides the caption used by the customization rule.
alternate name: caption
sub property of: caption
domain: Ad Customization Rule Spec
range: string

customization spec
type: Property
comment: Contains the customization specification for the rule.
alternate name: customization_spec
domain: Ad Customization Rule Spec
range: JSON

description
type: Property
comment: Provides the description of the customization rule.
alternate name: description
sub property of: description
domain: Ad Customization Rule Spec
range: string

image hash
type: Property
comment: Identifies the image used by the customization rule through its hash.
alternate name: image_hash
sub property of: image hash
domain: Ad Customization Rule Spec
range: string

link
type: Property
comment: Provides the link used by the customization rule.
alternate name: link
sub property of: link
domain: Ad Customization Rule Spec
range: string

message
type: Property
comment: Provides the message used by the customization rule.
alternate name: message
sub property of: message
domain: Ad Customization Rule Spec
range: string

name
type: Property
comment: Provides the name of the customization rule.
alternate name: name
sub property of: name
domain: Ad Customization Rule Spec
range: string

priority
type: Property
comment: Specifies the priority assigned to the customization rule.
alternate name: priority
domain: Ad Customization Rule Spec
range: int

template url spec
type: Property
comment: Provides the template URL specification used by the customization rule.
alternate name: template_url_spec
sub property of: template url spec
domain: Ad Customization Rule Spec
range: Ad Creative Template URLSpec

video id
type: Property
comment: Identifies the video used by the customization rule.
alternate name: video_id
domain: Ad Customization Rule Spec
range: int

android
type: Property
comment: Contains template URL configuration for Android.
alternate name: android
domain: Ad Creative Template URLSpec
range: JSON

config
type: Property
comment: Contains configuration for the template URL specification.
alternate name: config
sub property of: config
domain: Ad Creative Template URLSpec
range: JSON

ios
type: Property
comment: Contains template URL configuration for iOS.
alternate name: ios
domain: Ad Creative Template URLSpec
range: JSON

ipad
type: Property
comment: Contains template URL configuration for iPad.
alternate name: ipad
domain: Ad Creative Template URLSpec
range: JSON

iphone
type: Property
comment: Contains template URL configuration for iPhone.
alternate name: iphone
domain: Ad Creative Template URLSpec
range: JSON

web
type: Property
comment: Contains template URL configuration for the web.
alternate name: web
sub property of: web
domain: Ad Creative Template URLSpec
range: JSON

windows phone
type: Property
comment: Contains template URL configuration for Windows Phone.
alternate name: windows_phone
sub property of: windows phone
domain: Ad Creative Template URLSpec
range: JSON

blending mode
type: Property
comment: Specifies how the image layer blends with underlying content.
alternate name: blending_mode
sub property of: blending mode
domain: Ad Creative Link Data Image Layer Spec
range: string
code list: AdCreativeLinkDataImageLayerSpecBlendingMode

content
type: Property
comment: Contains the content of the image layer.
alternate name: content
sub property of: content
domain: Ad Creative Link Data Image Layer Spec
range: JSON

frame auto show enroll status
type: Property
comment: Represents the enrollment status for automatically showing the frame.
alternate name: frame_auto_show_enroll_status
sub property of: frame auto show enroll status
domain: Ad Creative Link Data Image Layer Spec
range: string

frame image hash
type: Property
comment: Identifies the image used for the frame by its hash.
alternate name: frame_image_hash
sub property of: frame image hash
domain: Ad Creative Link Data Image Layer Spec
range: string

frame source
type: Property
comment: Specifies the source of the frame, including a custom source.
alternate name: frame_source
sub property of: frame source
domain: Ad Creative Link Data Image Layer Spec
range: string
code list: AdCreativeLinkDataImageLayerSpecFrameSource

image source
type: Property
comment: Specifies the source of the layer image, including a catalog source.
alternate name: image_source
sub property of: image source
domain: Ad Creative Link Data Image Layer Spec
range: string
code list: AdCreativeLinkDataImageLayerSpecImageSource

layer type
type: Property
comment: Specifies whether the layer is an image, frame overlay, or text overlay.
alternate name: layer_type
sub property of: layer type
domain: Ad Creative Link Data Image Layer Spec
range: string
code list: AdCreativeLinkDataImageLayerSpecLayerType

opacity
type: Property
comment: Specifies the opacity of the image layer.
alternate name: opacity
sub property of: opacity
domain: Ad Creative Link Data Image Layer Spec
range: int

overlay position
type: Property
comment: Specifies the position of the overlay within the image.
alternate name: overlay_position
sub property of: overlay position
domain: Ad Creative Link Data Image Layer Spec
range: string
code list: AdCreativeLinkDataImageLayerSpecOverlayPosition

overlay shape
type: Property
comment: Specifies the shape of the overlay.
alternate name: overlay_shape
sub property of: overlay shape
domain: Ad Creative Link Data Image Layer Spec
range: string
code list: AdCreativeLinkDataImageLayerSpecOverlayShape

scale
type: Property
comment: Specifies the scale of the image layer.
alternate name: scale
sub property of: scale
domain: Ad Creative Link Data Image Layer Spec
range: int

shape color
type: Property
comment: Specifies the color of the overlay shape.
alternate name: shape_color
sub property of: shape color
domain: Ad Creative Link Data Image Layer Spec
range: string

text color
type: Property
comment: Specifies the color of text in the image layer.
alternate name: text_color
sub property of: text color
domain: Ad Creative Link Data Image Layer Spec
range: string

text font
type: Property
comment: Specifies the font used for text in the image layer.
alternate name: text_font
sub property of: text font
domain: Ad Creative Link Data Image Layer Spec
range: string
code list: AdCreativeLinkDataImageLayerSpecTextFont

custom text type
type: Property
comment: Specifies the predefined type of custom overlay text, such as sale or free shipping.
alternate name: custom_text_type
sub property of: custom text type
domain: Ad Creative Link Data Image Overlay Spec
range: string
code list: AdCreativeLinkDataImageOverlaySpecCustomTextType

float with margin
type: Property
comment: Indicates whether the image overlay floats with a margin.
alternate name: float_with_margin
sub property of: float with margin
domain: Ad Creative Link Data Image Overlay Spec
range: boolean

overlay template
type: Property
comment: Specifies the template used for the image overlay.
alternate name: overlay_template
sub property of: overlay template
domain: Ad Creative Link Data Image Overlay Spec
range: string
code list: AdCreativeLinkDataImageOverlaySpecOverlayTemplate

position
type: Property
comment: Specifies the position of the image overlay.
alternate name: position
sub property of: position
domain: Ad Creative Link Data Image Overlay Spec
range: string
code list: AdCreativeLinkDataImageOverlaySpecPosition

text font
type: Property
comment: Specifies the font used for text in the image overlay.
alternate name: text_font
sub property of: text font
domain: Ad Creative Link Data Image Overlay Spec
range: string
code list: AdCreativeLinkDataImageOverlaySpecTextFont

text template tags
type: Property
comment: Contains tags used by the overlay text template.
alternate name: text_template_tags
sub property of: text template tags
domain: Ad Creative Link Data Image Overlay Spec
range: string

text type
type: Property
comment: Specifies the type of text displayed by the image overlay.
alternate name: text_type
sub property of: text type
domain: Ad Creative Link Data Image Overlay Spec
range: string
code list: AdCreativeLinkDataImageOverlaySpecTextType

theme color
type: Property
comment: Specifies the background and text color combination for the image overlay.
alternate name: theme_color
sub property of: theme color
domain: Ad Creative Link Data Image Overlay Spec
range: string
code list: AdCreativeLinkDataImageOverlaySpecThemeColor

post click item description
type: Property
comment: Contains the description shown for the post-click item.
alternate name: post_click_item_description
sub property of: post click item description
domain: Ad Creative Post Click Configuration
range: string

post click item headline
type: Property
comment: Contains the headline shown for the post-click item.
alternate name: post_click_item_headline
sub property of: post click item headline
domain: Ad Creative Post Click Configuration
range: string

call to action
type: Property
comment: Contains the call to action for the static fallback.
alternate name: call_to_action
sub property of: call to action
domain: Ad Creative Static Fallback Spec
range: Ad Creative Link Data Call To Action

description
type: Property
comment: Contains the description for the static fallback.
alternate name: description
sub property of: description
domain: Ad Creative Static Fallback Spec
range: string

image hash
type: Property
comment: Identifies the image used by the static fallback.
alternate name: image_hash
sub property of: image hash
domain: Ad Creative Static Fallback Spec
range: string

link
type: Property
comment: Contains the link for the static fallback.
alternate name: link
sub property of: link
domain: Ad Creative Static Fallback Spec
range: string

message
type: Property
comment: Provides the message for a static fallback specification.
alternate name: message
sub property of: message
domain: Ad Creative Static Fallback Spec
range: string

name
type: Property
comment: Provides the name of a static fallback specification.
alternate name: name
sub property of: name
domain: Ad Creative Static Fallback Spec
range: string

branded content shared to sponsor status
type: Property
comment: Indicates the branded-content sharing status for the sponsor.
alternate name: branded_content_shared_to_sponsor_status
sub property of: branded content shared to sponsor status
domain: Ad Creative Photo Data
range: string

branded content sponsor page id
type: Property
comment: Identifies the Page of the branded-content sponsor.
alternate name: branded_content_sponsor_page_id
sub property of: branded content sponsor page id
domain: Ad Creative Photo Data
range: string

caption
type: Property
comment: Contains the caption associated with the photo.
alternate name: caption
sub property of: caption
domain: Ad Creative Photo Data
range: string

image hash
type: Property
comment: Identifies the image associated with the photo data.
alternate name: image_hash
sub property of: image hash
domain: Ad Creative Photo Data
range: string

page welcome message
type: Property
comment: Contains the Page welcome message associated with the photo.
alternate name: page_welcome_message
sub property of: page welcome message
domain: Ad Creative Photo Data
range: string

url
type: Property
comment: Contains the URL associated with the photo.
alternate name: url
sub property of: url
domain: Ad Creative Photo Data
range: string

product id
type: Property
comment: Identifies the product associated with the product data.
alternate name: product_id
sub property of: product id
domain: Ad Creative Product Data
range: string

product source
type: Property
comment: Identifies the source of the product data.
alternate name: product_source
sub property of: product source
domain: Ad Creative Product Data
range: string

message
type: Property
comment: Provides the message in the text creative data.
alternate name: message
sub property of: message
domain: Ad Creative Text Data
range: string

additional image index
type: Property
comment: Identifies an additional image index associated with the video creative data.
alternate name: additional_image_index
sub property of: additional image index
domain: Ad Creative Video Data
range: int

branded content shared to sponsor status
type: Property
comment: Indicates the branded content sharing status for the sponsor.
alternate name: branded_content_shared_to_sponsor_status
sub property of: branded content shared to sponsor status
domain: Ad Creative Video Data
range: string

branded content sponsor page id
type: Property
comment: Identifies the sponsor page associated with the branded content.
alternate name: branded_content_sponsor_page_id
sub property of: branded content sponsor page id
domain: Ad Creative Video Data
range: string

call to action
type: Property
comment: Provides the call to action for the video creative.
alternate name: call_to_action
sub property of: call to action
domain: Ad Creative Video Data
range: Ad Creative Link Data Call To Action

collection thumbnails
type: Property
comment: Provides thumbnail information for the collection associated with the video creative.
alternate name: collection_thumbnails
sub property of: collection thumbnails
domain: Ad Creative Video Data
range: Ad Creative Collection Thumbnail Info

customization rules spec
type: Property
comment: Provides customization rules for the video creative.
alternate name: customization_rules_spec
sub property of: customization rules spec
domain: Ad Creative Video Data
range: Ad Customization Rule Spec

image hash
type: Property
comment: Identifies the image associated with the video creative by its hash.
alternate name: image_hash
sub property of: image hash
domain: Ad Creative Video Data
range: string

image url
type: Property
comment: Provides the URL of the image associated with the video creative.
alternate name: image_url
sub property of: image url
domain: Ad Creative Video Data
range: string

link description
type: Property
comment: Provides the description associated with the creative link.
alternate name: link_description
sub property of: link description
domain: Ad Creative Video Data
range: string

message
type: Property
comment: Provides the message for the video creative.
alternate name: message
sub property of: message
domain: Ad Creative Video Data
range: string

offer id
type: Property
comment: Identifies the offer associated with the video creative.
alternate name: offer_id
sub property of: offer id
domain: Ad Creative Video Data
range: string

page welcome message
type: Property
comment: Provides the welcome message associated with the page.
alternate name: page_welcome_message
sub property of: page welcome message
domain: Ad Creative Video Data
range: string

post click configuration
type: Property
comment: Provides configuration for the experience after a click on the video creative.
alternate name: post_click_configuration
sub property of: post click configuration
domain: Ad Creative Video Data
range: Ad Creative Post Click Configuration

retailer item ids
type: Property
comment: Identifies retailer items associated with the video creative.
alternate name: retailer_item_ids
sub property of: retailer item ids
domain: Ad Creative Video Data
range: string

targeting
type: Property
comment: Provides targeting information for the video creative.
alternate name: targeting
sub property of: targeting
domain: Ad Creative Video Data
range: Targeting

title
type: Property
comment: Provides the title of the video creative.
alternate name: title
sub property of: title
domain: Ad Creative Video Data
range: string

video id
type: Property
comment: Identifies the video associated with the creative.
alternate name: video_id
domain: Ad Creative Video Data
range: string

app
type: Property
comment: Represents the app destination in the omnichannel link specification.
alternate name: app
sub property of: app
domain: Ad Creative Omnichannel Link Spec
range: JSON

web
type: Property
comment: Represents the web destination in the omnichannel link specification.
alternate name: web
sub property of: web
domain: Ad Creative Omnichannel Link Spec
range: JSON

instagram
type: Property
comment: Represents the Instagram customization for the creative.
alternate name: instagram
domain: Ad Creative Platform Customization
range: JSON

carousel delivery mode
type: Property
comment: Identifies the delivery mode for the portrait carousel customization.
alternate name: carousel_delivery_mode
sub property of: carousel delivery mode
domain: Ad Creative Portrait Customizations
range: string

specifications
type: Property
comment: Represents the specifications for the portrait customization.
alternate name: specifications
sub property of: specifications
domain: Ad Creative Portrait Customizations
range: JSON

preferred events
type: Property
comment: Represents the events preferred by the recommender settings.
alternate name: preferred_events
sub property of: preferred events
domain: Ad Creative Recommender Settings
range: string

product sales channel
type: Property
comment: Identifies the product sales channel used by the recommender settings.
alternate name: product_sales_channel
sub property of: product sales channel
domain: Ad Creative Recommender Settings
range: string

australia finserv
type: Property
comment: Represents the Australia financial-services regulatory disclaimer.
alternate name: australia_finserv
sub property of: australia finserv
domain: Ad Creative Regional Regulation Disclaimer
range: JSON

india finserv
type: Property
comment: Represents the India financial-services regulatory disclaimer.
alternate name: india_finserv
sub property of: india finserv
domain: Ad Creative Regional Regulation Disclaimer
range: JSON

singapore universal
type: Property
comment: Represents the Singapore universal regulatory disclaimer.
alternate name: singapore_universal
sub property of: singapore universal
domain: Ad Creative Regional Regulation Disclaimer
range: JSON

taiwan finserv
type: Property
comment: Represents the Taiwan financial-services regulatory disclaimer.
alternate name: taiwan_finserv
sub property of: taiwan finserv
domain: Ad Creative Regional Regulation Disclaimer
range: JSON

taiwan universal
type: Property
comment: Represents the Taiwan universal regulatory disclaimer.
alternate name: taiwan_universal
sub property of: taiwan universal
domain: Ad Creative Regional Regulation Disclaimer
range: JSON

destination type
type: Property
comment: The type of destination specified for the ad creative.
alternate name: destination_type
sub property of: destination type
domain: Ad Creative Destination Spec
range: string

native commerce experience
type: Property
comment: The native commerce experience specified as a destination.
alternate name: native_commerce_experience
sub property of: native commerce experience
domain: Ad Creative Destination Spec
range: JSON

website
type: Property
comment: The website specified as a destination.
alternate name: website
domain: Ad Creative Destination Spec
range: JSON

customizations
type: Property
comment: The customizations associated with the format transformation.
alternate name: customizations
domain: Ad Creative Format Transformation Spec
range: JSON

data source
type: Property
comment: The data source associated with the format transformation.
alternate name: data_source
sub property of: data source
domain: Ad Creative Format Transformation Spec
range: string

format
type: Property
comment: The format specified for the format transformation.
alternate name: format
domain: Ad Creative Format Transformation Spec
range: string

bodies
type: Property
comment: Represents the body content supplied for media sourcing.
alternate name: bodies
domain: Ad Creative Media Sourcing Spec
range: JSON

descriptions
type: Property
comment: Represents the descriptions supplied for media sourcing.
alternate name: descriptions
domain: Ad Creative Media Sourcing Spec
range: JSON

destinations
type: Property
comment: Represents the destinations supplied for media sourcing.
alternate name: destinations
sub property of: destinations
domain: Ad Creative Media Sourcing Spec
range: JSON

images
type: Property
comment: Represents the images supplied for media sourcing.
alternate name: images
domain: Ad Creative Media Sourcing Spec
range: JSON

push metadata ids
type: Property
comment: Identifies the push metadata associated with media sourcing.
alternate name: push_metadata_ids
sub property of: push metadata ids
domain: Ad Creative Media Sourcing Spec
range: string

related media
type: Property
comment: Represents media related to the media sourcing specification.
alternate name: related_media
sub property of: related media
domain: Ad Creative Media Sourcing Spec
range: JSON

titles
type: Property
comment: Represents the titles supplied for media sourcing.
alternate name: titles
domain: Ad Creative Media Sourcing Spec
range: JSON

videos
type: Property
comment: Represents the videos supplied for media sourcing.
alternate name: videos
domain: Ad Creative Media Sourcing Spec
range: JSON

asset customization
type: Property
comment: Contains asset customization details for the marketing message.
alternate name: asset_customization
sub property of: asset customization
domain: Ad Creative Marketing Message Structured Spec
range: JSON

autoreply
type: Property
comment: Contains autoreply details for the marketing message.
alternate name: autoreply
sub property of: autoreply
domain: Ad Creative Marketing Message Structured Spec
range: JSON

buttons
type: Property
comment: Represents the buttons included in the structured marketing message.
alternate name: buttons
sub property of: buttons
domain: Ad Creative Marketing Message Structured Spec
range: JSON

conversation template id
type: Property
comment: Identifies the conversation template associated with the structured marketing message.
alternate name: conversation_template_id
sub property of: conversation template id
domain: Ad Creative Marketing Message Structured Spec
range: string

footer
type: Property
comment: Contains the footer text for the structured marketing message.
alternate name: footer
sub property of: footer
domain: Ad Creative Marketing Message Structured Spec
range: string

greeting
type: Property
comment: Contains the greeting text for the structured marketing message.
alternate name: greeting
sub property of: greeting
domain: Ad Creative Marketing Message Structured Spec
range: string

is optimized text
type: Property
comment: Indicates whether the structured marketing message uses optimized text.
alternate name: is_optimized_text
sub property of: is optimized text
domain: Ad Creative Marketing Message Structured Spec
range: boolean

language
type: Property
comment: Identifies the language of the structured marketing message.
alternate name: language
sub property of: language
domain: Ad Creative Marketing Message Structured Spec
range: string

offer
type: Property
comment: Represents the offer included in the structured marketing message.
alternate name: offer
domain: Ad Creative Marketing Message Structured Spec
range: JSON

referenced adgroup id
type: Property
comment: Identifies the ad group referenced by the structured marketing message.
alternate name: referenced_adgroup_id
sub property of: referenced adgroup id
domain: Ad Creative Marketing Message Structured Spec
range: string

whats app business phone number id
type: Property
comment: Identifies the WhatsApp Business phone number associated with the structured marketing message.
alternate name: whats_app_business_phone_number_id
sub property of: whats app business phone number id
domain: Ad Creative Marketing Message Structured Spec
range: string

enabled
type: Property
comment: Indicates whether product suggestions are enabled.
alternate name: enabled
sub property of: enabled
domain: Ad Creative Product Suggestion Settings
range: boolean

groups
type: Property
comment: The asset groups included in the asset-groups specification.
alternate name: groups
domain: Ad Creative Asset Groups Spec
range: JSON

origin
type: Property
comment: The origin specified for the asset groups.
alternate name: origin
sub property of: origin
domain: Ad Creative Asset Groups Spec
range: string

origins
type: Property
comment: The origins specified for the asset groups.
alternate name: origins
sub property of: origins
domain: Ad Creative Asset Groups Spec
range: string

error code
type: Property
comment: Provides the code identifying the ad group issue.
alternate name: error_code
sub property of: error code
domain: Adgroup Issues Info
range: int

error message
type: Property
comment: Provides the message describing the ad group issue.
alternate name: error_message
sub property of: error message
domain: Adgroup Issues Info
range: string

error summary
type: Property
comment: Provides a summary of the ad group issue.
alternate name: error_summary
sub property of: error summary
domain: Adgroup Issues Info
range: string

error type
type: Property
comment: Identifies the type of ad group issue.
alternate name: error_type
sub property of: error type
domain: Adgroup Issues Info
range: string

level
type: Property
comment: Indicates the level associated with the ad group issue.
alternate name: level
sub property of: level
domain: Adgroup Issues Info
range: string

mid
type: Property
comment: Provides the identifier associated with the ad group issue.
alternate name: mid
sub property of: mid
domain: Adgroup Issues Info
range: string

audience network positions
type: Property
comment: Represents the selected Audience Network positions for the placement.
alternate name: audience_network_positions
sub property of: audience network positions
domain: Placement
range: string

device platforms
type: Property
comment: Represents the device platforms selected for the placement, including desktop or mobile.
alternate name: device_platforms
sub property of: device platforms
domain: Placement
range: string
code list: PlacementDevicePlatforms

effective audience network positions
type: Property
comment: Represents the effective Audience Network positions for the placement.
alternate name: effective_audience_network_positions
sub property of: effective audience network positions
domain: Placement
range: string

effective device platforms
type: Property
comment: Represents the effective device platforms for the placement, including desktop or mobile.
alternate name: effective_device_platforms
sub property of: effective device platforms
domain: Placement
range: string
code list: PlacementEffectiveDevicePlatforms

effective facebook positions
type: Property
comment: Represents the effective Facebook positions for the placement.
alternate name: effective_facebook_positions
sub property of: effective facebook positions
domain: Placement
range: string

effective instagram positions
type: Property
comment: Represents the effective Instagram positions for the placement.
alternate name: effective_instagram_positions
sub property of: effective instagram positions
domain: Placement
range: string

effective messenger positions
type: Property
comment: Represents the effective Messenger positions for the placement.
alternate name: effective_messenger_positions
sub property of: effective messenger positions
domain: Placement
range: string

effective oculus positions
type: Property
comment: Represents the effective Oculus positions for the placement.
alternate name: effective_oculus_positions
sub property of: effective oculus positions
domain: Placement
range: string

effective publisher platforms
type: Property
comment: Represents the effective publisher platforms for the placement.
alternate name: effective_publisher_platforms
sub property of: effective publisher platforms
domain: Placement
range: string

effective threads positions
type: Property
comment: Represents the effective Threads positions for the placement.
alternate name: effective_threads_positions
sub property of: effective threads positions
domain: Placement
range: string

effective whatsapp positions
type: Property
comment: Represents the effective WhatsApp positions for the placement.
alternate name: effective_whatsapp_positions
sub property of: effective whatsapp positions
domain: Placement
range: string

facebook positions
type: Property
comment: Represents the selected Facebook positions for the placement.
alternate name: facebook_positions
sub property of: facebook positions
domain: Placement
range: string

instagram positions
type: Property
comment: Represents the selected Instagram positions for the placement.
alternate name: instagram_positions
sub property of: instagram positions
domain: Placement
range: string

messenger positions
type: Property
comment: Represents the selected Messenger positions for the placement.
alternate name: messenger_positions
sub property of: messenger positions
domain: Placement
range: string

oculus positions
type: Property
comment: Represents the selected Oculus positions for the placement.
alternate name: oculus_positions
sub property of: oculus positions
domain: Placement
range: string

publisher platforms
type: Property
comment: Represents the publisher platforms selected for the placement.
alternate name: publisher_platforms
sub property of: publisher platforms
domain: Placement
range: string

threads positions
type: Property
comment: Represents the selected Threads positions for the placement.
alternate name: threads_positions
sub property of: threads positions
domain: Placement
range: string

whatsapp positions
type: Property
comment: Represents the selected WhatsApp positions for the placement.
alternate name: whatsapp_positions
sub property of: whatsapp positions
domain: Placement
range: string

custom conversion
type: Property
comment: Represents the custom conversion configuration associated with tracking and conversion defaults.
alternate name: custom_conversion
sub property of: custom conversion
domain: Tracking And Conversion With Defaults
range: JSON

custom tracking
type: Property
comment: Represents the custom tracking configuration associated with tracking and conversion defaults.
alternate name: custom_tracking
sub property of: custom tracking
domain: Tracking And Conversion With Defaults
range: JSON

default conversion
type: Property
comment: Represents the default conversion configuration associated with tracking and conversion defaults.
alternate name: default_conversion
sub property of: default conversion
domain: Tracking And Conversion With Defaults
range: JSON

default tracking
type: Property
comment: Represents the default tracking configuration associated with tracking and conversion defaults.
alternate name: default_tracking
sub property of: default tracking
domain: Tracking And Conversion With Defaults
range: JSON

1d click
type: Property
comment: A statistic for actions attributed to clicks within a one-day window.
alternate name: 1d_click
domain: Ads Action Stats
range: string

1d click all conversions
type: Property
comment: A statistic for all conversions attributed to clicks within a one-day window.
alternate name: 1d_click_all_conversions
domain: Ads Action Stats
range: string

1d click first conversion
type: Property
comment: A statistic for first conversions attributed to clicks within a one-day window.
alternate name: 1d_click_first_conversion
domain: Ads Action Stats
range: string

1d ev
type: Property
comment: A statistic for event-related results attributed within a one-day window after a click.
alternate name: 1d_ev
domain: Ads Action Stats
range: string

1d ev all conversions
type: Property
comment: A statistic for all event-related conversions attributed within a one-day window after a click.
alternate name: 1d_ev_all_conversions
domain: Ads Action Stats
range: string

1d ev first conversion
type: Property
comment: A statistic for first event-related conversions attributed within a one-day window after a click.
alternate name: 1d_ev_first_conversion
domain: Ads Action Stats
range: string

1d passback
type: Property
comment: A statistic for passback activity associated with a one-day window.
alternate name: 1d_passback
domain: Ads Action Stats
range: string

1d sequenced
type: Property
comment: A statistic for sequenced activity associated with a one-day window.
alternate name: 1d_sequenced
domain: Ads Action Stats
range: string

1d view
type: Property
comment: A statistic for actions attributed to views within a one-day window.
alternate name: 1d_view
domain: Ads Action Stats
range: string

1d view all conversions
type: Property
comment: A statistic for all conversions attributed to views within a one-day window.
alternate name: 1d_view_all_conversions
domain: Ads Action Stats
range: string

1d view first conversion
type: Property
comment: A statistic for first conversions attributed to views within a one-day window.
alternate name: 1d_view_first_conversion
domain: Ads Action Stats
range: string

28d click
type: Property
comment: A statistic for actions attributed to clicks within a 28-day window.
alternate name: 28d_click
domain: Ads Action Stats
range: string

28d click all conversions
type: Property
comment: A statistic for all conversions attributed to clicks within a 28-day window.
alternate name: 28d_click_all_conversions
domain: Ads Action Stats
range: string

28d click first conversion
type: Property
comment: A statistic for first conversions attributed to clicks within a 28-day window.
alternate name: 28d_click_first_conversion
domain: Ads Action Stats
range: string

28d passback
type: Property
comment: A statistic for passback activity associated with a 28-day window.
alternate name: 28d_passback
domain: Ads Action Stats
range: string

28d sequenced
type: Property
comment: A statistic for sequenced activity associated with a 28-day window.
alternate name: 28d_sequenced
domain: Ads Action Stats
range: string

28d view
type: Property
comment: A statistic for actions attributed to views within a 28-day window.
alternate name: 28d_view
domain: Ads Action Stats
range: string

28d view all conversions
type: Property
comment: A statistic for all conversions attributed to views within a 28-day window.
alternate name: 28d_view_all_conversions
domain: Ads Action Stats
range: string

28d view first conversion
type: Property
comment: A statistic for first conversions attributed to views within a 28-day window.
alternate name: 28d_view_first_conversion
domain: Ads Action Stats
range: string

7d click
type: Property
comment: A statistic for actions attributed to clicks within a seven-day window.
alternate name: 7d_click
domain: Ads Action Stats
range: string

7d click all conversions
type: Property
comment: A statistic for all conversions attributed to clicks within a seven-day window.
alternate name: 7d_click_all_conversions
domain: Ads Action Stats
range: string

7d click first conversion
type: Property
comment: A statistic for first conversions attributed to clicks within a seven-day window.
alternate name: 7d_click_first_conversion
domain: Ads Action Stats
range: string

7d passback
type: Property
comment: A statistic for passback activity associated with a seven-day window.
alternate name: 7d_passback
domain: Ads Action Stats
range: string

7d sequenced
type: Property
comment: A statistic for sequenced activity associated with a seven-day window.
alternate name: 7d_sequenced
domain: Ads Action Stats
range: string

7d view
type: Property
comment: A statistic for actions attributed to views within a seven-day window.
alternate name: 7d_view
domain: Ads Action Stats
range: string

7d view all conversions
type: Property
comment: A statistic for all conversions attributed to views within a seven-day window.
alternate name: 7d_view_all_conversions
domain: Ads Action Stats
range: string

7d view first conversion
type: Property
comment: A statistic for first conversions attributed to views within a seven-day window.
alternate name: 7d_view_first_conversion
domain: Ads Action Stats
range: string

action brand
type: Property
comment: The brand associated with the action.
alternate name: action_brand
sub property of: action brand
domain: Ads Action Stats
range: string

action canvas component id
type: Property
comment: An identifier for the canvas component associated with the action.
alternate name: action_canvas_component_id
sub property of: action canvas component id
domain: Ads Action Stats
range: string

action canvas component name
type: Property
comment: The name of the canvas component associated with the action.
alternate name: action_canvas_component_name
sub property of: action canvas component name
domain: Ads Action Stats
range: string

action carousel card id
type: Property
comment: An identifier for the carousel card associated with the action.
alternate name: action_carousel_card_id
sub property of: action carousel card id
domain: Ads Action Stats
range: string

action carousel card name
type: Property
comment: The name of the carousel card associated with the action.
alternate name: action_carousel_card_name
sub property of: action carousel card name
domain: Ads Action Stats
range: string

action category
type: Property
comment: The category associated with the action.
alternate name: action_category
sub property of: action category
domain: Ads Action Stats
range: string

action converted product id
type: Property
comment: An identifier for the product associated with the converted action.
alternate name: action_converted_product_id
sub property of: action converted product id
domain: Ads Action Stats
range: string

action destination
type: Property
comment: The destination associated with the action.
alternate name: action_destination
sub property of: action destination
domain: Ads Action Stats
range: string

action device
type: Property
comment: The device associated with the action.
alternate name: action_device
sub property of: action device
domain: Ads Action Stats
range: string

action event channel
type: Property
comment: The event channel associated with the action.
alternate name: action_event_channel
sub property of: action event channel
domain: Ads Action Stats
range: string

action link click destination
type: Property
comment: The destination associated with the action’s link click.
alternate name: action_link_click_destination
sub property of: action link click destination
domain: Ads Action Stats
range: string

action location code
type: Property
comment: The location code associated with the action.
alternate name: action_location_code
sub property of: action location code
domain: Ads Action Stats
range: string

action reaction
type: Property
comment: The reaction associated with the action.
alternate name: action_reaction
sub property of: action reaction
domain: Ads Action Stats
range: string

action target id
type: Property
comment: An identifier for the target associated with the action.
alternate name: action_target_id
sub property of: action target id
domain: Ads Action Stats
range: string

action type
type: Property
comment: The type of action represented by the statistic.
alternate name: action_type
domain: Ads Action Stats
range: string

action video asset id
type: Property
comment: An identifier for the video asset associated with the action.
alternate name: action_video_asset_id
sub property of: action video asset id
domain: Ads Action Stats
range: string

action video sound
type: Property
comment: The sound information associated with the action’s video.
alternate name: action_video_sound
sub property of: action video sound
domain: Ads Action Stats
range: string

action video type
type: Property
comment: The type of video associated with the action.
alternate name: action_video_type
sub property of: action video type
domain: Ads Action Stats
range: string

custom
type: Property
comment: A custom value associated with the action statistic.
alternate name: custom
domain: Ads Action Stats
range: string

dda
type: Property
comment: A DDA value associated with the action statistic.
alternate name: dda
domain: Ads Action Stats
range: string

incrementality
type: Property
comment: An incrementality value associated with the action statistic.
alternate name: incrementality
domain: Ads Action Stats
range: string

incrementality all conversions
type: Property
comment: Represents incrementality statistics for all conversions in AdsActionStats.
alternate name: incrementality_all_conversions
domain: Ads Action Stats
range: string

incrementality first conversion
type: Property
comment: Represents incrementality statistics for the first conversion in AdsActionStats.
alternate name: incrementality_first_conversion
domain: Ads Action Stats
range: string

inline
type: Property
comment: Represents an inline action statistic in AdsActionStats.
alternate name: inline
domain: Ads Action Stats
range: string

interactive component sticker id
type: Property
comment: Represents the identifier of an interactive component sticker associated with the action statistics.
alternate name: interactive_component_sticker_id
sub property of: interactive component sticker id
domain: Ads Action Stats
range: string

interactive component sticker response
type: Property
comment: Represents a response to an interactive component sticker in the action statistics.
alternate name: interactive_component_sticker_response
sub property of: interactive component sticker response
domain: Ads Action Stats
range: string

promoted product set result
type: Property
comment: Represents the result associated with the promoted product set in AdsActionStats.
alternate name: promoted_product_set_result
sub property of: promoted product set result
domain: Ads Action Stats
range: string

skan click
type: Property
comment: Represents SKAdNetwork statistics attributed to clicks in AdsActionStats.
alternate name: skan_click
domain: Ads Action Stats
range: string

skan click second postback
type: Property
comment: Represents SKAdNetwork statistics from the second click postback in AdsActionStats.
alternate name: skan_click_second_postback
domain: Ads Action Stats
range: string