Metadata for Ontology Description and publication
type: Semantic Artefact
acronym: MOD
title: Metadonnées pour la Description et la publication d'Ontologies @fr
title: Metadatos para la Descripción y Publicación de Ontologías @es
ontology IRI: mod
URI: https://w3id.org/mod
version IRI: https://w3id.org/mod/3.2
version information: 3.2.3
status: alpha
deprecated: false
representation language: OWL
formality level: Vocabulary
syntax: Turtle
language: en
language: fr
language: es
generic type: TaskOntology
access rights: MOD is licensed under the Creative Commons Attribution 4.0. For details, see here: https://github.com/sifrproject/MOD-Ontology/blob/master/LICENSE
access rights: MOD est disponible sous Licence Creative Commons Attribution 4.0. pour plus de details voir https://github.com/sifrproject/MOD-Ontology/blob/master/LICENSE @fr
access rights: MOD está disponible bajo la licencia Creative Commons Attribution 4.0. para obtener más detalles, consulte https://github.com/sifrproject/MOD-Ontology/blob/master/LICENSE @es
license: https://creativecommons.org/licenses/by/4.0
use guidelines: MOD is free to use; feedback is welcome.
use guidelines: MOD peut être utilisée de manière libre; les retours sont appréciés @fr
use guidelines: MOD se puede utilizar de libremente; los comentarios y las devoluciones son bienvenidas @es
more permissions: https://github.com/sifrproject/MOD-Ontology/blob/master/LICENSE
rights holder: Indian Statistical Institute and University of Montpellier
rights holder: Institut Indien de la Statistique et Université de Montpellier @fr
description: MOD (Metadata for Ontology Description and publication) is a project to define a standard way to capture metadata descriptions for ontologies or semantic resources/artefacts in general (thesaurus, terminologies, vocabularies, etc.). The MOD OWL file can be used to create knowledge bases consisting of metadata records of semantic artefacts as instances. MOD can also be used to define specific profiles for recommended metadata properties (e.g., H2020 project FAIRsFAIR semantic artefact minimum metadata profile). Users can go through MOD and pick the required properties to describe their semantic artefacts.
description: MOD (Metadonnées pour la Description et la publication d'Ontologie) est un projet visant à définir un moyen standard pour capturer des descriptions de métadonnées pour les ontologies ou les ressources/artefacts sémantiques en général (thésaurus, terminologies, vocabulaires, etc.). Le fichier MOD OWL peut être utilisé pour créer des bases de connaissances composées d’instances d’artefacts sémantiques décrits avec MOD. Le vocabulaire MOD peut également être utilisé pour définir des profils de métadonnées (e.g., le profil de métadonnées minimale pour les artefacts sémantiques du projet H2020 FAIRsFAIR). Les utilisateurs peuvent consulter la spécification et récupérer les propriétés requises pour décrire leur artefacts sémantiques. @fr
description: MOD (Metadatos para la Descripción y Publicación de Ontologías) es un proyecto para definir un manera estándar de capturar las descripciones de metadatos para ontologías o recursos/artefactos semánticos en general (tesauros, terminologías, vocabularios, etc.). El archivo MOD se puede usar para crear bases de conocimiento consistentes en registros de metadatos de artefactos semánticos como instancias. El vocabulario MOD puede utilizarse también para definir perfiles específicos para las propiedades de metadatos recomendadas (e.g. el perfil de metadatos mínimo del projecto H2020 FAIRsFAIR). Los usuarios pueden recorrer MOD y elegir las propiedades requeridas para describir su artefactos semánticos. @es
comment: This project is connected to the work done within AgroPortal (since MOD1.4). MOD 3.0 is work in progress now within the FAIR-IMPACT Horizon Europe project.
comment: Ce projet est lié au travail mis en œuvre dans AgroPortal (depuis MOD1.4). MOD 3.0 est actuellement en cours de développement au sein du projet Horizon Europe FAIR-IMPACT. @fr
comment: Este proyecto está relacionado con el trabajo realizado en AgroPortal (desde MOD1.4). MOD 3.0 es un trabajo en curso en el marco del proyecto Horizonte Europa FAIR-IMPACT. @es
keyword: metadata description, metadata vocabularies, ontology description, ontology profile
keyword: description de métadonnées, vocabulaires de métadonnées, description d'ontologie, profil d'ontologie @fr
keyword: descripción de metadatatos, vocabularies de metadatos, descripción de ontologías, perfil de ontologías @es
alternative name: MOD Vocabulary
alternative name: Vocabulaire MOD @fr
alternative name: MOD Ontology Metadata model
alternative name: Modèle de métadonnées d'ontologie MOD @fr
hidden label: MOD-Ontology
abstract: MOD provides a set of properties which can be used by ontology or semantic artefact developers, or by semantic artefact catalogues (e.g., library, registry, repository, portal), to describe and publish semantic artefacts. The enriched description of semantic artefacts, in turn, will help users to search, discover, identify and select semantic artefacts.
abstract: MOD fournit un ensemble de propriétés pouvant être utilisées par les développeurs d’ontologies, d'artefact sémantique ou les catalogues d'artéfact sémantiques (portails, registre, bibliothèque), pour décrire et publier des artefacts sémantiques. La description enrichie des artefacts sémantiques aidera les utilisateurs à rechercher, découvrir, identifier et sélectionner des artefacts sémantiques. @fr
abstract: MOD provee un conjunto de propiedades que pueden usarse por desarroladores de ontologías, o artefactos semánticos, o catálogos de artefactos semánticos (e.g., registros, repositorios, portales), para describir y publicar artefactos semánticos. La descripción enriquecida de artefactos semánticos, a su vez, ayudará a los usuarios a buscar, descubrir, identificar y seleccionar los artefactos semánticos. @es
référence bibliographique: 978-3-319-70863-8 17
est référencé par: journal.pcbi.1009041
est référencé par: 978-3-031-47243-5 3
est référencé par: 978-3-031-11609-4 17
est référencé par: https://doi.org/10.5771/0943-7444-2020-2-138
est référencé par: s13740-018-0091-5
creation date: 2015-08-05
modification date: 2025-12-22
contact point: Biswanath Dutta (bisu@drtc.isibang.ac.in)
contact point: Clement Jonquet (jonquet@lirmm.fr)
creator: Biswanath Dutta (https://orcid.org/0000-0003-3059-8202)
creator: Clement Jonquet (https://orcid.org/0000-0002-2404-1582)
contributor: Anne Toulet (https://orcid.org/0000-0003-0463-0854)
contributor: Luiz Bonino (https://orcid.org/0000-0002-1164-1351)
contributor: Yann Le Franc (https://orcid.org/0000-0003-4631-418X)
contributor: Udaya Varadarajan (https://orcid.org/0000-0002-4936-0272)
contributor: Alejandra Gonzalez-Beltran (https://orcid.org/0000-0003-3499-8262)
contributor: Antony Wilson (https://orcid.org/0000-0001-7336-4823)
curator: Anne Toulet (https://orcid.org/0000-0003-0463-0854)
curator: Alejandra Gonzalez-Beltran (https://orcid.org/0000-0003-3499-8262)
curator: Clement Jonquet (https://orcid.org/0000-0002-2404-1582)
translator: Alejandra Gonzalez-Beltran (https://orcid.org/0000-0003-3499-8262)
translator: Clement Jonquet (https://orcid.org/0000-0002-2404-1582)
publisher: Indian Statistical Institute, Bangalore Centre, India (https://www.isibang.ac.in)
publisher: LIRMM, University of Montpellier, France (http://www.lirmm.fr)
funded or sponsored by: Indian Statistical Institute, University of Montpellier, French National Research Agency, European Union’s Horizon 2020 research and innovation programme under the Marie Sklodowska-Curie and Horizon Europe INFRAEOSC program.
funding: French ANR: ANR-10-LABX-20, ANR-11-BINF-0002, ANR-19-DATA-0019, European Union: No 701771, No 831558, No 101057344.
endorsed by: OntoPortal Alliance
endorsed by: Alliance OntoPortal @fr
endorsed by: Alianza OntoPortal @es
group: Semantic Web metadata vocabularies
used in project: Following OntoPortal-based catalogues: AgroPortal, EcoPortal, EarthPortal, BiodivPortal, IndustryPortal; projects SIFR, D2KAB, FAIRsFAIR, FAIR-IMPACT.
used in project: Catalogues basés sur OntoPortal suivants : AgroPortal, EcoPortal, EarthPortal, BiodivPortal, IndustryPortal; projets SIFR, D2KAB, FAIRsFAIR, FAIR-IMPACT. @fr
used in project: Siguiendo los catálogos basados en OntoPortal: AgroPortal, EcoPortal, EarthPortal, BiodivPortal, IndustryPortal; proyectos SIFR, D2KAB, FAIRsFAIR, FAIR-IMPACT. @es
target audience: MOD primary targets ontology (or semantic resource/artefact) developers and semantic artefact catalogue providers.

MODString
type: Datatype
equivalent class: Datatype
  union of: langString
  union of: string

Semantic Artefact
type: Class
subclass of: Resource
label: Artéfact Sémantique @fr
label: Artefacto Semántico @es
description: Semantic Artefact is defined here as a machine-actionable and -readable formalisation of a conceptualisation enabling sharing and reuse by humans and machines. These artefacts may have a broad range of formalisation, from loose set of terms, taxonomies, or thesauri to higher-order logics such as ontologies, and include the concepts/terms/classes/properties/individuals constituting these. Moreover, semantic artefacts are encoded with a variety of representation language (e.g., RDF-S, OWL, SKOS) and serialised using a variety of syntaxes (e.g., RDF/XML, Turtle, JSON-LD).
description: Un artefact sémantique est défini ici comme une formalisation exploitable et lisible par machine d'une conceptualisation permettant le partage et la réutilisation par les humains et les machines. Ces artefacts peuvent avoir une large gamme de formalisation, allant d'un ensemble de termes, de taxonomies, de thésaurus à des logiques d'ordre supérieur, telle que des ontologies, et inclure les concepts/termes/classes/propriétés/individus qui les constituent. De plus, les artefacts sémantiques sont enccodés avec une variété de langages de représentation (e.g., RDF-S, OWL, SKOS) et sérialisés à l'aide d'une variété de syntaxes (e.g., RDF/XML, Turtle, JSON-LD). @fr
description: Aquí, se define artefacto semántico como una formalización de una conceptualización que puede ser procesada y leída por máquinas y que permite que humanos y máquinas la compartan y la reutilicen. Estos artefactos pueden tener una amplia gama de formalizaciones, desde conjuntos de términos sueltos, taxonomías y tesauros hasta lógicas de orden superior como las ontologías, e incluyen los conceptos, términos, clases, propiedades e individuos que los constituyen. Además, los artefactos semánticos se codifican con una variedad de lenguajes de representación (por ejemplo, RDF-S, OWL, SKOS) y se serializan utilizando una variedad de sintaxis (por ejemplo, RDF/XML, Turtle, JSON-LD). @es
description: A specification of a conceptualization that may be represented by different levels of formalization (including controlled lists, thesauri and ontologies - either lightweight or heavyweight.
description: Une spécification d'une conceptualisation qui peut être représentée par différents niveaux de formalisation (y compris des listes contrôlées, des thésaurus et des ontologies - soit légères, soit lourdes). @fr
description: Una especificación de una conceptualización que puede ser representada a distintos niveles de formalización (incluyendo listas controladas, tesaurus y ontologías. @es
issued: 2021-12-01
derived from: https://w3id.org/mod/2.0
imported on: 2021-12-01
modification date: 2024-05-31
was influenced by: dcat

Semantic Artefact Distribution
type: Class
subclass of: AssetDistribution
subclass of: Distribution
label: Distribution d'un Artéfact Sémantique @fr
label: Distribución de un Artefacto Semántico @es
description: A specific representation and/or serialization of a semantic artefact.
description: Une représentation et/ou une sérialisation spécifique d'un artéfact sémantique. @fr
description: Una representación y/o serialización específica de un artefacto semántico. @es
issued: 2021-12-01
derived from: https://w3id.org/mod/2.0
imported on: 2021-12-01
modification date: 2024-05-31
was influenced by: dcat

Semantic Artefact Catalog Record
type: Class
subclass of: CatalogRecord
label: Enregistrement d'un Artéfact Sémantique dans un Catalogue @fr
label: Registro de un Artefacto Semántico en un Catálogo @es
description: A record in a catalog, describing the registration of a single semantic artefact
description: Un enregistrement dans un catalogue, décrivant l'enregistrement d'un seul artéfact sémantique @fr
description: Un registro en un catálogo, que describe el registro de un único artefacto semántico. @es
issued: 2021-12-01
derived from: https://w3id.org/mod/2.0
imported on: 2021-12-01
modification date: 2024-05-31
was influenced by: dcat

Semantic Artefact Catalog
type: Class
subclass of: Catalog
label: Catalogue d'Artéfacts Sémantiques @fr
label: Catálogo de Artefactos Semánticos @es
description: A dedicated web-based system that fosters the availability, discoverability and long-term preservation and maintenance of semantic artefacts.
description: Un système Web dédié qui favorise la disponibilité, la découvrabilité et la préservation et la maintenance à long terme des artefacts sémantiques. @fr
description: Un sistema web dedicado que fomenta la disponibilidad, la capacidad de descubrimiento y la preservación y el mantenimiento a largo plazo de artefactos semánticos. @es
issued: 2021-12-01
derived from: https://w3id.org/mod/2.0
imported on: 2021-12-01
modification date: 2024-05-31
was influenced by: dcat

Semantic Artefact Service
type: Class
subclass of: DataService
label: Service d'Artéfacts Sémantiques @fr
label: Servicio de Artefactos Semánticos @es
description: A collection of operations that provides access to one or more semantic artefact processing functions.
description: Un ensemble d’opérations qui donne accès à une ou plusieurs fonctions de traitement d’artefacts sémantiques. @fr
description: Una colección de operaciones que proporciona acceso a una o más funciones de procesamiento de artefactos semánticos. @es
issued: 2021-12-01
derived from: https://w3id.org/mod/2.0
imported on: 2021-12-01
modification date: 2024-05-31
was influenced by: dcat

Taxonomy
type: Class
subclass of: Semantic Artefact
label: Taxonomie @fr
label: Taxonomía @es
description: (to come)
issued: 2021-12-01
derived from: https://w3id.org/mod/2.0
imported on: 2021-12-01
modification date: 2024-05-31

Terminology
type: Class
subclass of: Semantic Artefact
label: Terminologie @fr
label: Terminología @es
description: (to come)
issued: 2021-12-01
derived from: https://w3id.org/mod/2.0
imported on: 2021-12-01
modification date: 2024-05-31

Thesaurus
type: Class
subclass of: Semantic Artefact
label: Thésaurus @fr
label: Tesauro @es
description: (to come)
issued: 2021-12-01
derived from: https://w3id.org/mod/2.0
imported on: 2021-12-01
modification date: 2024-05-31

Analytics
type: Class
label: Analytique @fr
label: Analítica @es
description: (to come)
issued: 2018-08-02
derived from: https://w3id.org/mod/1.4
imported on: 2018-08-02
modification date: 2024-05-31

Semantic Artefact Engineering Methodology
type: Class
label: Méthodologie d’ingénierie des artefacts sémantiques @fr
label: Metodología de ingeniería de artefactos semánticos @es
description: (to come)
issued: 2021-12-01
derived from: https://w3id.org/mod/2.0
imported on: 2021-12-01
modification date: 2024-05-31
was influenced by: ontology
history note: This class has been adopted from OMV Ontology Metadata Vocabulary, and renamed and redefined in the MOD namespace.

Semantic Artefact Evaluation
type: Class
label: Évaluation d'un artefact sémantique @fr
label: Evaluación de un artefacto semántico. @es
description: The results of evaluating a semantic artefact. An artefact can have more than one evaluation.
description: Résultats de l'évaluation d'un artefact sémantique. Un artefact peut avoir plusieurs évaluations. @fr
description: Los resultados de la evaluación de un artefacto semántico. Un artefacto puede tener más de una evaluación. @es
issued: 2015-08-05
derived from: https://w3id.org/mod/1.0
imported on: 2015-08-05
modification date: 2024-05-31

FAIRness assessment
type: Class
subclass of: Semantic Artefact Evaluation
label: Évaluation du niveau de FAIRness @fr
label: Evaluación del nivel de FAIRness @es
description: (to come)
issued: 2024-05-31
derived from: https://w3id.org/mod/1.0
imported on: 2024-05-31

Semantic Artefact Group
type: Class
label: Groupe d'artefacts sémantiques @fr
label: Grupo de artefactos semánticos @es
description: A group of multiple semantic artefacts (e.g., coming from the same source or project).
description: Un groupe de multiples artefacts sémantiques (par exemple, provenant de la même source ou du même projet). @fr
description: Un grupo de artefactos semánticos múltiples (por ejemplo, que provienen de la misma fuente o proyecto). @es
issued: 2018-08-02
derived from: https://w3id.org/mod/1.4
imported on: 2018-08-02
modification date: 2024-05-31

Knowledge Representation Paradigm
type: Class
label: Paradigme de la représentation des connaissances @fr
label: Paradigma de representación del conocimiento @es
description: (to come)
issued: 2021-12-01
derived from: https://w3id.org/mod/2.0
imported on: 2021-12-01
modification date: 2024-05-31
was influenced by: ontology
history note: This class has been adopted from OMV Ontology Metadata Vocabulary, and renamed and redefined in the MOD namespace.

Semantic Artefact Task
type: Class
label: Tâche d'artefact sémantique @fr
label: Tarea de artefacto semántico @es
description: (to come)
issued: 2021-12-01
derived from: https://w3id.org/mod/2.0
imported on: 2021-12-01
modification date: 2024-05-31
was influenced by: ontology
history note: This class has been adopted from OMV Ontology Metadata Vocabulary, and renamed and redefined in the MOD namespace.

acronym
type: DatatypeProperty
sub property of: label
label: acronyme @fr
label: acrónimo @es
domain: Semantic Artefact
range: string
description: MOD: Short acronym label, often used as an identifier within some ontology platforms such as BioPortal or OBO Foundry. OMV: A short name by which an ontology is formally known.
issued: 2009-12-24
equivalent property: acronym
derived from: https://w3id.org/mod/1.0
imported on: 2015-08-05
history note: This property has been adopted from OMV Ontology Metadata Vocabulary and redefined in the MOD namespace.
was influenced by: MIRO guidelines: A.1
was influenced by: FAIR principle: F2
was influenced by: FAIRsFAIR profile: MANDATORY

name
type: Property
sub property of: title
label: nom @fr
domain includes: Semantic Artefact
domain includes: Semantic Artefact Distribution
domain includes: Semantic Artefact Catalog
range: Literal
description: DCTERMS: A name given to the resource. OMV: The name by which an ontology is formally known. RDFS: A human-readable name for the subject. FOAF: A name for some thing. SKOS: The preferred and alternative labels are useful when generating or creating human-readable representations of a knowledge organization system. SCHEMA: The name of the item.
issued: 2008-01-14
equivalent property: label
equivalent property: attributionName
equivalent property: name
equivalent property: prefLabel
derived from: https://w3id.org/mod/1.2
imported on: 2017-07-06
was influenced by: MIRO guidelines: A.1
was influenced by: FAIR principle: F2
was influenced by: FAIRsFAIR profile: MANDATORY

URI
type: DatatypeProperty
domain: Semantic Artefact
range: anyURI
description: OMV: The URI of the ontology which is described by this metadata.
issued: 2009-12-24
equivalent property: URI
derived from: https://w3id.org/mod/1.2
imported on: 2017-07-06
history note: This property has been adopted from OMV Ontology Metadata Vocabulary and redefined in the MOD namespace.
was influenced by: MIRO guidelines: A.4
was influenced by: FAIR principle: F1
was influenced by: FAIRsFAIR profile: OPTIONAL

version IRI
type: OntologyProperty
label: IRI de la version @fr
domain: Ontology
domain includes: Semantic Artefact
range: Ontology
range includes: Semantic Artefact
description: OWL: The property that identifies the version IRI of an ontology.
issued: 2004-02-10
derived from: https://w3id.org/mod/1.2
imported on: 2017-07-06
was influenced by: MIRO guidelines: A.4
was influenced by: FAIR principle: F1
was influenced by: FAIRsFAIR profile: MANDATORY

other identifier
type: Property
sub property of: identifier
label: autre identifiant @fr
domain includes: Semantic Artefact
domain includes: Semantic Artefact Catalog
range: Literal
description: DCTERMS: An unambiguous reference to the resource within a given context. Recommended practice is to identify the resource by means of a string conforming to an identification system. Examples include International Standard Book Number (ISBN), Digital Object Identifier (DOI), and Uniform Resource Name (URN). Persistent identifiers should be provided as HTTP URIs. SKOS: A notation is a string of characters such as 'T58.5' or '303.4833' used to uniquely identify a concept within the scope of a given concept scheme. ADMS: adms:identifier is used to link any resource to an instance of adms:Identifier which is its range. N.B. it is not appropriate to use dcterms:identifer to link to the Identifier class as its range is rdfs:Literal. ADMS uses this to provide any identifier for the Asset. SCHEMA: The identifier property represents any kind of identifier for any kind of Thing, such as ISBNs, GTIN codes, UUIDs etc. Schema.org provides dedicated properties for representing many of these, either as textual strings or as URL (URI) links. DCAT: A unique identifier of the item.
issued: 2008-01-14
equivalent property: notation
equivalent property: identifier
derived from: https://w3id.org/mod/1.0
imported on: 2015-08-05
was influenced by: FAIR principle: F1,A1
was influenced by: FAIRsFAIR profile: MANDATORY

version information
type: AnnotationProperty
label: information de version @fr
domain: Resource
domain includes: Semantic Artefact
domain includes: Semantic Artefact Catalog
range: string
description: MOD: The version of the released ontology. OMV: The version information of the ontology. OWL: The annotation property that provides version information for an ontology or another OWL construct. PAV: The version number of a resource. This is a freetext string, typical values are '1.5' or '21'. DOAP: A project release.
issued: 2004-02-10
equivalent property: version
equivalent property: release
equivalent property: data-version
equivalent property: hasVersion
derived from: https://w3id.org/mod/1.0
imported on: 2015-08-05
was influenced by: MIRO guidelines: A.1
was influenced by: FAIR principle: R1.2

status
type: DatatypeProperty
label: statut @fr
domain: Semantic Artefact
domain: Semantic Artefact Catalog
range: string
description: OMV: It specifies the tracking information for the contents of the ontology. Pre-defined values. IDOT: State of a resource (physical location providing access to data or information about the identified entity). This is should be based on a recent manual or automatic check of the resource. Possible values are: 'up', 'down', 'probably up', 'obsolete resource', 'restricted access' and 'unknown'. SCHEMA: The status of a creative work in terms of its stage in a lifecycle. Example terms include Incomplete, Draft, Published, Obsolete. Some organizations define a set of terms for the stages of their publication lifecycle.
issued: 2009-12-24
equivalent property: state
equivalent property: adms-status
equivalent property: creativeWorkStatus
derived from: https://w3id.org/mod/1.0
imported on: 2015-08-05
history note: This property has been adopted from OMV Ontology Metadata Vocabulary and redefined in the MOD namespace.
was influenced by: FAIR principle: A2
was influenced by: FAIRsFAIR profile: RECOMMENDED

deprecated
type: AnnotationProperty
label: obsolète @fr
domain: Resource
domain includes: Semantic Artefact
domain includes: Semantic Artefact Distribution
domain includes: Semantic Artefact Catalog
range: Resource
description: OWL: The annotation property that indicates that a given entity has been deprecated. IDOT: Indicates if the current dataset is obsolete (not provided any more to the public community). Value can either be 'true' or 'false' (xsd:boolean). The statement is usually omitted if 'false'.
issued: 2004-02-10
equivalent property: obsolete
equivalent property: deprecated
derived from: https://w3id.org/mod/1.1
imported on: 2016-09-02
was influenced by: FAIR principle: A2

representation language
type: DatatypeProperty
label: language de représentation @fr
domain: Semantic Artefact Distribution
range: string
description: MOD: A language that is used to create an ontology. OMV: The ontology language.
issued: 2009-12-24
equivalent property: hasOntologyLanguage
equivalent property: fileFormat
equivalent property: ontologyDesignLanguage
derived from: https://w3id.org/mod/1.0
imported on: 2015-08-05
history note: This property has been adopted from OMV Ontology Metadata Vocabulary and redefined in the MOD namespace.
was influenced by: MIRO guidelines: E.1
was influenced by: FAIR principle: I1
was influenced by: FAIRsFAIR profile: MANDATORY

formality level
type: DatatypeProperty
label: niveau de formalisme @fr
domain: Semantic Artefact
range: string
description: MOD: The level of formality of an ontology. OMV: Level of formality of the ontology.
issued: 2009-12-24
equivalent property: hasFormalityLevel
equivalent property: fileFormat
equivalent property: formalityLevel
derived from: https://w3id.org/mod/1.0
imported on: 2015-08-05
history note: This property has been adopted from OMV Ontology Metadata Vocabulary and redefined in the MOD namespace.
was influenced by: MIRO guidelines: E.1
was influenced by: FAIR principle: I1

syntax
type: DatatypeProperty
label: syntaxe @fr
domain: Semantic Artefact Distribution
range: anyURI
description: MOD: The syntax followed in the creation of an ontology. OMV: The presentation syntax for the ontology langage.
issued: 2009-12-24
equivalent property: hasOntologySyntax
equivalent property: format
equivalent property: syntax
derived from: https://w3id.org/mod/1.0
imported on: 2015-08-05
history note: This property has been adopted from OMV Ontology Metadata Vocabulary and redefined in the MOD namespace.
was influenced by: MIRO guidelines: E.1
was influenced by: FAIR principle: I1
was influenced by: FAIRsFAIR profile: MANDATORY

natural language
type: Property
sub property of: language
label: langage naturel @fr
domain includes: Semantic Artefact
domain includes: Semantic Artefact Catalog
description: DCTERMS: A language of the resource. Recommended practice is to use either a non-literal value representing a language from a controlled vocabulary such as ISO 639-2 or ISO 639-3, or a literal value consisting of an IETF Best Current Practice 47 [[IETF-BCP47](https://tools.ietf.org/html/bcp47)] language tag. OMV: The language of the content of the ontology, i.e. English, French, etc. DOAP: ISO language code a project has been translated into.
issued: 2008-01-14
equivalent property: naturalLanguage
equivalent property: inLanguage
equivalent property: language
derived from: https://w3id.org/mod/1.0
imported on: 2015-08-05
was influenced by: FAIR principle: F2
was influenced by: FAIRsFAIR profile: RECOMMENDED
range includes: LinguisticSystem

generic type
type: Property
sub property of: type
label: type générique @fr
domain includes: Semantic Artefact
domain includes: Semantic Artefact Catalog
description: DCTERMS: The nature or genre of the resource. Recommended practice is to use a controlled vocabulary such as the DCMI Type Vocabulary [[DCMI-TYPE](http://dublincore.org/documents/dcmi-type-vocabulary/)]. To describe the file format, physical medium, or dimensions of the resource, use the property Format. OMV: The nature of the content of the ontology.
issued: 2008-01-14
equivalent property: isOfType
derived from: https://w3id.org/mod/1.2
imported on: 2017-07-06
was influenced by: FAIR principle: F2
was influenced by: FAIRsFAIR profile: MANDATORY

access rights
type: Property
sub property of: rights
label: droits d'accès @fr
domain includes: Semantic Artefact
domain includes: Semantic Artefact Catalog
description: DCTERMS: Information about who access the resource or an indication of its security status. Access Rights may include information regarding access or restrictions based on privacy, security, or other policies. MOD: Information on access (i.e., read, download) to an ontology.
issued: 2003-02-15
equivalent property: accessibility
derived from: https://w3id.org/mod/1.0
imported on: 2015-08-05
was influenced by: FAIR principle: R1.1
was influenced by: FAIRsFAIR profile: MANDATORY
range includes: RightsStatement

license
type: Property
sub property of: rights
label: licence @fr
domain includes: Semantic Artefact
domain includes: Semantic Artefact Catalog
description: DCTERMS: A legal document giving official permission to do something with the resource. Recommended practice is to identify the license document with a URI. If this is not possible or feasible, a literal value that identifies the license may be provided. DCTERMS:rights Information about rights held in and over the resource. OMV: Underlying license model. SCHEMA: A license document that applies to this content, typically indicated by URL.
issued: 2004-06-14
equivalent property: license
derived from: https://w3id.org/mod/1.0
imported on: 2015-08-05
was influenced by: MIRO guidelines: A.3
was influenced by: FAIR principle: A2
was influenced by: FAIRsFAIR profile: MANDATORY
range includes: LicenseDocument

use guidelines
type: Property
sub property of: relation
label: guide d'utilisation @fr
domain: Work
domain includes: Semantic Artefact
domain includes: Semantic Artefact Distribution
domain includes: Semantic Artefact Catalog
range: Resource
description: CC: A related resource which defines non-binding use guidelines for the work.
issued: 2008-03-03
derived from: https://w3id.org/mod/1.4
imported on: 2018-08-02
was influenced by: FAIR principle: R1.1

more permissions
type: Property
sub property of: relation
label: droits d'accès détaillés @fr
domain: Work
domain includes: Semantic Artefact
domain includes: Semantic Artefact Catalog
range: Resource
description: CC: A related resource which describes additional permissions or alternative licenses for a Work which may be available.
issued: 2008-03-03
derived from: https://w3id.org/mod/1.4
imported on: 2018-08-02
was influenced by: FAIR principle: R1.1

rights holder
type: Property
label: détenteur des droits @fr
domain includes: Semantic Artefact
domain includes: Semantic Artefact Catalog
description: DCTERMS: A person or organization owning or managing rights over the resource. MOD: The person who can be contacted to enquire about an ontology. SCHEMA: The party holding the legal copyright to the CreativeWork. DCAT: Relevant contact information for the cataloged resource. Use of vCard is recommended.
issued: 2004-06-14
equivalent property: copyrightHolder
derived from: https://w3id.org/mod/1.2
imported on: 2017-07-06
was influenced by: MIRO guidelines: A.2
was influenced by: FAIR principle: R1.1
was influenced by: FAIRsFAIR profile: MANDATORY
range includes: Agent

target policy
type: Property
type: ObjectProperty
label: politique de la cible @fr
domain: Asset
domain includes: Semantic Artefact
domain includes: Semantic Artefact Catalog
range: Policy
description: ORDL: Identifies an ODRL Policy for which the identified Asset is the target Asset to all the Rules. DCAT: An ODRL conformant policy expressing the rights associated with the resource.
issued: 2018-02-15
derived from: https://w3id.org/mod/3.2
imported on: 2024-06-25
was influenced by: FAIR principle: R1.1

description
type: Property
sub property of: description
domain includes: Semantic Artefact
domain includes: Semantic Artefact Distribution
domain includes: Semantic Artefact Catalog
description: DCTERMS: An account of the resource. Description may include but is not limited to: an abstract, a table of contents, a graphical representation, or a free-text account of the resource. OMV: Free text description of an ontology. SCHEMA: A description of the item. DOAP: Plain text description of a project, of 2-4 sentences in length. DCAT: A free-text account of the item.
issued: 2008-01-14
equivalent property: description
derived from: https://w3id.org/mod/1.0
imported on: 2015-08-05
was influenced by: MIRO guidelines: C.3
was influenced by: FAIR principle: F2
was influenced by: FAIRsFAIR profile: MANDATORY

homepage
type: Property
type: InverseFunctionalProperty
type: ObjectProperty
sub property of: page
sub property of: isPrimaryTopicOf
label: page web @fr
domain: Thing
domain includes: Semantic Artefact
domain includes: Semantic Artefact Catalog Record
domain includes: Semantic Artefact Catalog
range: Document
description: FOAF: A homepage for some thing. MOD: An unambiguous reference to the resource within a given context. DOAP: URI of a blog related to a project. CC: The URL the creator of a Work would like used when attributing re-use. SCHEMA: Indicates a page (or other CreativeWork) for which this thing is the main entity being described.
issued: 2014-01-14
equivalent property: mainEntityOfPage
equivalent property: attributionURL
equivalent property: blog
equivalent property: homepage
derived from: https://w3id.org/mod/1.0
imported on: 2015-08-05
was influenced by: MIRO guidelines: C.3
was influenced by: FAIR principle: F2

documentation
type: Property
type: ObjectProperty
sub property of: page
domain includes: Semantic Artefact
domain includes: Semantic Artefact Catalog
range: Document
description: DCAT: A Web page that can be navigated to in a Web browser to gain access to the dataset, its distributions and/or additional information. MOD: A link to the documentation page on a thing. OMV: URL for further documentation. RDFS: Further information about the subject resource. DOAP: URL of Wiki for collaborative discussion of project. VANN: A reference to a resource that provides information on how this resource is to be used. SCHEMA: Further documentation describing the Web API in more detail.
issued: 2014-01-16
equivalent property: documentation
equivalent property: usageNote
equivalent property: wiki
equivalent property: seeAlso
equivalent property: document
derived from: https://w3id.org/mod/1.0
imported on: 2015-08-05
was influenced by: MIRO guidelines: C.3, F.1
was influenced by: FAIR principle: F2
was influenced by: FAIRsFAIR profile: MANDATORY
scope note: If the distribution(s) are accessible only through a landing page (i.e. direct download URLs are not known), then the landing page link should be duplicated as accessURL on a distribution.

feature list
type: Property
label: liste des fonctionalités @fr
domain includes: Semantic Artefact Catalog
description: SCHEMA: Features or modules provided by this application (and possibly required by other applications).
issued: 2012-04-21
derived from: https://w3id.org/mod/3.2
imported on: 2024-06-25
domain includes: SoftwareApplication
range includes: Text
range includes: URL

notes or comments
type: Property
label: notes ou commentaires @fr
domain: Resource
domain includes: Semantic Artefact
domain includes: Semantic Artefact Catalog
range: Literal
description: RDFS: A description of the subject resource. OMV: Additional information about the ontology that is not included somewhere else (e.g. information that you do not want to include in the documentation). ADMS: A description of changes between this version and the previous version of the Asset.
issued: 2002-04-30
equivalent property: notes
equivalent property: description
equivalent property: versionNotes
derived from: https://w3id.org/mod/1.2
imported on: 2017-07-06
was influenced by: FAIR principle: F2

keyword
type: Property
type: DatatypeProperty
sub property of: subject
label: motclé @fr
domain includes: Semantic Artefact
domain includes: Semantic Artefact Catalog
range: Literal
description: DCAT: A keyword or tag describing a resource. MOD: A keyword(s) is used to describe the content of an ontology. OMV: List of keywords related to an ontology. SCHEMA: Keywords or tags used to describe this content. Multiple entries in a keywords list are typically delimited by commas.
issued: 2014-01-16
equivalent property: keywords
equivalent property: keyword
derived from: https://w3id.org/mod/1.0
imported on: 2015-08-05
was influenced by: MIRO guidelines: C.1
was influenced by: FAIR principle: F2
was influenced by: FAIRsFAIR profile: MANDATORY

alternative name
type: Property
sub property of: title
sub property of: name
label: nom alternatif @fr
domain includes: Semantic Artefact
domain includes: Semantic Artefact Catalog
range: Literal
description: DCTERMS: An alternative name for the resource. The distinction between titles and alternative titles is application-specific. SKOS: The preferred and alternative labels are useful when generating or creating human-readable representations of a knowledge organization system. SCHEMA: An alias for the item. A short label that is used by some communities to refer to a dataset (see 'preferredPrefix').
issued: 2000-07-11
equivalent property: alternatePrefix
equivalent property: alternateName
equivalent property: altLabel
derived from: https://w3id.org/mod/1.2
imported on: 2017-07-06
was influenced by: MIRO guidelines: A.1
was influenced by: FAIR principle: F2

hidden label
type: Property
type: AnnotationProperty
sub property of: label
label: nom caché @fr
domain includes: Semantic Artefact
domain includes: Semantic Artefact Catalog
range: Literal
description: MOD: Hidden or past name. SKOS: A lexical label for a resource that should be hidden when generating visual displays of the resource, but should still be accessible to free text search operations.
issued: 2009-08-18
derived from: https://w3id.org/mod/1.4
imported on: 2018-08-02
was influenced by: MIRO guidelines: A.1
was influenced by: FAIR principle: F2
comment: S12 (not formally stated): The range of skos:hiddenLabel is the class of RDF plain literals. S13 (not formally stated): skos:prefLabel, skos:altLabel and skos:hiddenLabel are pairwise disjoint properties.

abstract
type: Property
sub property of: description
label: résumé @fr
domain includes: Semantic Artefact
domain includes: Semantic Artefact Catalog
description: DCTERMS: A summary of the resource.
issued: 2000-07-11
derived from: https://w3id.org/mod/1.2
imported on: 2017-07-06
was influenced by: FAIR principle: F2

référence bibliographique
type: Property
sub property of: identifier
sub property of: other identifier
label: bibliographic reference
domain includes: Semantic Artefact
domain includes: Semantic Artefact Catalog
range: Literal
description: DCTERMS: A bibliographic reference for the resource. Recommended practice is to include sufficient bibliographic detail to identify the resource as unambiguously as possible. OMV: List of bibliographic references describing the ontology and its applications. FOAF: A document that this thing is the primary topic of
issued: 2003-02-15
equivalent property: reference
equivalent property: isPrimaryTopicOf
equivalent property: citation
derived from: https://w3id.org/mod/1.2
imported on: 2017-07-06
was influenced by: FAIR principle: F2
was influenced by: FAIRsFAIR profile: OPTIONAL

est référencé par
type: Property
sub property of: relation
label: is referenced by
domain includes: Semantic Artefact
domain includes: Semantic Artefact Catalog
description: DCTERMS: A related resource that references, cites, or otherwise points to the described resource. DCAT: A related resource, such as a publication, that references, cites, or otherwise points to the cataloged resource.
issued: 2000-07-11
derived from: https://w3id.org/mod/3.2
imported on: 2024-06-25
was influenced by: FAIR principle: F2

creation date
type: Property
sub property of: date
label: date de création @fr
domain includes: Semantic Artefact Distribution
domain includes: Semantic Artefact Catalog Record
domain includes: Semantic Artefact Catalog
range: Literal
description: DCTERMS:date : A point or period of time associated with an event in the lifecycle of the resource. DCTERMS:created : Date of creation of the resource. DCTERMS:issued Date of formal issuance (e.g., publication) of the resource. PROV: Generation is the completion of production of a new entity by an activity. This entity did not exist before generation and becomes available for usage after this generation. PAV: The date this resource was authored. PAV: The date this resource was contributed to. PAV: The date of creation of the resource representation. DOAP: Date when something was created, in YYYY-MM-DD form. e.g. 2004-04-05. SCHEMA: The date on which the CreativeWork was created or the item was added to a DataFeed. DOAP: Date when something was created, in YYYY-MM-DD form. e.g. 2004-04-05.
issued: 2000-07-11
equivalent property: creationDate
equivalent property: issued
equivalent property: authoredOn
equivalent property: contributedOn
equivalent property: createdOn
equivalent property: dateCreated
equivalent property: created
equivalent property: date
equivalent property: hasDate
equivalent property: generatedAtTime
derived from: https://w3id.org/mod/1.2
imported on: 2017-07-06
was influenced by: FAIR principle: F2
was influenced by: FAIRsFAIR profile: MANDATORY

modification date
type: Property
sub property of: date
label: date de modification @fr
domain includes: Semantic Artefact Distribution
domain includes: Semantic Artefact Catalog Record
domain includes: Semantic Artefact Catalog
range: Literal
description: OMV: Date of the last modification made to the ontology. DCTERMS:Date on which the resource was changed. PAV: The date of the last update of the resource. An update is a change which did not warrant making a new resource related using pav:previousVersion, for instance correcting a spelling mistake. SCHEMA: The date on which the CreativeWork was most recently modified or when the item's entry was modified within a DataFeed.
issued: 2000-07-11
equivalent property: modificationDate
equivalent property: dateModified
equivalent property: lastUpdateOn
equivalent property: creationDate
derived from: https://w3id.org/mod/1.2
imported on: 2017-07-06
was influenced by: FAIR principle: F2
was influenced by: FAIRsFAIR profile: MANDATORY

validity date
type: Property
sub property of: date
label: date de validité @fr
domain includes: Semantic Artefact Distribution
range: Literal
description: DCTERMS: Date (often a range) of validity of a resource. PROV: Invalidation is the start of the destruction, cessation, or expiry of an existing entity by an activity. The entity is no longer available for use (or further invalidation) after invalidation. Any generation or usage of an entity precedes its invalidation. SCHEMA: The end date and time of the item (in ISO 8601 date format).
issued: 2000-07-11
equivalent property: endDate
equivalent property: invalidatedAtTime
derived from: https://w3id.org/mod/1.2
imported on: 2017-07-06
was influenced by: FAIR principle: F2

curation date
type: DatatypeProperty
sub property of: contributedOn
label: date de contrôle de qualité @fr
domain includes: Semantic Artefact Distribution
domain includes: Semantic Artefact Catalog Record
domain includes: Semantic Artefact Catalog
range: date
description: (to come)
issued: 2014-08-28
derived from: https://w3id.org/mod/1.2
imported on: 2017-07-06
was influenced by: FAIR principle: F2

submission date
type: Property
sub property of: date
label: date de soumission @fr
domain includes: Semantic Artefact Distribution
domain includes: Semantic Artefact Catalog Record
range: Literal
description: DCTERMS: Date of submission of the resource. SCHEMA: Date of first broadcast/publication.
issued: 2002-07-13
equivalent property: datePublished
derived from: https://w3id.org/mod/1.2
imported on: 2017-07-06
was influenced by: FAIR principle: F2

contact point
type: Property
type: ObjectProperty
label: contact @fr
domain includes: Semantic Artefact
domain includes: Semantic Artefact Catalog
range: Kind
description: DCAT: Relevant contact information for the cataloged resource. Use of vCard is recommended. SCHEMA: A maintainer of a Dataset, software package (SoftwareApplication), or other Project. A maintainer is a Person or Organization that manages contributions to, and/or publication of, some (typically complex) artifact. It is common for distributions of software and data to be based on 'upstream' sources.
issued: 2014-01-16
equivalent property: maintainer
derived from: https://w3id.org/mod/3.1
imported on: 2014-05-30
was influenced by: MIRO guidelines: A.2
was influenced by: FAIR principle: F2
was influenced by: FAIRsFAIR profile: MANDATORY

creator
type: Property
sub property of: creator
sub property of: contributor
label: créateur @fr
domain includes: Semantic Artefact
domain includes: Semantic Artefact Catalog
description: OMV: Main responsible for the creation of the ontology. DCTERMS: An entity primarily responsible for making the resource. FOAF: An agent that made this thing. PROV: Attribution is the ascribing of an entity to an agent. PAV:authoredBy: An agent that originated or gave existence to the work that is expressed by the digital resource.PAV:createdBy: An agent primary responsible for making the digital artifact or resource representation. DOAP: Maintainer of a project, a project leader. SCHEMA:author: The author of this content or rating. SCHEMA:creator: The creator/author of this CreativeWork. DCAT: The entity responsible for producing the resource.
issued: 2008-01-14
equivalent property: creator
equivalent property: authoredBy
equivalent property: createdBy
equivalent property: author
equivalent property: maintainer
equivalent property: wasAttributedTo
equivalent property: maker
derived from: https://w3id.org/mod/1.0
imported on: 2015-08-05
was influenced by: MIRO guidelines: C.2
was influenced by: FAIR principle: F2
was influenced by: FAIRsFAIR profile: MANDATORY
range includes: Agent

contributor
type: Property
sub property of: contributor
label: contributeur @fr
domain includes: Semantic Artefact
domain includes: Semantic Artefact Catalog
description: DCTERMS: An entity responsible for making contributions to the resource. OMV: Contributors to the creation of the ontology. PAV: The resource was contributed to by the given agent. SCHEMA: A secondary contributor to the CreativeWork or Event. DOAP: Project contributor.
issued: 2008-01-14
equivalent property: hasContributor
equivalent property: contributedBy
equivalent property: contributor
equivalent property: developer
equivalent property: helper
equivalent property: saved-by
equivalent property: savedBy
derived from: https://w3id.org/mod/1.0
imported on: 2015-08-05
was influenced by: MIRO guidelines: C.2
was influenced by: FAIR principle: F2
was influenced by: FAIRsFAIR profile: RECOMMENDED
range includes: Agent

curator
type: ObjectProperty
sub property of: contributedBy
label: curateur @fr
domain includes: Semantic Artefact
domain includes: Semantic Artefact Catalog
domain includes: Semantic Artefact Catalog Record
description: PAV: Specifies an agent specialist responsible for shaping the expression in an appropriate format. Often the primary agent responsible for ensuring the quality of the representation. MOD: A curator who restructures the previously authored content and shapes it to be appropriate for the intended representation (e.g. by normalizing the fields for being represented in a spreadsheet).
issued: 2014-08-28
derived from: https://w3id.org/mod/1.2
imported on: 2017-07-06
was influenced by: MIRO guidelines: C.2
was influenced by: FAIR principle: F2
inverse of: curates

translator
type: Property
label: traducteur @fr
domain includes: Semantic Artefact
domain includes: Semantic Artefact Catalog
description: SCHEMA: Organization or person who adapts a creative work to different languages, regional differences and technical requirements of a target market, or that translates during some event.
issued: 2012-04-21
derived from: https://w3id.org/mod/1.4
imported on: 2018-08-02
was influenced by: FAIR principle: F2
domain includes: CreativeWork
domain includes: Event
range includes: Organization
range includes: Person

publisher
type: Property
sub property of: publisher
label: éditeur @fr
domain includes: Semantic Artefact
domain includes: Semantic Artefact Catalog
description: DCTERMS: An entity responsible for making the resource available. SCHEMA: The publisher of creative work. SCHEMA: The Organization on whose behalf the creator was working. SCHEMA: The service provider, service operator, or service performer; the goods producer. Another party (a seller) may offer those services or goods on behalf of the provider. A provider may also serve as the seller. ADMS: The name of the agency that issued the identifier. DCAT: The entity responsible for making the item available.
issued: 2008-01-14
equivalent property: publisher
equivalent property: sourceOrganization
equivalent property: provider
equivalent property: schemaAgency
derived from: https://w3id.org/mod/1.0
imported on: 2015-08-05
was influenced by: MIRO guidelines: A.2
was influenced by: FAIR principle: F2
was influenced by: FAIRsFAIR profile: RECOMMENDED
range includes: Agent

funded or sponsored by
type: Property
type: ObjectProperty
label: financé ou sponsorisé par @fr
domain: Thing
domain includes: Semantic Artefact
domain includes: Semantic Artefact Catalog
range: Thing
description: MOD: An ontology that is sponsored by and developed under a project. FOAF: An organization funding a project or person. SCHEMA: A person or organization that supports (sponsors) something through some kind of financial contribution.
issued: 2014-01-14
equivalent property: funder
equivalent property: sponsoredBy
derived from: https://w3id.org/mod/1.0
imported on: 2015-08-05
was influenced by: FAIR principle: R1.2

funding
type: Property
label: financement @fr
domain includes: Semantic Artefact
domain includes: Semantic Artefact Catalog
description: SCHEMA: A Grant that directly or indirectly provide funding or sponsorship for this item.
issued: 2022-03-17
equivalent property: funder
equivalent property: sponsoredBy
derived from: https://w3id.org/mod/3.1
imported on: 2024-06-2
was influenced by: FAIR principle: R1.2

endorsed by
type: ObjectProperty
label: approuvé par @fr
domain: Semantic Artefact
domain: Semantic Artefact Catalog
range: Literal
description: MOD: An ontology endorsed by an agent. OMV: The parties that have expressed support or approval to this ontology.
issued: 2009-12-24
equivalent property: endorsedBy
derived from: https://w3id.org/mod/1.2
imported on: 2017-07-06
history note: This property has been adopted from OMV Ontology Metadata Vocabulary and redefined in the MOD namespace.
was influenced by: MIRO guidelines: G.4
was influenced by: FAIR principle: I3

qualified attribution
type: ObjectProperty
sub property of: qualifiedInfluence
label: attribution qualifiée @fr
domain: Entity
domain includes: Semantic Artefact
domain includes: Semantic Artefact Catalog
range: Attribution
description: PROV: Attribution is the ascribing of an entity to an agent. When an entity e is attributed to agent ag, entity e was generated by some unspecified activity that in turn was associated to agent ag. Thus, this relation is useful when the activity is not known, or irrelevant. DCAT: Link to an Agent having some form of responsibility for the resource.
issued: 2013-04-30
derived from: https://w3id.org/mod/3.2
imported on: 2024-06-25
inverse: qualifiedAttributionOf

user notes or reviews
type: Property
label: commentaires ou avis d'utilisateurs @fr
domain includes: Semantic Artefact
domain includes: Semantic Artefact Catalog
description: SCHEMA: Comments, typically from users.
issued: 2012-04-21
derived from: https://w3id.org/mod/1.4
imported on: 2018-08-02
was influenced by: FAIR principle: F4, A1.1, A1.2
domain includes: CreativeWork
range includes: Comment

evaluation
type: ObjectProperty
label: évaluation @fr
domain: Semantic Artefact
range: Semantic Artefact Evaluation
description: MOD: This property makes a relationship between an ontology and its evaluation result.
issued: 2015-08-05
equivalent property: review
derived from: https://w3id.org/mod/1.0
imported on: 2015-08-05
was influenced by: MIRO guidelines: G.2
was influenced by: FAIR principle: F2

group
type: ObjectProperty
label: groupe @fr
domain: Semantic Artefact
domain: Semantic Artefact Catalog
range: Semantic Artefact Group
description: MOD: A group of semantic artefacts that the given semantic artefact is usually considered within or a group hosted/served/represented by the given semantic artefact catalogue.
issued: 2017-07-06
derived from: https://w3id.org/mod/1.2
imported on: 2017-07-06
was influenced by: FAIR principle: R1.3

used in project
type: ObjectProperty
label: utilisé dans le projet @fr
domain: Semantic Artefact
domain: Semantic Artefact Catalog
range: Project
description: MOD: An ontology that is used in a project.
issued: 2015-08-05
equivalent property: ontologyInUse
derived from: https://w3id.org/mod/1.0
imported on: 2015-08-05
was influenced by: MIRO guidelines: B.3,G.5
was influenced by: FAIR principle: I3

target audience
type: Property
sub property of: audience
label: audience cible @fr
domain includes: Semantic Artefact
domain includes: Semantic Artefact Catalog
description: DCTERMS: a class of entity for whom the resource is intended or useful (public visé ou recommandé pour la ressource). DOAP: Description of target user base. SCHEMA: An intended audience, i.e. a group for whom something was created.
issued: 2001-05-21
equivalent property: audience
derived from: https://w3id.org/mod/1.2
imported on: 2017-07-06
was influenced by: MIRO guidelines: B.3
was influenced by: FAIR principle: F2
range includes: AgentClass

publishing principles
type: Property
label: principes de publication @fr
domain includes: Semantic Artefact Catalog
description: SCHEMA: The publishingPrinciples property indicates (typically via URL) a document describing the editorial principles of an Organization (or individual, e.g. a Person writing a blog) that relate to their activities as a publisher, e.g. ethics or diversity policies.
issued: 2012-04-21
derived from: https://w3id.org/mod/3.2
imported on: 2024-06-25
domain includes: CreativeWork
domain includes: Organization
domain includes: Person
range includes: CreativeWork
range includes: URL

analytics
type: ObjectProperty
label: analytique @fr
domain: Semantic Artefact
domain: Semantic Artefact Catalog
range: Analytics
description: MOD: This property shall be used to store any analytics for an ontology. E.g., number of visits an ontology received in a portal, number of downloads, etc.
issued: 2018-08-02
derived from: https://w3id.org/mod/1.4
imported on: 2018-08-02
was influenced by: MIRO guidelines: G.2
was influenced by: FAIR principle: F2

repository
type: Property
label: entrepôt @fr
domain: Project
domain includes: Semantic Artefact
domain includes: Semantic Artefact Catalog
range: Repository
description: DOAP: Source code repository.
issued: 2004
derived from: https://w3id.org/mod/1.2
imported on: 2017-07-06
was influenced by: MIRO guidelines: A.5
was influenced by: FAIR principle: R1.2

bug database
type: Property
label: repertoire de bogues @fr
domain: Project
domain includes: Semantic Artefact
domain includes: Semantic Artefact Catalog
description: DOAP: Bug tracker for a project.
issued: 2004
derived from: https://w3id.org/mod/1.2
imported on: 2017-07-06
was influenced by: MIRO guidelines: C.3
was influenced by: FAIR principle: F2

mailing list
type: Property
label: liste de diffusion @fr
domain: Project
domain includes: Semantic Artefact
domain includes: Semantic Artefact Catalog
description: DOAP: Mailing list home page or email address.
issued: 2004
derived from: https://w3id.org/mod/1.2
imported on: 2017-07-06
was influenced by: MIRO guidelines: C.3
was influenced by: FAIR principle: F2

to-do list
type: ObjectProperty
label: liste des choses à faire @fr
domain includes: Semantic Artefact
domain includes: Semantic Artefact Catalog
range: Vtodo
description: VOID: Describes future tasks planned by a resource curator. This property is primarily intended to be used for vocabularies or datasets, but the domain is left open, it can be used for any resource. Use iCalendar Vtodo class and its properties to further describe the task calendar, priorities etc.
issued: 2013-05-23
equivalent property: toDoList
derived from: https://w3id.org/mod/1.4
imported on: 2018-08-02
history note: This property had been originally defined by VOAF metadata vocabulary. Now, it has been adopted and redefined in the MOD namespace.
was influenced by: FAIR principle: F2

award
type: Property
label: prix @fr
domain includes: Semantic Artefact
domain includes: Semantic Artefact Catalog
description: SCHEMA: An award won by or for this item.
issued: 2012-04-21
derived from: https://w3id.org/mod/1.4
imported on: 2018-08-02
was influenced by: FAIR principle: F2
domain includes: CreativeWork
domain includes: Organization
domain includes: Person
domain includes: Product
domain includes: Service
range includes: Text

known usage
type: DatatypeProperty
label: usage connu @fr
domain: Semantic Artefact
domain: Semantic Artefact Catalog
range: MODString
description: OMV: The applications where the ontology is being used.
issued: 2009-12-24
equivalent property: knownUsage
derived from: https://w3id.org/mod/1.2
imported on: 2017-07-06
history note: This property has been adopted from OMV Ontology Metadata Vocabulary and redefined in the MOD namespace.
was influenced by: MIRO guidelines: B.3
was influenced by: FAIR principle: F2

designed for task
type: ObjectProperty
label: concou pour la tâche @fr
domain: Semantic Artefact
range: Semantic Artefact Task
description: OMV: The purpose for which the ontology was originally designed.
issued: 2009-12-24
derived from: https://w3id.org/mod/1.2
imported on: 2017-07-06
was influenced by: MIRO guidelines: B.1
was influenced by: FAIR principle: R1.2

subject
type: Property
sub property of: subject
label: sujet @fr
domain includes: Semantic Artefact
domain includes: Semantic Artefact Catalog
description: DCTERMS: The topic of the resource. OMV: Typically, the domain can refer to established topic hierarchies such as the general purpose topic hierarchy DMOZ or the domain specific topic hierarchy ACM for the computer science domain. SCHEMA: The subject matter of the content. DCAT: A main category of the resource. A resource can have multiple themes. FOAF: A topic of some page or document.
issued: 2008-01-14
equivalent property: hasDomain
equivalent property: about
equivalent property: theme
equivalent property: topic
derived from: https://w3id.org/mod/1.0
imported on: 2015-08-05
was influenced by: MIRO guidelines: C.1
was influenced by: FAIR principle: F2
was influenced by: FAIRsFAIR profile: MANDATORY

coverage
type: Property
sub property of: coverage
label: couverture @fr
domain includes: Semantic Artefact
domain includes: Semantic Artefact Catalog
description: DCTERMS: The spatial or temporal topic of the resource, the spatial applicability of the resource, or the jurisdiction under which the resource is relevant. Spatial topic and spatial applicability may be a named place or a location specified by its geographic coordinates. Temporal topic may be a named period, date, or date range. A jurisdiction may be a named administrative entity or a geographic place to which the resource applies. Recommended practice is to use a controlled vocabulary such as the Getty Thesaurus of Geographic Names [[TGN](https://www.getty.edu/research/tools/vocabulary/tgn/index.html)]. Where appropriate, named places or time periods may be used in preference to numeric identifiers such as sets of coordinates or date ranges. Because coverage is so broadly defined, it is preferable to use the more specific subproperties Temporal Coverage and Spatial Coverage.
issued: 2008-01-14
derived from: https://w3id.org/mod/1.2
imported on: 2017-07-06
was influenced by: MIRO guidelines: C.1
was influenced by: FAIR principle: F2
was influenced by: FAIRsFAIR profile: RECOMMENDED
range includes: Jurisdiction
range includes: Location
range includes: Period

supported schema/format
type: Property
type: ObjectProperty
label: schema/format supporté @fr
domain includes: Semantic Artefact Catalog
range: Asset
description: ADMS: A schema according to which the Asset Repository can provide data about its content. SCHEMA: Media type, typically MIME format (see IANA site) of the content.
issued: 2013-08-01
equivalent property: fileFormat
derived from: https://w3id.org/mod/3.2
imported on: 2024-06-25

example
type: AnnotationProperty
sub property of: seeAlso
label: exemple @fr
domain includes: Semantic Artefact
domain includes: Semantic Artefact Catalog
description: VANN: A reference to a resource that provides an example of how this resource can be used. SCHEMA: Example/instance/realization/derivation of the concept of this creative work. eg. The paperback edition, first edition, or eBook.
issued: 2005-04-01
equivalent property: workExample
derived from: https://w3id.org/mod/1.2
imported on: 2017-07-06
was influenced by: MIRO guidelines: G.3
was influenced by: FAIR principle: F2

knowledge representation paradigm
type: ObjectProperty
label: paradigme de représentation des connaissances @fr
domain: Semantic Artefact Distribution
range: Knowledge Representation Paradigm
description: MOD: A representation formalism that is followed to describe knowledge in an ontology. Examples include description logics, first order logic, etc. OMV: Information about the paradigm model used to create the ontology. DCTERMS: An established standard to which the described resource conforms.
issued: 2009-12-24
equivalent property: conformsToKnowledgeRepresentationParadigm
equivalent property: conforms to
equivalent property: knowledgeRepresentationFormalism
derived from: https://w3id.org/mod/1.0
imported on: 2015-08-05
history note: This property has been adopted from OMV Ontology Metadata Vocabulary and redefined in the MOD namespace.
was influenced by: MIRO guidelines: E.1
was influenced by: FAIR principle: R1.2
was influenced by: FAIRsFAIR profile: RECOMMENDED

conforms to
type: Property
sub property of: relation
label: conforme à @fr
domain includes: Semantic Artefact Catalog
description: DCTERMS: An established standard to which the described resource conforms.
issued: 2001-05-21
derived from: https://w3id.org/mod/1.2
imported on: 2017-07-06
range includes: Standard

engineering methodology
type: ObjectProperty
label: méthodologie de développement @fr
domain: Semantic Artefact Distribution
range: Semantic Artefact Engineering Methodology
description: MOD: A methodology following which an ontology is created. OMV: Information about the method model used to create the ontology.
issued: 2009-12-24
equivalent property: representationTechnique
equivalent property: publishing principles
equivalent property: methodologyUsed
derived from: https://w3id.org/mod/1.0
imported on: 2015-08-05
history note: This property has been adopted from OMV Ontology Metadata Vocabulary and redefined in the MOD namespace.
was influenced by: MIRO guidelines: A.6
was influenced by: FAIR principle: R1.2
was influenced by: FAIRsFAIR profile: RECOMMENDED

created with
type: ObjectProperty
sub property of: wasAttributedTo
label: crée avec @fr
domain includes: Semantic Artefact
domain includes: Semantic Artefact Catalog
description: PAV: The software/tool used by the creator (pav:createdBy) when making the digital resource, for instance a word processor or an annotation tool. MOD: The tool used for the creation of an ontology. OMV: Information about the tool used to create the ontology.
issued: 2014-08-28
equivalent property: usedOntologyEngineeringTool
equivalent property: auto-generated-by
equivalent property: toolUsed
derived from: https://w3id.org/mod/1.0
imported on: 2015-08-05
was influenced by: MIRO guidelines: E.2
was influenced by: FAIR principle: R1.2
was influenced by: FAIRsFAIR profile: OPTIONAL

accrual method
type: Property
label: méthode d'ajout @fr
domain: Collection
domain includes: Semantic Artefact
domain includes: Semantic Artefact Catalog
description: DCTERMS: The method by which items are added to a collection. Recommended practice is to use a value from the Collection Description Accrual Method Vocabulary.
issued: 2005-06-13
derived from: https://w3id.org/mod/1.2
imported on: 2017-07-06
was influenced by: MIRO guidelines: D.3, F.2
was influenced by: FAIR principle: R1.2
was influenced by: FAIRsFAIR profile: RECOMMENDED
range includes: MethodOfAccrual

accrual periodicity
type: Property
label: fréquence des ajouts @fr
domain: Collection
domain includes: Semantic Artefact
domain includes: Semantic Artefact Catalog
description: DCTERMS: The frequency with which items are added to a collection. Recommended practice is to use a value from the Collection Description Frequency Vocabulary.
issued: 2005-06-13
derived from: https://w3id.org/mod/1.2
imported on: 2017-07-06
was influenced by: MIRO guidelines: F.2
was influenced by: FAIR principle: R1.2
was influenced by: FAIRsFAIR profile: OPTIONAL
range includes: Frequency

accrual policy
type: Property
label: politique des ajouts @fr
domain: Collection
domain includes: Semantic Artefact
domain includes: Semantic Artefact Catalog
description: DCTERMS: The policy governing the addition of items to a collection. Recommended practice is to use a value from the Collection Description Accrual Policy Vocabulary.
issued: 2005-06-13
derived from: https://w3id.org/mod/1.2
imported on: 2017-07-06
was influenced by: MIRO guidelines: F.2, F.3
was influenced by: FAIR principle: R1.2
range includes: Policy

competency question
type: DatatypeProperty
label: question de compétence @fr
domain: Semantic Artefact
range: string
description: MOD: A set of questions made to build an ontology at the design time.
issued: 2015-08-05
derived from: https://w3id.org/mod/1.0
imported on: 2015-08-05
was influenced by: MIRO guidelines: A.6, D.3
was influenced by: FAIR principle: R1.2
was influenced by: FAIRsFAIR profile: OPTIONAL

sample queries
type: DatatypeProperty
label: exemples de requêtes @fr
domain: Semantic Artefact Distribution
domain: Semantic Artefact Catalog
range: MODString
description: MOD: A set of queries (may be SPARQL, DL Queries) that are provided along with an ontology.
issued: 2015-08-05
derived from: https://w3id.org/mod/1.0
imported on: 2015-08-05
was influenced by: FAIR principle: F2

was generated by
type: ObjectProperty
sub property of: wasInfluencedBy
label: a été généré par @fr
domain: Entity
domain includes: Semantic Artefact
domain includes: Semantic Artefact Catalog
range: Activity
description: PROV: Generation is the completion of production of a new entity by an activity. This entity did not exist before generation and becomes available for usage after this generation. DCAT: An activity that generated, or provides the business context for, the creation of the dataset.
issued: 2013-04-30
derived from: https://w3id.org/mod/1.2
imported on: 2017-07-06
was influenced by: MIRO guidelines: D.1
was influenced by: FAIR principle: R1.2
was influenced by: FAIRsFAIR profile: OPTIONAL
inverse: generated

was invalidated by
type: ObjectProperty
sub property of: wasInfluencedBy
label: a été invalidé par @fr
domain: Entity
domain includes: Semantic Artefact
range: Activity
description: PROV: Invalidation is the start of the destruction, cessation, or expiry of an existing entity by an activity. The entity is no longer available for use (or further invalidation) after invalidation. Any generation or usage of an entity precedes its invalidation.
issued: 2013-04-30
derived from: https://w3id.org/mod/1.2
imported on: 2017-07-06
was influenced by: FAIR principle: R1.2
inverse: invalidated

FAIR assessment
type: DatatypeProperty
label: evaluation du niveau de FAIRness @fr
domain: Semantic Artefact Distribution
range: FAIRness assessment
description: MOD: A FAIRness assessment result produced by a known or identified FAIRness assessment method or tool. It can be either a simple number or a structured result document explaining the assessment.
issued: 2024-05-30
derived from: https://w3id.org/mod/3.1
imported on: 2024-05-30
was influenced by: MIRO guidelines: G.2
was influenced by: FAIR principle: F2,I2

object preferred label property
type: DatatypeProperty
label: propriété de nom préféré des objets @fr
domain: Semantic Artefact Distribution
range: anyURI
description: MOD: Property used to specify object's preferred label.
issued: 2018-08-02
derived from: https://w3id.org/mod/1.4
imported on: 2018-08-02
was influenced by: MIRO guidelines: E.7
was influenced by: FAIR principle: R1
was influenced by: FAIRsFAIR profile: RECOMMENDED

object synonym property
type: DatatypeProperty
label: propriété de synonyme des objets @fr
domain: Semantic Artefact Distribution
range: anyURI
description: MOD: Property used to specify object's synonym.
issued: 2018-08-02
equivalent property: hasSynonymType
equivalent property: synonymtypedef
derived from: https://w3id.org/mod/1.4
imported on: 2018-08-02
was influenced by: MIRO guidelines: E.7
was influenced by: FAIR principle: R1
was influenced by: FAIRsFAIR profile: RECOMMENDED

object definition property
type: DatatypeProperty
label: propriété de définition des objets @fr
domain: Semantic Artefact Distribution
range: anyURI
description: MOD: Property used to specify object's definition.
issued: 2018-08-02
derived from: https://w3id.org/mod/1.4
imported on: 2018-08-02
was influenced by: MIRO guidelines: E.7
was influenced by: FAIR principle: R1
was influenced by: FAIRsFAIR profile: RECOMMENDED

object author property
type: DatatypeProperty
label: propriété d'auteur des objets @fr
domain: Semantic Artefact Distribution
range: anyURI
description: MOD: Property used to specify object's author.
issued: 2018-08-02
derived from: https://w3id.org/mod/1.4
imported on: 2018-08-02
was influenced by: MIRO guidelines: E.7
was influenced by: FAIR principle: R1

object obsolete property
type: DatatypeProperty
label: propriété d'obsolescence des objets @fr
domain: Semantic Artefact Distribution
range: anyURI
description: MOD: Property used to specify obsolete object.
issued: 2018-08-02
derived from: https://w3id.org/mod/1.4
imported on: 2018-08-02
was influenced by: MIRO guidelines: E.7
was influenced by: FAIR principle: R1

object creation date property
type: DatatypeProperty
label: propriété de date de création des objets @fr
domain: Semantic Artefact Distribution
range: anyURI
description: MOD: Property used to specify the date of creation of a class or another object in the ontology.
issued: 2024-05-30
derived from: https://w3id.org/mod/3.1
imported on: 2024-05-30
was influenced by: MIRO guidelines: E.7
was influenced by: FAIR principle: R1

object modification date property
type: DatatypeProperty
label: propriété de date de modification des objets @fr
domain: Semantic Artefact Distribution
range: anyURI
description: MOD: Property used to specify the date of modification of a class or another object in the ontology.
issued: 2024-05-30
derived from: https://w3id.org/mod/3.1
imported on: 2024-05-30
was influenced by: MIRO guidelines: E.7
was influenced by: FAIR principle: R1

transitive hierarchy property
type: DatatypeProperty
label: propriété de hiérarchie transitive @fr
domain: Semantic Artefact Distribution
range: anyURI
description: MOD: Property used to specify the hierarchy (e.g. rdfs:subClassOf or skos:broader).
issued: 2018-08-02
derived from: https://w3id.org/mod/1.4
imported on: 2018-08-02
was influenced by: MIRO guidelines: E.9
was influenced by: FAIR principle: R1

access URL
type: Property
type: ObjectProperty
label: URL d'accès @fr
domain: Distribution
domain includes: Semantic Artefact Distribution
domain includes: Semantic Artefact Catalog
range: Resource
description: DCAT: A URL of a resource that gives access to a distribution of the dataset. E.g. landing page, feed, SPARQL endpoint. Use for all cases except a simple download link, in which case downloadURL is preferred. OMV: The location where the ontology can be found. It should be accessible via a URL. It can be the same as the value for URI property. DOAP: Web page from which the project software can be downloaded.
issued: 2014-01-16
equivalent property: resourceLocator
equivalent property: download-page
derived from: https://w3id.org/mod/1.2
imported on: 2017-07-06
was influenced by: MIRO guidelines: A.4
was influenced by: FAIR principle: F2
was influenced by: FAIRsFAIR profile: MANDATORY
scope note: If the distribution(s) are accessible only through a landing page (i.e. direct download URLs are not known), then the landing page link should be duplicated as accessURL on a distribution.

is format of
type: Property
sub property of: relation
label: est le format de @fr
domain includes: Semantic Artefact
description: DCTERMS: A related resource that is substantially the same as the described resource, but in another format.
issued: 2000-07-11
equivalent property: hasPart
equivalent property: syntax
derived from: https://w3id.org/mod/1.2
imported on: 2017-07-06
was influenced by: FAIR principle: I1

has format
type: Property
sub property of: relation
label: a pour format @fr
domain includes: Semantic Artefact
description: DCTERMS: A related resource that is substantially the same as the pre-existing described resource, but in another format.
issued: 2000-07-11
equivalent property: hasPart
equivalent property: syntax
derived from: https://w3id.org/mod/1.2
imported on: 2017-07-06
was influenced by: FAIR principle: I1
was influenced by: FAIRsFAIR profile: RECOMMENDED

download URL
type: Property
type: ObjectProperty
label: URL de téléchargement @fr
domain: Distribution
domain includes: Semantic Artefact Distribution
range: Resource
description: DCAT: The URL of the downloadable file in a given format. E.g. CSV file or RDF file. The format is indicated by the distribution's dct:format and/or dcat:mediaType. VOID: An RDF dump, partial or complete, of a void:Dataset. DOAP: Mirror of software download web page. SCHEMA: A downloadable form of this dataset, at a specific location, in a specific format.
issued: 2014-01-16
equivalent property: dataDump
equivalent property: download-mirror
equivalent property: distribution
derived from: https://w3id.org/mod/1.4
imported on: 2018-08-02
was influenced by: FAIR principle: F2
was influenced by: FAIRsFAIR profile: RECOMMENDED
scope note: dcat:downloadURL SHOULD be used for the address at which this distribution is available directly, typically through a HTTP Get request.

URI lookup endpoint
type: Property
label: service de requêtage des URI @fr
domain: Dataset
domain includes: Semantic Artefact
domain includes: Semantic Artefact Catalog
range: anyURI
description: VOID: A protocol endpoint for simple URI lookups for a void:Dataset.
issued: 2010-01-26
derived from: https://w3id.org/mod/1.4
imported on: 2018-08-02
was influenced by: FAIR principle: F2

free-text search endpoint
type: Property
label: service de requêtage en texte libre @fr
domain: Dataset
domain includes: Semantic Artefact
domain includes: Semantic Artefact Catalog
range: Document
description: VOID: An OpenSearch description document for a free-text search service over a void:Dataset. DOAP: The URI of a web service endpoint where software as a service may be accessed.
issued: 2010-01-26
derived from: https://w3id.org/mod/1.4
imported on: 2018-08-02
was influenced by: FAIR principle: F2

browsing user interface
type: DatatypeProperty
label: interface de navigation @fr
domain: Semantic Artefact Distribution
range: anyURI
description: MOD: The user interface (URL) where the ontology may be browsed or searched.
issued: 2017-07-06
derived from: https://w3id.org/mod/1.2
imported on: 2017-07-06
was influenced by: FAIR principle: F2

source
type: Property
sub property of: source
sub property of: relation
domain includes: Semantic Artefact
domain includes: Semantic Artefact Catalog
description: DCTERMS: A related resource from which the described resource is derived. MOD: The ontology(ies) referred to while creating the present ontology. PROV: Influence is the capacity of an entity, activity, or agent to have an effect on the character, development, or behavior of another by means of usage, start, end, generation, invalidation, communication, derivation, attribution, association, or delegation. PROV: A derivation is a transformation of an entity into another, an update of an entity resulting in a new one, or the construction of a new entity based on a pre-existing entity. PAV: Derived from a different resource. NKOS: A resource used as the source for a derivative resource.
issued: 2008-01-14
equivalent property: isBasedOn
equivalent property: basedOn
equivalent property: wasDerivedFrom
equivalent property: wasInfluencedBy
equivalent property: derivedFrom
equivalent property: sourceOntology
derived from: https://w3id.org/mod/1.0
imported on: 2015-08-05
was influenced by: MIRO guidelines: D.2
was influenced by: FAIR principle: R1.2

SPARQL endpoint
type: Property
type: InverseFunctionalProperty
label: point de requêtage SPARQL @fr
domain: Service
domain includes: Semantic Artefact Distribution
domain includes: Semantic Artefact Catalog
description: SD: Relates an instance of sd:Service to a SPARQL endpoint that implements the SPARQL Protocol service for the service. The object of the sd:endpoint property is an IRI. VOID: A SPARQL protocol endpoint that allows SPARQL query access to a void:Dataset.
issued: 2013-03-21
equivalent property: sparqlEndpoint
derived from: https://w3id.org/mod/1.2
imported on: 2017-07-06
was influenced by: FAIR principle: A1

indexed or included in catalog or repository
type: Property
label: indexé ou inclus dans un catalogue ou un entrepôt @fr
domain includes: Semantic Artefact
description: SCHEMA: A data catalog which contains this dataset.
issued: 2016-05-04
derived from: https://w3id.org/mod/1.4
imported on: 2014-07-28
was influenced by: FAIR principle: F4, A1.1, A1.2
was influenced by: FAIRsFAIR profile: OPTIONAL
domain includes: Dataset
inverse of: dataset
range includes: DataCatalog

imports
type: OntologyProperty
label: importe @fr
domain: Ontology
domain includes: Semantic Artefact Distribution
range: Ontology
description: OWL: References another OWL ontology containing definitions, whose meaning is considered to be part of the meaning of the importing ontology. OMV: References another ontology metadata instance that describes an ontology containing definitions, whose meaning is considered to be part of the meaning of the ontology described by this ontology metadata instance. DCTERMS: A related resource that is required by the described resource to support its function, delivery, or coherence. VOAF: Indicates that the subject vocabulary extends the expressivity of the object vocabulary by declaring subsumption relationships, using object vocabulary class as domain or range of a subject vocabulary property, defining local restrictions etc . ADMS: An Asset that is contained in the Asset being described, e.g. when there are several vocabularies defined in a single document.
issued: 2004-02-10
equivalent property: useImports
equivalent property: requires
equivalent property: extends
equivalent property: includedAsset
derived from: https://w3id.org/mod/1.2
imported on: 2017-07-06
was influenced by: MIRO guidelines: E.4
was influenced by: FAIR principle: I2

prior version
type: AnnotationProperty
type: OntologyProperty
label: version précédente @fr
domain: Ontology
domain includes: Semantic Artefact
range: Ontology
description: OWL: This identifies the specified ontology as a prior version of the containing ontology. OMV: Contains a reference to another ontology metadata instance. DCTERMS: A related resource of which the described resource is a version, edition, or adaptation. PROV: A revision is a derivation for which the resulting entity is a revised version of some original. The implication here is that the resulting entity contains substantial content from the original. DOOR: Prior version relation from OWL. ADMS: A link to the previous version of the Asset.
issued: 2004-02-10
equivalent property: hasPriorVersion
equivalent property: isVersionOf
equivalent property: wasRevisionOf
equivalent property: priorVersion
equivalent property: prev
derived from: https://w3id.org/mod/1.2
imported on: 2017-07-06
was influenced by: MIRO guidelines: A.5
was influenced by: FAIR principle: I2

is part of (view of)
type: Property
sub property of: relation
label: est partie (une vue) de @fr
domain includes: Semantic Artefact
domain includes: Semantic Artefact Catalog
description: DCTERMS: A related resource in which the described resource is physically or logically included. MOD: Shall be used to identify a subset or a view of an ontology. DOOR: An ontology is included in another if its model is contained in the one of the other ontology. SCHEMA: Indicates an item or CreativeWork that this item, or CreativeWork (in some sense), is part of.
issued: 2000-07-11
equivalent property: includedIn
equivalent property: subset
equivalent property: isPartOf
equivalent property: module
derived from: https://w3id.org/mod/1.0
imported on: 2015-08-05
was influenced by: FAIR principle: F2

has part (has view)
type: Property
sub property of: relation
label: a pour partie (vue) @fr
domain includes: Semantic Artefact
domain includes: Semantic Artefact Catalog
description: DCTERMS: A related resource that is included either physically or logically in the described resource. SCHEMA: Indicates an item or CreativeWork that is part of this item, or CreativeWork (in some sense). ADMS: Links to a sample of an Asset (which is itself an Asset).
issued: 2000-07-11
equivalent property: hasPart
equivalent property: sample
equivalent property: hasSubset
derived from: https://w3id.org/mod/1.0
imported on: 2015-08-05
was influenced by: FAIR principle: F2

catalog
type: Property
type: ObjectProperty
sub property of: has part (has view)
sub property of: member
label: catalogue @fr
domain: Catalog
domain includes: Semantic Artefact Catalog
range: Catalog
description: DCAT:A catalog whose contents are of interest in the context of this catalog. DCTERMS: A related resource that is included either physically or logically in the described resource. SCHEMA: Indicates an item or CreativeWork that is part of this item, or CreativeWork (in some sense). ADMS: Links to a sample of an Asset (which is itself an Asset).
issued: 2020-02-20
equivalent property: has part (has view)
equivalent property: hasPart
equivalent property: sample
derived from: https://w3id.org/mod/3.2
imported on: 2024-06-25

relation
type: Property
sub property of: relation
domain includes: Semantic Artefact
domain includes: Semantic Artefact Catalog
description: DCTERMS: A related resource.
issued: 2008-01-14
derived from: https://w3id.org/mod/1.0
imported on: 2015-08-05
was influenced by: FAIR principle: I2

qualified relation
type: Property
type: ObjectProperty
sub property of: qualifiedInfluence
label: relation qualifiée @fr
domain: Resource
domain includes: Semantic Artefact
domain includes: Semantic Artefact Catalog
range: Relationship
description: DCAT: Link to a description of a relationship with another resource. PROV: Influence is the capacity of an entity, activity, or agent to have an effect on the character, development, or behavior of another by means of usage, start, end, generation, invalidation, communication, derivation, attribution, association, or delegation.
issued: 2020-02-20
equivalent property: hasPart
derived from: https://w3id.org/mod/3.2
imported on: 2024-06-25

generally related to
type: ObjectProperty
sub property of: relation
label: relation générale avec @fr
domain: Semantic Artefact
range: Semantic Artefact
description: MOD: A general property for semantic artefact relations. DOOR: An ontology is related to another if one of the DOOR relations is satisfied.
issued: 2021-12-06
equivalent property: ontologyRelatedTo
derived from: https://w3id.org/mod/2.0
imported on: 2021-12-06
was influenced by: FAIR principle: I2
was influenced by: FAIRsFAIR profile: OPTIONAL

specializes
type: ObjectProperty
sub property of: generally related to
inverse of: generalizes
label: spécialise @fr
description: DOOR: Evolution which involves a change only at the syntactic level. PROV: An entity that is a specialization of another shares all aspects of the latter, and additionally presents more specific aspects of the same thing as the latter. VOAF:Indicates that the subject vocabulary defines some subclasses or subproperties of the object vocabulary, or local restrictions on those.
issued: 2013-05-23
equivalent property: explanationEvolution
equivalent property: specializes
equivalent property: specializationOf
derived from: https://w3id.org/mod/1.2
imported on: 2017-07-06
history note: This property had been originally defined by VOAF metadata vocabulary. Now, it has been adopted and redefined in the MOD namespace.
was influenced by: FAIR principle: I2

generalizes
type: ObjectProperty
sub property of: generally related to
inverse of: specializes
label: généralise @fr
description: VOAF: Indicates that the subject vocabulary generalizes by some superclasses or superproperties the object vocabulary. PROV: Inverse property of specializationOf.
issued: 2013-05-23
equivalent property: generalizes
equivalent property: generalizationOf
derived from: https://w3id.org/mod/1.4
imported on: 2018-08-02
history note: This property had been originally defined by VOAF metadata vocabulary. Now, it has been adopted and redefined in the MOD namespace.
was influenced by: FAIR principle: I2

used by
type: ObjectProperty
sub property of: generally related to
inverse of: relies on or reuses
label: utilisé par @fr
description: VOAF: Indicates that the subject vocabulary is used by the object vocabulary. NKOS: Agent using the described KOS.
issued: 2013-05-23
equivalent property: usedBy
derived from: https://w3id.org/mod/1.4
imported on: 2018-08-02
history note: This property had been originally defined by VOAF metadata vocabulary. Now, it has been adopted and redefined in the MOD namespace.
was influenced by: FAIR principle: I2

relies on or reuses
type: ObjectProperty
sub property of: generally related to
inverse of: used by
label: se repose sur ou réutilise @fr
description: MOD: A general property for different kind of case when a semantic resource relies or reuses another one. VOAF: Indicates that the subject vocabulary uses or extends some class or property of the object vocabulary. VOID: A vocabulary that is used in the dataset.
issued: 2013-05-24
equivalent property: reliesOn
equivalent property: vocabulary
derived from: https://w3id.org/mod/2.0
imported on: 2021-12-06
history note: This property had been originally defined by VOAF metadata vocabulary. Now, it has been adopted and redefined in the MOD namespace.
was influenced by: FAIR principle: I2

similar to
type: ObjectProperty
sub property of: generally related to
label: similaire à @fr
description: VOAF: Used to assert that two vocabularies are similar in scope and objectives, independently of the fact that they otherwise refer to each other. DOOR: Represents the meaning of 'how an ontology overlap/cover parts of the same area of interest of another ontology.'
issued: 2013-05-23
equivalent property: similarTo
equivalent property: similar
derived from: https://w3id.org/mod/1.4
imported on: 2018-08-02
history note: This property had been originally defined by VOAF metadata vocabulary. Now, it has been adopted and redefined in the MOD namespace.
was influenced by: MIRO guidelines: B.2
was influenced by: FAIR principle: I2

comes from the same domain
type: ObjectProperty
type: SymmetricProperty
type: TransitiveProperty
sub property of: generally related to
label: vient du même domaine @fr
description: DOOR: If the two ontologies come from the same domain (without any other details).
issued: 2009-10-06
equivalent property: comesFromTheSameDomain
derived from: https://w3id.org/mod/1.4
imported on: 2018-08-02
history note: This property had been originally defined by DOOR metadata vocabulary. Now, it has been adopted and redefined in the MOD namespace.
was influenced by: MIRO guidelines: B.2
was influenced by: FAIR principle: I2

has equivalences with
type: ObjectProperty
sub property of: relies on or reuses
label: a des équivalences avec @fr
description: VOAF: Indicates that the subject vocabulary declares some equivalent classes or properties with the object vocabulary. DOOR: Links two ontologies if there exists an alignment which covers a substantial part of the vocabulary (i.e., a proportion greater than a threshold). NKOS: A related resource with which the described resource is aligned.
issued: 2013-05-23
equivalent property: isAlignedTo
equivalent property: hasEquivalencesWith
equivalent property: alignedWith
derived from: https://w3id.org/mod/1.4
imported on: 2018-08-02
history note: This property had been originally defined by VOAF metadata vocabulary. Now, it has been adopted and redefined in the MOD namespace.
was influenced by: MIRO guidelines: E.4
was influenced by: FAIR principle: I2

backward compatible
type: AnnotationProperty
type: OntologyProperty
label: rétrocompatible @fr
domain: Ontology
domain includes: Semantic Artefact
range: Ontology
description: OWL: This identifies the specified ontology as a prior version of the containing ontology, and further indicates that it is backward compatible with it. OMV: The ontology metadata instance which describes an ontology that is a compatible prior version of the ontology described by this ontology metadata Instance. DOOR: The relation of being a compatible new version from owl.
issued: 2004-02-10
equivalent property: isBackwardCompatibleWith
equivalent property: backwardCompatibleWith
derived from: https://w3id.org/mod/1.2
imported on: 2017-07-06
was influenced by: MIRO guidelines: E.8,E.10
was influenced by: FAIR principle: I2

incompatible
type: AnnotationProperty
type: OntologyProperty
label: incomaptible @fr
domain: Ontology
domain includes: Semantic Artefact
range: Ontology
description: OWL: This indicates that the containing ontology is a later version of the referenced ontology, but is not backward compatible with it. OMV: The described ontology is a later version of the ontology described by the metadata specified, but is not backward compatible with it. It can be used to explicitly state that ontology cannot upgrade to use the new version without checking whether changes are required.
issued: 2004-02-10
equivalent property: isIncompatibleWith
equivalent property: owlIncompatibleWith
derived from: https://w3id.org/mod/1.2
imported on: 2017-07-06
was influenced by: FAIR principle: I2

disparate modelling with
type: ObjectProperty
sub property of: generally related to
label: différences de modélisation avec @fr
description: DOOR: Disagreements related to the conceptualization of the ontologies. Two ontologies are considered to have disparate modeling if they represent corresponding entities in different ways, e.g. as an instance in one case and a class in the other.
issued: 2009-10-06
equivalent property: hasDisparateModelling
derived from: https://w3id.org/mod/1.4
imported on: 2018-08-02
history note: This property had been originally defined by DOOR metadata vocabulary. Now, it has been adopted and redefined in the MOD namespace.
was influenced by: MIRO guidelines: B.2
was influenced by: FAIR principle: I2
sub property of: disagreesWith

has disjunctions with
type: ObjectProperty
sub property of: generally related to
label: a des disjopnctions avec @fr
description: VOAF: Indicates that the subject vocabulary declares some disjunct classes with the object vocabulary.
issued: 2013-05-23
equivalent property: hasDisjunctionsWith
derived from: https://w3id.org/mod/1.4
imported on: 2018-08-02
history note: This property had been originally defined by VOAF metadata vocabulary. Now, it has been adopted and redefined in the MOD namespace.
was influenced by: MIRO guidelines: E.4
was influenced by: FAIR principle: I2

work translation
type: Property
label: a pour traduction @fr
domain includes: Semantic Artefact
range includes: Semantic Artefact
description: MOD: A pointer to the translated ontology(ies) for an existing ontology. SCHEMA: A work that is a translation of the content of this work. ADMS: Links Assets that are translations of each other.
issued: 2012-04-21
equivalent property: translation
derived from: https://w3id.org/mod/1.0
imported on: 2015-08-05
domain includes: CreativeWork
range includes: CreativeWork
inverse of: translation of
is part of: bib.schema.org

translation of
type: Property
label: traduction de @fr
domain includes: Semantic Artefact
range includes: Semantic Artefact
description: SCHEMA: The work that this work has been translated from. ADMS: Links Assets that are translations of each other.
issued: 2012-04-21
equivalent property: translation
derived from: https://w3id.org/mod/1.4
imported on: 2018-08-02
domain includes: CreativeWork
range includes: CreativeWork
inverse of: work translation
is part of: bib.schema.org

identifier pattern
type: Property
label: patron d'identifiant @fr
domain: Dataset
domain includes: Semantic Artefact
domain includes: Semantic Artefact Catalog
description: VOID: A regular expression that matches the URIs of a void:Dataset's entities. IDOT: Regular expression describing alphanumeric strings used to identify items (or records) in a dataset.
issued: 2010-01-26
equivalent property: identifierPattern
derived from: https://w3id.org/mod/1.4
imported on: 2018-08-02
was influenced by: MIRO guidelines: E.6
was influenced by: FAIR principle: F2

preferred namespace URI
type: AnnotationProperty
label: URI préféré d'espace de nom @fr
domain includes: Semantic Artefact
domain includes: Semantic Artefact Catalog
description: VANN: The preferred namespace URI to use when using terms from this vocabulary in an XML document. VOID: A URI that is a common string prefix of all the entity URIs in a void:Dataset.
issued: 2005-04-01
equivalent property: uriSpace
derived from: https://w3id.org/mod/1.2
imported on: 2017-07-06
was influenced by: MIRO guidelines: E.5
was influenced by: FAIR principle: F2

preferred namespace prefix
type: AnnotationProperty
label: préfixe d'espace de nom préféré @fr
domain includes: Semantic Artefact
domain includes: Semantic Artefact Catalog
description: VANN: The preferred namespace prefix to use when using terms from this vocabulary in an XML document. IDOT: Short label that is commonly used to refer to the dataset. Often utilised to identify the dataset in IRIs for specific items (or records). This may also stand in place of the base IRI of the dataset (e.g. see http://prefix.cc).
issued: 2005-04-01
equivalent property: preferredPrefix
equivalent property: default-namespace
equivalent property: hasDefaultNamespace
derived from: https://w3id.org/mod/1.2
imported on: 2017-07-06
was influenced by: MIRO guidelines: E.11
was influenced by: FAIR principle: F2

root of obsolete branch
type: DatatypeProperty
label: racine de la branche des obsolètes @fr
domain: Semantic Artefact Distribution
range: anyURI
description: MOD: Property used to specify the root of an obsolete branch in the ontology.
issued: 2018-08-02
derived from: https://w3id.org/mod/1.4
imported on: 2018-08-02
was influenced by: FAIR principle: R1

example de resource
type: Property
label: exemple de resource @fr
domain: Dataset
domain includes: Semantic Artefact
range: Resource
description: VOID: Example resource of dataset. IDOT: An example identifier used by one item (or record) from a dataset.
issued: 2010-01-26
equivalent property: exampleIdentifier
derived from: https://w3id.org/mod/1.4
imported on: 2018-08-02
was influenced by: MIRO guidelines: E.6
was influenced by: FAIR principle: F2

key classes
type: ObjectProperty
type: FunctionalProperty
label: classes principales @fr
domain: Document
domain includes: Semantic Artefact
range: Thing
issued: 2014-01-14
equivalent property: keyClasses
equivalent property: mainEntity
derived from: https://w3id.org/mod/1.2
imported on: 2017-07-06
was influenced by: FAIR principle: F2
inverse of: isPrimaryTopicOf

metadata vocabulary used
type: ObjectProperty
label: vocabulaires de métadonnées utilisés @fr
domain: Semantic Artefact Distribution
domain: Semantic Artefact Catalog
range: anyURI
description: VOAF: Indicates that the subject vocabulary uses the object vocabulary in metadata at vocabulary or element level. SCHEMA: Indicates (by URL or string) a particular version of a schema used in some CreativeWork. MOD: A vocabulary(ies) that is used and/or referred to create the current ontology.
issued: 2013-05-23
equivalent property: metadataVoc
equivalent property: schemaVersion
equivalent property: vocabularyUsed
derived from: https://w3id.org/mod/1.0
imported on: 2015-08-05
history note: This property had been originally defined by VOAF metadata vocabulary. Now, it has been adopted and redefined in the MOD namespace.
was influenced by: MIRO guidelines: E.4,E9
was influenced by: FAIR principle: I2

root resource
type: Property
label: ressource racine @fr
domain: Dataset
domain includes: Semantic Artefact
range: Resource
description: VOID: A top concept or entry point for a void:Dataset that is structured in a tree-like fashion. All resources in a dataset can be reached by following links from its root resources in a small number of steps. MOD: This property is to provide the root class(es) of an ontology. This is automatically populated by taking the direct subclasses of owl:Thing. If the ontology is also defined as a unique skos:ConceptScheme, then this property should become equivalent of skos:hasTopConcept. SKOS: The property skos:hasTopConcept is, by convention, used to link a concept scheme to the SKOS concept(s) which are topmost in the hierarchical relations for that scheme.
issued: 2010-01-26
equivalent property: hasTopConcept
equivalent property: rootClasses
derived from: https://w3id.org/mod/1.0
imported on: 2015-08-05
was influenced by: FAIR principle: F2

class partition
type: Property
label: partition des classes @fr
domain: Dataset
domain includes: Semantic Artefact
range: Dataset
description: VOID: A subset of a void:Dataset that contains only the entities of a certain rdfs:Class.
issued: 2010-01-26
derived from: https://w3id.org/mod/1.4
imported on: 2018-08-02
was influenced by: FAIR principle: F2
sub property of: subset

property partition
type: Property
label: partition des propriétés @fr
domain: Dataset
domain includes: Semantic Artefact
range: Dataset
description: VOID: A subset of a void:Dataset that contains only the triples of a certain rdf:Property.
issued: 2010-01-26
derived from: https://w3id.org/mod/1.4
imported on: 2018-08-02
was influenced by: FAIR principle: F2
sub property of: subset

has version
type: Property
label: a pour version @fr
domain includes: Semantic Artefact
description: DCTERMS: a related resource that is a version, edition, or adaptation of the described resource. MOD: A related ontology that is a version, edition, or adaptation of the described ontology. PAV: This resource has a more specific, versioned resource.
issued: 2000-07-11
equivalent property: hasVersion
equivalent property: version
derived from: https://w3id.org/mod/1.2
imported on: 2017-07-06
was influenced by: FAIR principle: A2,R1.2

changes
type: AnnotationProperty
sub property of: seeAlso
label: changements @fr
domain includes: Semantic Artefact
domain includes: Semantic Artefact Catalog
description: VANN: A reference to a resource that describes changes between this version of a vocabulary and the previous.
issued: 2005-04-01
derived from: https://w3id.org/mod/1.2
imported on: 2017-07-06
was influenced by: FAIR principle: R1.2

dataset
type: Property
type: ObjectProperty
sub property of: has part (has view)
sub property of: member
label: jeu de données @fr
domain: Catalog
domain includes: Semantic Artefact Catalog
range: Dataset
description: DCAT: A collection of data that is listed in the catalog.
issued: 2014-01-16
derived from: https://w3id.org/mod/3.2
imported on: 2024-06-25

service
type: Property
type: ObjectProperty
sub property of: has part (has view)
sub property of: member
domain: Catalog
domain includes: Semantic Artefact Catalog
range: DataService
description: DCAT: A site or end-point that is listed in the catalog.
issued: 2020-02-04
derived from: https://w3id.org/mod/3.2
imported on: 2024-06-25

catalog record
type: Property
type: ObjectProperty
label: enregistrement dans le catalogue @fr
domain: Catalog
domain includes: Semantic Artefact Catalog
range: CatalogRecord
description: DCAT: A record describing the registration of a single dataset or data service that is part of the catalog.
issued: 2014-01-16
derived from: https://w3id.org/mod/3.2
imported on: 2024-06-25

theme taxonomy
type: Property
type: ObjectProperty
label: taxonomie de thèmes @fr
domain: Catalog
domain includes: Semantic Artefact Catalog
range: Resource
description: DCAT: A knowledge organization system (KOS) used to classify catalog's datasets and services.
issued: 2014-01-16
derived from: https://w3id.org/mod/3.2
imported on: 2024-06-25
range includes: Ontology
range includes: Collection
range includes: ConceptScheme

distribution
type: Property
type: ObjectProperty
sub property of: relation
domain: Dataset
domain includes: Semantic Artefact Catalog
range: Distribution
description: DCAT: An available distribution of the dataset.
issued: 2014-01-16
derived from: https://w3id.org/mod/3.2
imported on: 2024-06-25

associated media
type: Property
label: média associé @fr
domain includes: Semantic Artefact
domain includes: Semantic Artefact Catalog
description: SCHEMA: A media object that encodes this CreativeWork. This property is a synonym for encoding.
issued: 2012-04-21
derived from: https://w3id.org/mod/1.4
imported on: 2014-07-28
was influenced by: FAIR principle: F2
domain includes: CreativeWork
domain includes: HyperToc
domain includes: HyperTocEntry
range includes: MediaObject

depiction
type: Property
type: ObjectProperty
label: représentation @fr
domain: Thing
domain includes: Semantic Artefact
domain includes: Semantic Artefact Catalog
range: Image
description: FOAF: A depiction of some thing. DOAP: Web page with screenshots of project. An image of the item. This can be a URL or a fully described ImageObject.
issued: 2014-01-14
equivalent property: image
equivalent property: screenshots
derived from: https://w3id.org/mod/1.2
imported on: 2017-07-06
was influenced by: FAIR principle: F2
inverse of: depicts

logo
type: Property
type: InverseFunctionalProperty
type: ObjectProperty
domain: Thing
domain includes: Semantic Artefact
domain includes: Semantic Artefact Catalog
range: Thing
description: FOAF: A logo representing some thing. SCHEMA: An associated logo.
issued: 2014-01-14
equivalent property: logo
derived from: https://w3id.org/mod/1.2
imported on: 2017-07-06
was influenced by: FAIR principle: F2
inverse of: depicts

metrics
type: DatatypeProperty
label: métriques @fr
domain: Semantic Artefact
domain: Semantic Artefact Distribution
domain: Semantic Artefact Catalog
range: nonNegativeInteger
range: decimal
description: MOD: A generic property to store any metrics (number) related to the ontology.
issued: 2018-08-02
derived from: https://w3id.org/mod/1.4
imported on: 2018-08-02
was influenced by: MIRO guidelines: E.3
was influenced by: FAIR principle: F2

number of classes
type: DatatypeProperty
sub property of: metrics
label: nombre de classes @fr
domain: Semantic Artefact Distribution
domain: Semantic Artefact Catalog
range: nonNegativeInteger
description: MOD: The total number of classes in an ontology. OMV: Number of classes in the ontology. VOAF: The number of classes defined in the vocabulary namespace. Classes imported from other namespaces are not taken into account. VOID: The total number of distinct classes in a void:Dataset. In other words, the number of distinct resources occuring as objects of rdf:type.
issued: 2009-12-24
equivalent property: numberOfClasses
equivalent property: classNumber
equivalent property: classes
equivalent property: noOfClasses
derived from: https://w3id.org/mod/1.0
imported on: 2015-08-05
history note: This property has been adopted from OMV Ontology Metadata Vocabulary and redefined in the MOD namespace.
was influenced by: MIRO guidelines: E.3
was influenced by: FAIR principle: F2

number of individuals
type: DatatypeProperty
sub property of: metrics
label: nombre d'individus @fr
domain: Semantic Artefact Distribution
domain: Semantic Artefact Catalog
range: nonNegativeInteger
description: MOD: The total number of individuals in an ontology. OMV: Number of individuals in the ontology. VOID: The total number of entities that are described in a void:Dataset.
issued: 2009-12-24
equivalent property: numberOfIndividuals
equivalent property: entities
equivalent property: noOfIndividuals
derived from: https://w3id.org/mod/1.0
imported on: 2015-08-05
history note: This property has been adopted from OMV Ontology Metadata Vocabulary and redefined in the MOD namespace.
was influenced by: MIRO guidelines: E.3
was influenced by: FAIR principle: F2

number of properties
type: DatatypeProperty
sub property of: metrics
label: nombre de propriétés @fr
domain: Semantic Artefact Distribution
domain: Semantic Artefact Catalog
range: nonNegativeInteger
description: MOD: The total number of properties in an ontology. OMV: Number of properties in the ontology. VOAF: The number of properties defined in the vocabulary namespace. Properties imported from other namespaces are not taken into account. VOID: The total number of distinct properties in a void:Dataset. In other words, the number of distinct resources that occur in the predicate position of triples in the dataset.
issued: 2009-12-24
equivalent property: numberOfProperties
equivalent property: propertyNumber
equivalent property: properties
equivalent property: noOfProperties
derived from: https://w3id.org/mod/1.0
imported on: 2015-08-05
history note: This property has been adopted from OMV Ontology Metadata Vocabulary and redefined in the MOD namespace.
was influenced by: MIRO guidelines: E.3
was influenced by: FAIR principle: F2

number of object properties
type: DatatypeProperty
sub property of: number of properties
label: nombre de propriétés d'objet @fr
domain: Semantic Artefact Distribution
domain: Semantic Artefact Catalog
range: nonNegativeInteger
description: MOD: The total number of object properties in an ontology.
issued: 2017-07-06
derived from: https://w3id.org/mod/1.2
imported on: 2017-07-06
was influenced by: MIRO guidelines: E.3
was influenced by: FAIR principle: F2

number of data properties
type: DatatypeProperty
sub property of: number of properties
label: nombre de propriétés de données @fr
domain: Semantic Artefact Distribution
domain: Semantic Artefact Catalog
range: nonNegativeInteger
description: MOD: The total number of data properties in an ontology.
issued: 2017-07-06
derived from: https://w3id.org/mod/1.2
imported on: 2017-07-06
was influenced by: MIRO guidelines: E.3
was influenced by: FAIR principle: F2

number of axioms or triples
type: DatatypeProperty
sub property of: metrics
label: nombre d'axiomes ou de triples @fr
domain: Semantic Artefact Distribution
domain: Semantic Artefact Catalog
range: nonNegativeInteger
description: MOD: The total number of axioms in an ontology. OMV: Number of axioms in the ontology.
issued: 2009-12-24
equivalent property: numberOfAxioms
equivalent property: noOfAxioms
derived from: https://w3id.org/mod/1.0
imported on: 2015-08-05
history note: This property has been adopted from OMV Ontology Metadata Vocabulary and redefined in the MOD namespace.
was influenced by: MIRO guidelines: E.3
was influenced by: FAIR principle: F2

number of data properties
type: DatatypeProperty
sub property of: metrics
label: nombre de propriétés de données @fr
domain: Semantic Artefact Distribution
domain: Semantic Artefact Catalog
range: nonNegativeInteger
description: MOD: Number of defined labels for any resources in an ontology (classes, properties, etc).
issued: 2017-07-06
derived from: https://w3id.org/mod/1.2
imported on: 2017-07-06
was influenced by: MIRO guidelines: E.3
was influenced by: FAIR principle: F2

number of deprecated objects
type: DatatypeProperty
sub property of: metrics
label: nombre de d'objets dépréciés @fr
domain: Semantic Artefact Distribution
domain: Semantic Artefact Catalog
range: nonNegativeInteger
description: MOD: Number of objects (classes, properties, etc) declared as owl:deprecated=true in an ontology.
issued: 2024-05-30
derived from: https://w3id.org/mod/3.1
imported on: 2024-05-30
was influenced by: MIRO guidelines: E.3
was influenced by: FAIR principle: F2

byte size
type: Property
type: DatatypeProperty
label: taille en octets @fr
domain: Distribution
range: Literal
description: DCAT: The size of a distribution in bytes. MOD: The byte size of an ontology.
issued: 2014-01-16
equivalent property: size
equivalent property: byteSize
derived from: https://w3id.org/mod/1.0
imported on: 2015-08-05
was influenced by: MIRO guidelines: E.3
was influenced by: FAIR principle: F2
was influenced by: FAIRsFAIR profile: OPTIONAL
scope note: The size in bytes can be approximated when the precise size is not known. The literal value of dcat:byteSize should by typed as xsd:decimal.

maximum depth of the hierachy
type: DatatypeProperty
sub property of: metrics
label: profondeur maximum de la hierachie @fr
domain: Semantic Artefact Distribution
range: nonNegativeInteger
description: MOD: Maximum depth of the hierarchy tree (BioPortal definition).
issued: 2017-07-06
derived from: https://w3id.org/mod/1.4
imported on: 2018-08-02
was influenced by: FAIR principle: R1

maximum number of children per class
type: DatatypeProperty
sub property of: metrics
label: nombre maximum d'enfant par classe @fr
domain: Semantic Artefact Distribution
range: nonNegativeInteger
description: MOD: Maximum number of children per class (BioPortal definition).
issued: 2017-07-06
derived from: https://w3id.org/mod/1.4
imported on: 2018-08-02
was influenced by: FAIR principle: R1

average number of children per class
type: DatatypeProperty
sub property of: metrics
label: nombre moyen d'enfant par classe @fr
domain: Semantic Artefact Distribution
range: decimal
description: MOD: Average number of children per class (BioPortal definition).
issued: 2017-07-06
derived from: https://w3id.org/mod/1.4
imported on: 2018-08-02
was influenced by: FAIR principle: R1

number of classes with a single child
type: DatatypeProperty
sub property of: metrics
label: nombre de classes avec un seul enfant @fr
domain: Semantic Artefact Distribution
range: nonNegativeInteger
description: MOD: Number of classes that have only one subclass in the is-a hierarchy (BioPortal definition).
issued: 2017-07-06
derived from: https://w3id.org/mod/1.4
imported on: 2018-08-02
was influenced by: FAIR principle: R1

number of classes with more than 25 children
type: DatatypeProperty
sub property of: metrics
label: nombre de classes avec plus de 25 enfants @fr
domain: Semantic Artefact Distribution
range: nonNegativeInteger
description: MOD: Number of classes that have more than 25 direct subclasses (BioPortal definition).
issued: 2017-07-06
derived from: https://w3id.org/mod/1.4
imported on: 2018-08-02
was influenced by: FAIR principle: R1

number of classes with no definition
type: DatatypeProperty
sub property of: metrics
label: nombre de classes sans définition @fr
domain: Semantic Artefact Distribution
range: nonNegativeInteger
description: MOD: Number of classes that have no value for the definition property (BioPortal definition). For ontologies in OBO and RRF formats, the property for definition is part of the language. For OWL ontologies, the authors specify this property as part of the ontology metadata (the default is skos:definition).
issued: 2017-07-06
derived from: https://w3id.org/mod/1.4
imported on: 2018-08-02
was influenced by: FAIR principle: R1

number of classes with no formal or logical definition
type: DatatypeProperty
sub property of: metrics
label: nombre de classes sans définition formelle ou logique @fr
domain: Semantic Artefact Distribution
range: nonNegativeInteger
description: MOD: Number of classes with no formal or logical definition (e.g., an OWL restriction).
issued: 2024-05-30
derived from: https://w3id.org/mod/3.1
imported on: 2024-05-30
was influenced by: FAIR principle: R1

number of classes with no label
type: DatatypeProperty
sub property of: metrics
label: nombre de classes sans label @fr
domain: Semantic Artefact Distribution
range: nonNegativeInteger
description: MOD: Number of classes with no labels.
issued: 2024-05-30
derived from: https://w3id.org/mod/3.1
imported on: 2024-05-30
was influenced by: FAIR principle: R1

number of classes with no author metadata
type: DatatypeProperty
sub property of: metrics
label: nombre de classes sans métadonnées d'auteur @fr
domain: Semantic Artefact Distribution
range: nonNegativeInteger
description: MOD: Number of classes with author metadata.
issued: 2024-05-30
derived from: https://w3id.org/mod/3.1
imported on: 2024-05-30
was influenced by: FAIR principle: R1

number of classes with no date metadata
type: DatatypeProperty
sub property of: metrics
label: nombre de classes sans métadonnées de date @fr
domain: Semantic Artefact Distribution
range: nonNegativeInteger
description: MOD: Number of classes with no date metadata.
issued: 2024-05-30
derived from: https://w3id.org/mod/3.1
imported on: 2024-05-30
was influenced by: FAIR principle: R1

number of notes or comments
type: DatatypeProperty
sub property of: metrics
label: nombre de notes ou de commentaires @fr
domain: Semantic Artefact
range: nonNegativeInteger
description: MOD: Number of notes or comments (maybe represented with schema:comment) related to the ontologies.
issued: 2024-05-30
equivalent property: commentCount
derived from: https://w3id.org/mod/3.1
imported on: 2024-05-30
was influenced by: FAIR principle: R1

number of using projects
type: DatatypeProperty
sub property of: metrics
label: nombre de projets qui utilise @fr
domain: Semantic Artefact
domain: Semantic Artefact Catalog
range: nonNegativeInteger
description: MOD: Number of projects (maybe represented with mod:usedInProject) using an ontology.
issued: 2024-05-30
derived from: https://w3id.org/mod/3.1
imported on: 2024-05-30
was influenced by: FAIR principle: R1

number of endorsements
type: DatatypeProperty
sub property of: metrics
label: nombre d'approbation @fr
domain: Semantic Artefact
domain: Semantic Artefact Catalog
range: nonNegativeInteger
description: MOD: Number of endorsing organizations (maybe represented with mod:endorsedBy).
issued: 2024-05-30
derived from: https://w3id.org/mod/3.1
imported on: 2024-05-30
was influenced by: FAIR principle: R1

number of evaluations
type: DatatypeProperty
sub property of: metrics
label: nombre d'évaluations @fr
domain: Semantic Artefact
range: nonNegativeInteger
description: MOD: Number of evaluations (maybe represented with mod:hasEvaluation).
issued: 2024-05-30
derived from: https://w3id.org/mod/3.1
imported on: 2024-05-30
was influenced by: FAIR principle: R1

FAIR score
type: DatatypeProperty
sub property of: metrics
label: score FAIR @fr
domain: Semantic Artefact Distribution
domain: Semantic Artefact Catalog
range: nonNegativeInteger
description: MOD: Latest FAIR score the semantic artefact or average FAIR score of all resources in the catalogue, obtained with a known or identified FAIRness assessment tool.
issued: 2024-05-30
derived from: https://w3id.org/mod/3.1
imported on: 2024-05-30
was influenced by: FAIR principle: R1

number of mappings
type: DatatypeProperty
sub property of: metrics
label: nombre d'alignements @fr
domain: Semantic Artefact Distribution
domain: Semantic Artefact Catalog
range: nonNegativeInteger
description: MOD: Number of mappings within a given semantic artefact or semantic artefact catalogue.
issued: 2024-06-25
derived from: https://w3id.org/mod/3.2
imported on: 2024-06-25
was influenced by: FAIR principle: R1

number of users
type: DatatypeProperty
sub property of: metrics
label: nombre d'utilisateurs @fr
domain: Semantic Artefact
domain: Semantic Artefact Catalog
range: nonNegativeInteger
description: MOD: Total number of users in a semantic artefact catalogue or number of users watching/following/using a given semantic artefact.
issued: 2024-06-25
derived from: https://w3id.org/mod/3.2
imported on: 2024-06-25
was influenced by: FAIR principle: R1

number of agents
type: DatatypeProperty
sub property of: metrics
label: nombre d'agents @fr
domain: Semantic Artefact
domain: Semantic Artefact Catalog
range: nonNegativeInteger
description: MOD: Total number of agents in a semantic artefact catalogue or number of agents related a given semantic artefact.
issued: 2024-06-25
derived from: https://w3id.org/mod/3.2
imported on: 2024-06-25
was influenced by: FAIR principle: R1

number of semantic artefacts
type: DatatypeProperty
sub property of: metrics
label: nombre d'artefacts sémantiques @fr
domain: Semantic Artefact Catalog
range: nonNegativeInteger
description: MOD: Total number of semantic artefacts within a catalog.
issued: 2024-06-25
derived from: https://w3id.org/mod/3.2
imported on: 2024-07-29
was influenced by: FAIR principle: R1