Event Ontology
type: Ontology
version IRI: EventOntology
imports: InformationEntityOntology
license: BSD 3-Clause: https://github.com/CommonCoreOntology/CommonCoreOntologies/blob/master/LICENSE
rights: CUBRC Inc., see full license.
comment: This ontology is designed to represent processes, especially those performed by agents, that occur within multiple domains.
version info: Version 2.1

Process Profile
type: Class
subclass of: BFO_0000003
definition: An occurrent that is an occurrent part of some process by virtue of the rate, or pattern, or amplitude of change in an attribute of one or more participants of said process.
example: On a somewhat higher level of complexity are what we shall call rate process profiles, which are the targets of selective abstraction focused not on determinate quality magnitudes plotted over time, but rather on certain ratios between these magnitudes and elapsed times. A speed process profile, for example, is represented by a graph plotting against time the ratio of distance covered per unit of time. Since rates may change, and since such changes, too, may have rates of change, we have to deal here with a hierarchy of process profile universals at successive levels; One important sub-family of rate process profiles is illustrated by the beat or frequency profiles of cyclical processes, illustrated by the 60 beats per minute beating process of John’s heart, or the 120 beats per minute drumming process involved in one of John’s performances in a rock band, and so on. Each such process includes what we shall call a beat process profile instance as part, a subtype of rate process profile in which the salient ratio is not distance covered but rather number of beat cycles per unit of time. Each beat process profile instance instantiates the determinable universal beat process profile. But it also instantiates multiple more specialized universals at lower levels of generality, selected from rate process profilebeat process profileregular beat process profile3 bpm beat process profile4 bpm beat process profileirregular beat process profileincreasing beat process profileand so on.In the case of a regular beat process profile, a rate can be assigned in the simplest possible fashion by dividing the number of cycles by the length of the temporal region occupied by the beating process profile as a whole. Irregular process profiles of this sort, for example as identified in the clinic, or in the readings on an aircraft instrument panel, are often of diagnostic significance.; The simplest type of process profiles are what we shall call ‘quality process profiles’, which are the p…
scope note: b process_profile_of c holds when b proper_occurrent_part_of c& there is some proper_occurrent_part d of c which has no parts in common with b & is mutually dependent on b& is such that b, c and d occupy the same temporal region (axiom label in BFO2 Reference: [094-005])
ont00001760: Event Ontology

Change
type: Class
subclass of: BFO_0000015
definition: A Process in which some independent continuant endures and 1) one or more of the dependent entities it bears increase or decrease in intensity, 2) the entity begins to bear some dependent entity or 3) the entity ceases to bear some dependent entity.
ont00001760: Event Ontology

Act
type: Class
subclass of: BFO_0000015
definition: A Process in which at least one Agent plays a causative role.
ont00001760: Event Ontology

Upper Midrange Frequency
type: Class
subclass of: Sonic Frequency
definition: A Sonic Frequency that is between 2 and 4 kHz.
ont00001760: Event Ontology

Natural Process
type: Class
subclass of: BFO_0000015
definition: A Process existing in or produced by nature; rather than by the intent of human beings.
ont00001754: http://www.thefreedictionary.com/natural+process
ont00001760: Event Ontology

Sound Frequency
type: Class
subclass of: Frequency
subclass of: Restriction
  on property: BFO_0000132
  some values from: Sound Wave Process
definition: A Frequency that is the rate of Oscillations per second of a Sound Wave.
ont00001760: Event Ontology

Nominal Stasis
type: Class
subclass of: Stasis of Specifically Dependent Continuant
alternative label: Nominal
definition: A Stasis of Specifically Dependent Continuant in which some Independent Continuant bears a Quality or Realizable Entity that has a level of intensity or functionality that falls within the designed, expected, or acceptable range such that the Independent Continuant is of normal value, usefulness, or functionality.
ont00001754: https://en.oxforddictionaries.com/definition/nominal (Definition 6)
ont00001760: Event Ontology

Gain of Generically Dependent Continuant
type: Class
subclass of: Gain of Dependent Continuant
subclass of: Restriction
  on property: BFO_0000057
  some values from: Class
    intersection of: BFO_0000004
    intersection of: Restriction
      on property: BFO_0000101
      some values from: BFO_0000031
definition: A Gain of Dependent Continuant wherein some Independent Continuant becomes the carrier of some Generically Dependent Continuant.
example: A Person forms a Plan, A Person is initiated into a Religion, A photgraphic image is produced.
ont00001760: Event Ontology

Triangular Waveform
type: Class
subclass of: Waveform
definition: A Waveform that is characterized by a triangular shape due to the continuous linear zig-zag transitions between minimum and maximum Amplitudes of the Wave Cycle.
ont00001760: Event Ontology

Act of Advising
type: Class
subclass of: Act of Directive Communication
definition: An Act of Directive Communication performed by providing advice or counsel to another agent.
ont00001754: http://www.dictionary.com/browse/advising
ont00001760: Event Ontology

Mailing
type: Class
subclass of: Act of Communication by Media
alternative label: Act of Mailing
definition: An Act of Communication by Media in which information and tangible objects, usually written documents, are delivered to destinations around the world.
ont00001754: https://en.wikipedia.org/w/index.php
ont00001760: Event Ontology

Decrease of Role
type: Class
subclass of: Decrease of Realizable Entity
definition: A Decrease of Realizable Entity in which some Independent Continuant has a decrease of some Role that it bears.
ont00001760: Event Ontology

Soft X-ray Frequency
type: Class
subclass of: X-ray Frequency
definition: An X-Ray Frequency that is between 30 petahertz and 3 exahertz.
ont00001760: Event Ontology

Act of Observation
type: Class
subclass of: Planned Act
definition: A Planned Act of acquiring information from a source via the use of one or more senses.
ont00001754: https://en.wikipedia.org/w/index.php
ont00001760: Event Ontology

Act of Construction
type: Class
subclass of: Act of Material Artifact Processing
definition: An Act of Material Artifact Processing wherein Material Artifacts are built on site as prescribed by some contract.
scope note: An Act of Construction typically involves the production of only one or a limited number of goods, such as in the construction of an airport or a community of condominiums.
ont00001760: Event Ontology

Act of Location Change
type: Class
subclass of: Act of Motion
definition: An Act of Motion in which the location of some Object is changed by some Agent.
ont00001760: Event Ontology

Act of Estimation
type: Class
subclass of: Act of Measuring
alternative label: Act of Approximation
definition: An Act of Measuring that involves the comparison of a measurement of a similar Entity or of a portion of the Entity being estimated to produce an approximated measurement of the target Entity.
example: measuring how much time a train will add to your commute by measuring how long it takes for 10 train cars to pass a given point and then combining this information with an estimate of how many train cars are in a typical train based on your past experience
example: measuring the amount of time required to do a task based on how long it took to do a similar task in the past
example: measuring the height of a building by counting the number of floors and multiplying it by the height of an average floor in an average building
example: measuring the property value of a house based on its square footage and the average cost per square foot of other houses in the area
scope note: Although the boundary between Act of Estimation and guessing is vague, estimation can be partially distinguished from guessing in that every Act of Estimation has as input some relevant information; whereas an act of guessing can occur sans information (or at least sans pertinent information). For example, if Mr. Green were asked how many blades of grass are in his lawn, he could simply choose a number (i.e. he could guess) or he could estimate the number by counting how many baldes of grass are in 1 square foot of his lawn, measuring the square footage of his lawn, and then multiplying these values to arrive at a number. Hence, many estimates may be loosely considered to be educated guesses.
scope note: In all cases, the Agent in an Act of Estimation either lacks complete information, lacks access to the relevant information, or chooses not to use the complete information (perhaps to save money or time) about the thing being estimated; instead, the Agent uses some or all of the relevant information that the Agent does have as a basis for arriving at the estimate.
scope note: Note that, while every Act of Measuring arguably involves some degree of estimation (for example, a measuring instrument rounding to the nearest ten-thousandth or an Agent reading an analog display), it would be a mistake to classify all Acts of Measuring as Acts of Estimation. This holds even for cases (e.g. census taking) in which sofisticated estimations are often more accurate than other means of measuring (e.g. enumeration).
ont00001760: Event Ontology

Act of Social Movement
type: Class
subclass of: Social Act
definition: A Social Act composed of a series of performances, displays and campaigns directed at implementing, resisting or undoing a change in society.
ont00001754: https://en.wikipedia.org/w/index.php
ont00001760: Event Ontology

Process Ending
type: Class
subclass of: BFO_0000035
definition: A Process Boundary that occupies a Zero-Dimensional Temporal Region that is the ending instant of the One-Dimensional Temporal Region that the Process, of which the Process Boundary is a part, occupies.
ont00001760: Event Ontology

Wave Process
type: Class
subclass of: Natural Process
subclass of: Restriction
  on property: BFO_0000062
  some values from: Wave Production
subclass of: Restriction
  on property: ont00001777
  some values from: Wave Process Profile
definition: A Natural Process that involves Oscillation accompanied by a transfer of energy that travels through a portion of matter or spatial region.
ont00001754: https://en.wikipedia.org/w/index.php
ont00001760: Event Ontology

Stasis of Partially Mission Capable
type: Class
subclass of: Stasis of Mission Capability
definition: A Stasis of Mission Capability during which the participating Continuant is capable of performing some but not all of its primary functions for the specified Mission.
ont00001760: Event Ontology

End of Life Stasis
type: Class
subclass of: Stasis of Artifact Operationality
definition: A Stasis of Artifact Operationality that holds during a Temporal Interval when the participating Material Artifact is no longer capable of realizing all of its designed primary Artifact Functions.
scope note: An End of Life Stasis (EoL) is distinguished from a Stasis of Partially Mission Capable or Stasis of Non-Mission Capable in that EoL is more inclusive such that the participating Material Artifact may be either Partially or Non-Mission Capable. Additionally, EoL applies only to Artifacts and is typically determined in relation to its original mission and designed primary functions. In contrast, an Artifact's level of Mission Capability depends on the requirements of the mission under consideration such that a given Artifact may simultaneously be Fully Mission Capable for mission1, Partially Mission Capable for mission2, and Non-Mission Capable for mission3.
ont00001753: EOL
ont00001753: EoL
ont00001760: Event Ontology

Increase of Generically Dependent Continuant
type: Class
subclass of: Increase of Dependent Continuant
definition: An Increase of Dependent Continuant in which some Independent Continuant has an increase of some Generically Dependent Continuant that it bears.
ont00001760: Event Ontology

Act of Military Force
type: Class
subclass of: Planned Act
definition: A Planned Act of employing a Military Force to achieve some desired result.
ont00001760: Event Ontology

Mechanical Process
type: Class
subclass of: BFO_0000015
definition: A Process that is the realization of some Disposition of a Material Artifact
ont00001760: Event Ontology

Stasis of Disposition
type: Class
subclass of: Stasis of Realizable Entity
definition: A Stasis of Realizable Entity in which some Independent Continuant bears some Disposition that remains unchanged during a Temporal Interval.
ont00001760: Event Ontology

Act of Conducting Mass Media Interview
type: Class
subclass of: Act of Mass Media Communication
definition: An Act of Mass Media Communication involving a conversation between a reporter and a person of public interest, used as a basis of a broadcast or publication.
ont00001754: JC3IEDM-MIRD-DMWG-Edition_3.0.2_20090514
ont00001760: Event Ontology

Act of Expressive Communication
type: Class
subclass of: Act of Communication
definition: An Act of Communication in which an Agent expresses their attitudes or emotions towards some entity.
scope note: Examples: apologizing, condoling, congratulating, greeting, thanking, accepting (acknowledging an acknowledgment)
ont00001754: Derived (loosely) from: John Searle's Speech Acts: An Essay in the Philosophy of Language
ont00001760: Event Ontology

Increase of Quality
type: Class
subclass of: Increase of Specifically Dependent Continuant
definition: An Increase of Specifically Dependent Continuant in which some Indpendent Continuant has an increase of some Quality that it bears.
ont00001760: Event Ontology

Act of Directive Communication
type: Class
subclass of: Act of Communication
definition: An Act of Communication that is intended to cause the hearer to take a particular action.
scope note: Examples: advising, admonishing, asking, begging, dismissing, excusing, forbidding, instructing, ordering, permitting, requesting, requiring, suggesting, urging, warning
ont00001754: Derived (loosely) from: John Searle's Speech Acts: An Essay in the Philosophy of Language
ont00001760: Event Ontology

Stasis of Specifically Dependent Continuant
type: Class
subclass of: Stasis
definition: A Stasis in which some Independent Continuant bears some Specifically Dependent Continuant that remains unchanged during a Temporal Interval.
ont00001760: Event Ontology

Act of Financial Deposit
type: Class
subclass of: Act of Financial Instrument Use
definition: An Act of Financial Instrument Use wherein a Financial Instrument is transferred by an Agent (the Depositor) to another Agent to create a liability to be repaid to the Depositor through an Act of Financial Withdrawal.
ont00001754: http://en.wikipedia.org/wiki/Deposit_(bank)
ont00001760: Event Ontology

Maximum Power
type: Class
subclass of: Power
definition: A Power that is characterized by the maximum rate of Work, or Energy consumed, done in a given time period.
ont00001760: Event Ontology

Act of Government
type: Class
subclass of: Planned Act
definition: A Planned Act that is initiated or supported by some Geopolitical Entity and enforced by some Government Agent.
ont00001760: Event Ontology

Act of Meeting
type: Class
subclass of: Act of Association
definition: An Act of Association wherein two or more Persons assemble for some common purpose.
ont00001754: http://wordnetweb.princeton.edu/perl/webwn?s=meet (Sense Key: meet%2:41:00, get together%2:41:00)
ont00001760: Event Ontology

Clockwise Rotational Motion
type: Class
subclass of: Rotational Motion
alternative label: CW Rotational Motion
alternative label: Clockwise Rotation
definition: A Rotational Motion in which the direction of rotation is toward the right as seen relative to the designated side of the plane of rotation.
example: the axial rotation of the Earth as seen from above the South Pole
ont00001760: Event Ontology

Instant Messaging
type: Class
subclass of: Act of Communication by Media
alternative label: Act of IMing
alternative label: Act of Instant Messaging
definition: An Act of Communication by Media in which real-time direct text-based communication occurs between two or more people using personal computers or other devices, along with shared Instant Messaging Client Software conveyed over a network, such as the Internet.
ont00001754: https://en.wikipedia.org/w/index.php
ont00001760: Event Ontology

Radio Frequency
type: Class
subclass of: Electromagnetic Radiation Frequency
definition: An Electromagnetic Radiation Frequency of some Electromagnetic Wave that is between 3 kHz and 300 GHz.
ont00001753: RF
ont00001754: https://en.wikipedia.org/w/index.php
ont00001760: Event Ontology

Act of Reporting
type: Class
subclass of: Act of Representative Communication
definition: An Act of Representative Communication performed by giving a detailed account or statement.
ont00001754: http://www.merriam-webster.com/dictionary/report
ont00001760: Event Ontology

Near Infrared Light Frequency
type: Class
subclass of: Infrared Light Frequency
definition: An Infrared Light Frequency that is between 214 and 400 terahertz.
ont00001754: https://en.wikipedia.org/w/index.php
ont00001760: Event Ontology

Criminal Act
type: Class
subclass of: Planned Act
definition: A Planned Act committed in violation of rules or laws for which some governing authority (via mechanisms such as legal systems) can prescribe a conviction.
ont00001754: https://en.wikipedia.org/w/index.php
ont00001760: Event Ontology

Wave Cycle
type: Class
subclass of: Wave Process
definition: A Wave Process that consists of a portion of a Wave Process that begins at an arbitrary point of the Wave Process and ends at the next point when the pattern of the Wave Process begins to repeat.
ont00001760: Event Ontology

Act of Interpersonal Relationship
type: Class
subclass of: Act of Association
definition: An Act of Association between two or more Persons that may range from fleeting to enduring.
ont00001754: https://en.wikipedia.org/w/index.php
ont00001760: Event Ontology

Very High Frequency
type: Class
subclass of: Radio Frequency
alternative label: ITU Band Number 8
definition: A Radio Frequency that is between 30 and 300 MHz.
scope note: The corresponding Wavelength range is 10–1 m
ont00001753: VHF
ont00001754: International Telecommunication Union (ITU) and IEEE 521-2002 - IEEE Standard Letter Designations for Radar-Frequency Bands
ont00001760: Event Ontology

Thrust
type: Class
subclass of: Force
definition: A Force that is equal in magnitude to but in the opposite direction of an exerted Force and which is used to describe the forward Force of a Jet or Rocket Engine in reaction to the Acceleration of its Reaction Mass in the opposite direction.
scope note: More generally, Thrust is the propulsive Force of a Rocket.
ont00001760: Event Ontology

Act of Thanking
type: Class
subclass of: Act of Expressive Communication
definition: An Act of Expressive Communication performed by expressing gratitude.
ont00001754: http://www.merriam-webster.com/dictionary/thanks
ont00001760: Event Ontology

Act of Homicide
type: Class
subclass of: Act of Violence
subclass of: Restriction
  on property: ont00001803
  some values from: Death
definition: An Act of Violence which causes the unlawful killing of another person.
ont00001760: Event Ontology

Process Beginning
type: Class
subclass of: BFO_0000035
definition: A Process Boundary that occupies a Zero-Dimensional Temporal Region that is the starting instant of the One-Dimensional Temporal Region that the Process, of which the Process Boundary is a part, occupies.
ont00001760: Event Ontology

Act of Pilgrimage
type: Class
subclass of: Act of Travel
definition: An Act of Travel to a location of importance to a person's beliefs and faith.
ont00001754: https://en.wikipedia.org/w/index.php
ont00001760: Event Ontology

Act of Change of Residence
type: Class
subclass of: Act of Location Change
definition: An Act of Location Change involving one or more Persons moving from one place of residence to another.
ont00001760: Event Ontology

Act of Terrorist Training Instruction
type: Class
subclass of: Act of Training Instruction
definition: An Act of Training Instruction performed by an Agent who realizes a capacity derived from the Agent's affiliation with some Terrorist Organization by imparting knowledge of the tactics, techniques, and/or strategies of the use of violence against civilians in order to attain goals that are political, religous, or ideological in nature to an Agent either directly or indirectly through some communication medium.
ont00001754: http://wordnetweb.princeton.edu/perl/webwn
ont00001760: Event Ontology

Act of Congratulating
type: Class
subclass of: Act of Expressive Communication
definition: An Act of Expressive Communication performed by expressing vicarious pleasure to a person on the occasion of their success or good fortune.
ont00001754: http://www.merriam-webster.com/dictionary/congratulate
ont00001760: Event Ontology

Sound Wavelength
type: Class
subclass of: Wavelength
definition: A Wavelength that is the distance a Sound Wave traverses during one Wave Cycle.
ont00001754: http://www.physicsclassroom.com/Class/waves/u10l2b.cfm
ont00001760: Event Ontology

Presence Frequency
type: Class
subclass of: Sonic Frequency
definition: A Sonic Frequency that is between 4 and 6 kHz.
ont00001760: Event Ontology

Planned Act
type: Class
subclass of: Act
alternative label: Intentional Act
definition: An Act in which at least one Agent plays a causative role and which is prescribed by some Prescriptive Information Content Entity held by at least one of the Agents.
ont00001760: Event Ontology

Act of Training
type: Class
subclass of: Planned Act
definition: A Planned Act in which knowledge, skills or values are imparted from one or more Agents to at least one other Agent.
ont00001754: https://en.wikipedia.org/w/index.php
ont00001760: Event Ontology

Act of Vocational Training Acquisition
type: Class
subclass of: Act of Training Acquisition
definition: An Act of Training Acquisition performed by an Agent by acquiring skills required for a specific occupation in industry, agriculture or trade from an Agent or communication medium that realizes a capacity derived from its affiliation with a Vocational School, Technical School, Trade Organization, or Industry Educational Program Provider.
ont00001754: http://wordnetweb.princeton.edu/perl/webwn
ont00001760: Event Ontology

Act of Terrorist Training Acquisition
type: Class
subclass of: Act of Training Acquisition
definition: An Act of Training Acquisition performed by an Agent by acquiring knowledge of the tactics, techniques, and/or strategies of the use of violence against civilians in order to attain goals that are political, religous, or ideological in nature from an Agent or communication medium that realizes a capacity derived from its affiliation with a Terrorist Organization.
ont00001754: http://wordnetweb.princeton.edu/perl/webwn
ont00001760: Event Ontology

Act of Oath Taking
type: Class
subclass of: Act of Commissive Communication
definition: An Act of Commissive Communication performed by stating or promising, usually calling upon something or someone that the oath maker considers sacred.
ont00001754: https://en.wikipedia.org/w/index.php
ont00001760: Event Ontology

Stasis of Realizable Entity
type: Class
subclass of: Stasis of Specifically Dependent Continuant
definition: A Stasis of Specifically Dependent Continuant in which some Independent Continuant bears some Realizable Entity that remains unchanged during a Temporal Interval.
ont00001760: Event Ontology

Loss of Realizable Entity
type: Class
subclass of: Loss of Specifically Dependent Continuant
definition: A Loss of Specifically Dependent Continuant in which some Independent Continuant ceases to be the bearer of some Realizable Entity.
ont00001760: Event Ontology

Muzzle Blast
type: Class
subclass of: Sound Wave Process
definition: A Sound Wave Process that is caused by a projectile being pushed from the barrel of a firearm by an explosive charge.
ont00001760: Event Ontology

Gamma Ray Frequency
type: Class
subclass of: Electromagnetic Radiation Frequency
definition: An Electromagnetic Radiation Frequency of some Electromagnetic Wave that is above 30 exahertz.
scope note: Currently gamma radiation is distinguished from x-rays by their source--either inside or outside of the nucleus--rather than by frequency, energy, and wavelength. https://en.wikipedia.org/wiki/Gamma_ray#Naming_conventions_and_overlap_in_terminology
ont00001754: https://en.wikipedia.org/w/index.php
ont00001760: Event Ontology

Election
type: Class
subclass of: Social Act
alternative label: Act of Political Election
definition: A Social Act by which a population chooses an individual to hold public office.
ont00001754: https://en.wikipedia.org/w/index.php
ont00001760: Event Ontology

Combustion
type: Class
subclass of: Natural Process
alternative label: Burning Process
alternative label: Combustion Process
definition: A Natural Process in which a Portion of Fuel or other Material Entity is burned.
ont00001760: Event Ontology

Momentum
type: Class
subclass of: Process Profile
subclass of: Restriction
  on property: BFO_0000132
  some values from: Motion
definition: A Process Profile of an object in Motion that is the product of its Mass and Velocity with respect to a frame of reference.
scope note: The SI unit of measure for Momentum is Newton seconds (N s).
ont00001760: Event Ontology

Stasis of Partially Mission Capable Maintenance
type: Class
subclass of: Stasis of Partially Mission Capable
definition: A Stasis of Partially Mission Capable during which the participating Continuant is not capable of performing some of its primary functions for the specified Mission due to participating in an Act Of Maintenance.
ont00001760: Event Ontology

Decrease of Specifically Dependent Continuant
type: Class
subclass of: Decrease of Dependent Continuant
definition: A Decrease of Dependent Continuant in which some Independent Continuant has a decrease in some Specifically Dependent Continuant that it bears.
ont00001760: Event Ontology

Act of Decoy Use
type: Class
subclass of: Act of Artifact Employment
definition: An Act of Artifact Employment in which some Agent uses some Decoy.
ont00001760: Event Ontology

Angular Velocity
type: Class
subclass of: Velocity
alternative label: Rotational Velocity
definition: A Velocity that is characterized by both the angular Speed of an object and the Axis about which the object is Rotating.
ont00001754: https://en.wikipedia.org/w/index.php
ont00001760: Event Ontology

Sound Pressure
type: Class
subclass of: Pressure
alternative label: Acoustic Pressure
definition: A Pressure that is caused by a Sound Wave and is a local deviation from the ambient Pressure.
ont00001760: Event Ontology

Act of Military Service
type: Class
subclass of: Act of Employment by an Organization
definition: An Act of Employment by an Organization wherein a Person serves as a member of a Military Force, whether voluntarily or by conscription.
ont00001754: http://www.collinsdictionary.com/dictionary/english/military-service
ont00001760: Event Ontology

Propulsion Process
type: Class
subclass of: Natural Process
definition: A Natural Process in which one or more Forces are generated and applied to a participating Object such that the Object is set in Motion or has the direction or magnitude of its Motion altered.
example: a twin-engine turboprop plane rotating both of its propellers against a portion of atmosphere to propel the plane forward
example: an apple falling to the ground under the power of Earth's gravitational force
example: burning a portion of fuel to produce exhaust that is ejected through a jet nozzle to propel a rocket and its payload
example: heat from a fire causing ashes to rise into the sky
example: launching a water balloon using a sling shot
example: the wind blowing leaves across a lawn
example: turning a paddle wheel against a portion of water to propel the paddle boat forward
scope note: In each case, a Propulsion Process minimally involves the Object being propelled, a Reaction Mass (e.g. a portion of water, atmosphere, exhaust, etc.), and the Force(s) acting between these two entities.
ont00001760: Event Ontology

Wavelength
type: Class
subclass of: Wave Process Profile
definition: A Wave Process Profile that is the distance the Wave Process traverses during one Wave Cycle.
scope note: Assuming a non-dispersive media, the Wavelength will be the inverse of the Frequency.
ont00001760: Event Ontology

Act of Reconnaissance
type: Class
subclass of: Act of Intelligence Gathering
definition: An Act of Intelligence Gathering used to determine an Agent's disposition and intention; the composition and capabilities of Equipment and Facilities, and the surrounding landforms and weather conditions.
ont00001754: https://en.wikipedia.org/w/index.php
ont00001760: Event Ontology

Act of Funding
type: Class
subclass of: Act of Financial Instrument Use
definition: An Act of Financial Instrument Use in which an Agent (the Funder) provides some Financial Instrument to another Agent (the recipient of the funds) as a resource pool that is earmarked by the Funder for a future transaction.
ont00001760: Event Ontology

Stasis of Generically Dependent Continuant
type: Class
subclass of: Stasis
definition: A Stasis in which some Independent Continuant bears some Generically Dependent Continuant that remains unchanged during a Temporal Interval.
ont00001760: Event Ontology

Act of Measuring
type: Class
subclass of: Planned Act
definition: A Planned Act that involves determining the extent, dimensions, quanity, or quality of an Entity relative to some standard.
example: putting an object on a scale to measure its weight in kilograms
example: rating Hollywood movies on a 1 to 5 star scale
example: using a tape measure to determine the height and width of a doorway in inches
ont00001760: Event Ontology

Act of Commanding
type: Class
subclass of: Act of Directive Communication
definition: An Act of Directive Communication through which an Agent exercises authoritative control or power over another Agent's actions.
ont00001754: http://wordnetweb.princeton.edu/perl/webwn?s=commanding (Edited 08-22-2016)
ont00001760: Event Ontology

Act of Testifying
type: Class
subclass of: Act of Representative Communication
definition: An Act of Representative Communication performed by stating one's personal knowledge or belief.
ont00001754: http://www.merriam-webster.com/dictionary/testify
ont00001760: Event Ontology

Act of Publishing Mass Media Article
type: Class
subclass of: Act of Mass Media Communication
definition: An Act of Mass Media Communication involving the preparation and public issuance of a non-fictional essay, especially one included with others in a newspaper, magazine, journal, etc.
ont00001754: JC3IEDM-MIRD-DMWG-Edition_3.0.2_20090514
ont00001760: Event Ontology

Act of Motion
type: Class
subclass of: Planned Act
definition: A Planned Act by which an Agent causes the position or location of some Object to change.
ont00001754: http://www.merriam-webster.com/dictionary/motion
ont00001760: Event Ontology

Wounded Stasis
type: Class
subclass of: Damaged Stasis
alternative label: Wounded
definition: A Damaged Stasis in which a Person or other organism is the bearer of a Quality or Realizable Entity that has suffered impairment (i.e., a decrease or loss) due to an injuring event.
ont00001760: Event Ontology

Increase of Function
type: Class
subclass of: Increase of Disposition
definition: An Increase of Disposition in which some Independent Continuant has an increase of some Function that it bears.
ont00001760: Event Ontology

Act of Information Processing
type: Class
subclass of: Planned Act
definition: A Planned Act in which one or more input Information Content Entities are received, manipulated, transferred, or stored by an Agent.
ont00001760: Event Ontology

Act of Military Training Instruction
type: Class
subclass of: Act of Training Instruction
definition: An Act of Training Instruction performed by an Agent who realizes a capacity derived from the Agent's affiliation with some Military Organization by imparting knowledge of the tactics, techniques, and/or strategies of Military Operations to an Agent either directly or indirectly through some communication medium.
ont00001760: Event Ontology

Rotational Motion
type: Class
subclass of: Motion
subclass of: Restriction
  on property: ont00001777
  some values from: Angular Velocity
alternative label: Rotation
definition: A Motion Process in which an Object moves in a Circular or Elliptical Path around an Axis of Rotation.
ont00001754: https://en.wikipedia.org/w/index.php
ont00001760: Event Ontology

Act of Condoling
type: Class
subclass of: Act of Expressive Communication
definition: An Act of Expressive Communication performed by expressing sympathy or sorrow.
ont00001754: http://www.thefreedictionary.com/condoling
ont00001760: Event Ontology

Act of Prediction
type: Class
subclass of: Planned Act
definition: A Planned Act that involves the generation of a Predictive Information Content entity that is intended to describe an uncertain possible future event, value, entity, or attribute of an entity.
example: a chess master predicting the next 8 moves his opponent will make
example: predicting that a particular stock will double in value over the next fiscal quarter
example: using sample exit polls data to predict the winners of an election
scope note: An Act of Prediction may involve the use of some or no relevant information. An Act of Prediction that utilizes relevant information may also be (or at least involve) an Act of Estimation. Hence, these two classes are not disjoint. Furthermore, neither class subsumes the other since estimates can be made about existing entities and not all predictions produce measurements (e.g. predicting that it will rain tomorrow).
scope note: Predictions can only be made about things that are not yet the case (i.e. future things) and are further restricted to being about things that do not have a probability of either 1 (necessary) or 0 (impossible). For example, assuming that no organism is immortal, one cannot predict of a given organism that it will eventually die; however, one may predict uncertain things about the organism's eventual death, such as its precise cause or time.
ont00001760: Event Ontology

Act of Representative Communication
type: Class
subclass of: Act of Communication
definition: An Act of Communication that commits a speaker to the truth of the expressed proposition.
scope note: Examples: affirming, alleging, announcing, answering, attributing, claiming, classifying, concurring, confirming, conjecturing, denying, disagreeing, disclosing, disputing, identifying, informing, insisting, predicting, ranking, reporting, stating, stipulating
ont00001754: Derived (loosely) from: John Searle's Speech Acts: An Essay in the Philosophy of Language
ont00001760: Event Ontology

Pressure
type: Class
subclass of: Force
definition: A Force that is applied perpendicular to the surface of an Object per unit area over which that Force is distributed.
ont00001760: Event Ontology

Rectilinear Motion
type: Class
subclass of: Translational Motion
alternative label: Linear Motion
definition: A Translational Motion process in which an Object moves along a straight path.
ont00001760: Event Ontology

Webcast
type: Class
subclass of: Act of Communication by Media
alternative label: Act of Webcasting
definition: An Act of Communciation by Media transmitted to an audience over the Internet using streaming media technology to distribute a single content source that may be distributed live or on demand.
scope note: Essentially, webcasting is “broadcasting” over the Internet.
ont00001754: https://en.wikipedia.org/w/index.php
ont00001760: Event Ontology

Act of Buying
type: Class
subclass of: Act of Purchasing
definition: An Act of Purchasing wherein a Financial Instrument is used by an Agent (the Buyer) to acquire ownership of a good from another Agent (the Seller).
ont00001760: Event Ontology

Tremendously High Frequency
type: Class
subclass of: Electromagnetic Radiation Frequency
alternative label: ITU Band Number 12
alternative label: Submillimeter Band Frequency
alternative label: Terahertz Radiation Frequency
definition: An Electromagnetic Radiation Frequency of some Electromagnetic Wave that is between 300 GHz and 3 THz.
scope note: The corresponding Wavelength range is 1–0.1 mm
ont00001753: THF
ont00001754: International Telecommunication Union (ITU)
ont00001760: Event Ontology

Gain of Specifically Dependent Continuant
type: Class
subclass of: Gain of Dependent Continuant
subclass of: Restriction
  on property: BFO_0000057
  some values from: Class
    intersection of: BFO_0000004
    intersection of: Restriction
      on property: BFO_0000196
      some values from: BFO_0000020
definition: A Gain of Dependent Continuant in which some Independent Continuant becomes the bearer of some Specifically Dependent Continuant.
example: A Person becomes pregnant (gain of quality), A person becomes forgetful (gain of disposition), A vehicle becomes amphibious (gain of function), A Person becomes a Database Administrator (gain of role).
ont00001760: Event Ontology

Extremely Low Frequency
type: Class
subclass of: Radio Frequency
alternative label: ITU Band Number 1
definition: A Radio Frequency that is between 3 and 30 Hz.
scope note: The corresponding Wavelength range is 100,000–10,000 km
ont00001753: ELF
ont00001754: International Telecommunication Union (ITU)
ont00001760: Event Ontology

Fundamental Frequency
type: Class
subclass of: Sound Frequency
definition: A Sound Frequency that is the lowest Frequency of a Sound Wave.
ont00001760: Event Ontology

Act of Communication
type: Class
subclass of: Planned Act
definition: A Planned Act in which some Information Content Entity is transferred from some Agent to Another.
ont00001754: https://en.wikipedia.org/w/index.php
ont00001760: Event Ontology

Square Waveform
type: Class
subclass of: Waveform
definition: A Waveform that is characterized by a square shape due to the near-instantaneous transitions between minimum and maximum Amplitudes of the Wave Cycle.
ont00001760: Event Ontology

Act of Publishing Mass Media Press Release
type: Class
subclass of: Act of Mass Media Communication
definition: An Act of Mass Media Communication involving the preparation and public issuance of an official statement issued to one or more members of the media for the purpose of announcing newsworthy information.
ont00001754: JC3IEDM-MIRD-DMWG-Edition_3.0.2_20090514
ont00001760: Event Ontology

Biographical Life
type: Class
subclass of: Act
definition: An Act composed of the Life Events that occur during the course of existence of an Agent (i.e. Person or Organization).
ont00001760: Event Ontology

Stable Orientation
type: Class
subclass of: Stasis of Quality
definition: A Stasis of Quality that holds during a Temporal Interval when an object maintains the same Spatial Orientation.
ont00001760: Event Ontology

Act of Association
type: Class
subclass of: Social Act
definition: A Social Act wherein an Agent unites with some other Agent in a Planned Act, enterprise or business.
ont00001754: http://en.wiktionary.org/wiki/associate
ont00001760: Event Ontology

Act of Official Documentation
type: Class
subclass of: Act of Declarative Communication
definition: An Act of Declarative Communication in which an Agent records some information for official use by another Agent.
ont00001760: Event Ontology

Act of Remuneration
type: Class
subclass of: Act of Purchasing
definition: An Act of Purchasing wherein a Financial Instrument is used by an Agent (the Employer) to compensate another Agent (the Employee) for the services they perform for the Employer.
scope note: Comment: Remuneration normally consists of salary or hourly wages, but also applies to commission, stock options, fringe benefits, etc.
ont00001754: https://en.wikipedia.org/w/index.php
ont00001760: Event Ontology

Act of Ceremony
type: Class
subclass of: Social Act
definition: A Social Act of ritual significance, performed on a special occasion.
ont00001754: https://en.wikipedia.org/w/index.php
ont00001760: Event Ontology

Gain of Function
type: Class
subclass of: Gain of Disposition
subclass of: Restriction
  on property: BFO_0000057
  some values from: Class
    intersection of: BFO_0000004
    intersection of: Restriction
      on property: BFO_0000196
      some values from: BFO_0000034
definition: A Gain of Disposition in which some Independent Continuant becomes the bearer of some Function.
scope note: This class should be used to demarcate the start of the temporal interval (through the BFO 'occupies temporal region' property) that the Entity bears the Function.
ont00001760: Event Ontology

Act of Educational Training Instruction
type: Class
subclass of: Act of Training Instruction
definition: An Act of Training Instruction performed by an Agent who realizes a capacity derived from the Agent's affiliation with some Educational Organization by imparting knowledge of a curriculum to an Agent either directly or indirectly through some communication medium.
ont00001760: Event Ontology

X-ray Frequency
type: Class
subclass of: Electromagnetic Radiation Frequency
definition: An Electromagnetic Radiation Frequency of some Electromagnetic Wave that is between 30 petahertz and 30 exahertz.
ont00001760: Event Ontology

Email Messaging
type: Class
subclass of: Act of Communication by Media
alternative label: Act of Emailing
definition: An Act of Communication by Media in which text-based communication occurs between two or more people using personal computers or other devices using some Email Client Software conveyed over the Internet.
ont00001754: https://en.wikipedia.org/w/index.php
ont00001760: Event Ontology

Act of Financial Withdrawal
type: Class
subclass of: Act of Financial Instrument Use
definition: An Act of Financial Instrument Use wherein a Financial Instrument is transferred by an Agent to another Agent (the Depositor) from an account created by an earlier Act of Financial Deposit performed by the Depositor.
ont00001754: http://en.wikipedia.org/wiki/Deposit_(bank)
ont00001760: Event Ontology

Power
type: Class
subclass of: Process Profile
definition: A Process Profile that is characterized by the rate of Work, or Energy consumed, done in a given time period.
ont00001760: Event Ontology

Near Ultraviolet Light Frequency
type: Class
subclass of: Ultraviolet Light Frequency
definition: An Ultraviolet Light Frequency that is between 750 terahertz and 3 petahertz.
ont00001754: https://en.wikipedia.org/w/index.php
ont00001760: Event Ontology

Act of Planning
type: Class
subclass of: Planned Act
definition: A Planned Act that involves making a Plan to achieve some specified Objective.
ont00001760: Event Ontology

Act of Tool Use
type: Class
subclass of: Act of Artifact Employment
definition: An Act of Artifact Employment in which some Agent uses some Tool.
ont00001760: Event Ontology

Transverse Wave Profile
type: Class
subclass of: Wave Process Profile
alternative label: Transverse Wave
definition: A Wave Process Profile in which the displacement of participating particles is perpendicular to the direction of the Wave Process' propogation.
ont00001754: http://www.acs.psu.edu/drussell/Demos/waves/wavemotion.html
ont00001760: Event Ontology

Act of Vehicle Use
type: Class
subclass of: Act of Artifact Employment
definition: An Act of Artifact Employment in which some Agent uses some Vehicle.
ont00001760: Event Ontology

Act of Communication by Media
type: Class
subclass of: Act of Communication
definition: An Act of Communication in which some Material Artifact is used to transfer an Information Bearing Entity from sender(s) to receiver(s).
ont00001760: Event Ontology

Extremely High Frequency
type: Class
subclass of: Microwave Frequency
alternative label: ITU Band Number 11
alternative label: Millimeter Band Frequency
definition: A Microwave Frequency that is between 30 and 300 GHz.
scope note: The corresponding Wavelength range is 10–1 mm
ont00001753: EHF
ont00001754: International Telecommunication Union (ITU)
ont00001760: Event Ontology

Act of Departure
type: Class
subclass of: Act of Location Change
definition: An Act of Location Change that consists of the participating entity leaving its starting location such that the larger Act of Location Change is initiated.
ont00001760: Event Ontology

Act of Assassination
type: Class
subclass of: Act of Murder
definition: An Act of Murder of a prominent person.
ont00001754: JC3IEDM-MIRD-DMWG-Edition_3.0.2_20090514
ont00001760: Event Ontology

Loudness
type: Class
subclass of: Sound Process Profile
definition: A Sound Process Profile that is characterized by the amplitude and total energy of translated sound waves, typically on a continuum from soft to loud.
ont00001754: https://byjus.com/physics/loudness-of-sound/
ont00001760: Event Ontology

Sonic Frequency
type: Class
subclass of: Sound Frequency
alternative label: Audible Frequency
definition: A Sound Frequency that is between 20 Hz and 20 kHz.
scope note: Sound waves with frequencies in this range are typically audible to humans.
ont00001760: Event Ontology

Decrease of Quality
type: Class
subclass of: Decrease of Specifically Dependent Continuant
definition: A Decrease of Specifically Dependent Continuant in which some Independent Continuant has a decrease of some Quality that it bears.
example: Weight Loss, Decreasing Temperature, decreasing color intensity, loss of structural integrity
ont00001760: Event Ontology

Loss of Generically Dependent Continuant
type: Class
subclass of: Loss of Dependent Continuant
definition: A Loss of Dependent Continuant in which some Independent Continuant ceases to be the carrier of some Generically Dependent Continuant.
ont00001760: Event Ontology

Decrease of Disposition
type: Class
subclass of: Decrease of Realizable Entity
definition: A Decrease of Realizable Entity in which some Independent Continuant has a decrease of some Disposition it bears.
ont00001760: Event Ontology

Target
type: Class
equivalent class: Class
  intersection of: BFO_0000040
  intersection of: Restriction
    on property: ont00001936
    some values from: Act of Targeting
subclass of: BFO_0000040
definition: A Material Entity that is the object of an Act of Targeting.
scope note: Although people speak of targeting a process, say, a parade, what in fact are being targeted are the material participants of that process. The disruption or ceasing of the process is the objective of some plan, but not technically a target. Only material things can be targeted for action. Even if some dependent entity is described as being the target, the material thing for which that dependent entity depends is the object of a targeting process.
ont00001760: Event Ontology

Unplanned Act
type: Class
subclass of: Act
alternative label: Unintentional Act
definition: An Act in which at least one Agent plays a causative role and which is not prescribed by some Objective held by any of the Agents.
ont00001760: Event Ontology

Gain of Dependent Continuant
type: Class
subclass of: Change
definition: A Change in which an Independent Continuant becomes the bearer or carrier of some Dependent Continuant.
ont00001760: Event Ontology

Enhanced Stasis
type: Class
subclass of: Stasis of Specifically Dependent Continuant
alternative label: Enhanced
definition: A Stasis of Specifically Dependent Continuant in which some Independent Continuant bears a Quality or Realizable Entity that has undergone improvement (i.e., an increase or gain) due to a previous action or event such that the Independent Continuant is now of greater value, usefulness, or functionality.
ont00001754: http://www.thefreedictionary.com/enhance
ont00001760: Event Ontology

Stasis of Non-Mission Capable
type: Class
subclass of: Stasis of Mission Capability
definition: A Stasis of Mission Capability during which the participating Continuant is not capable of performing any of its primary functions for the specified Mission.
ont00001760: Event Ontology

Visible Light Reflection Process
type: Class
subclass of: Wave Process
definition: A Wave Process in which an Electromagnetic Wave with a Visible Light Frequency is reflected off a portion of matter.
ont00001760: Event Ontology

Act of Artifact Employment
type: Class
subclass of: Planned Act
definition: A Planned Act of using a Material Artifact.
ont00001760: Event Ontology

Force
type: Class
subclass of: Process Profile
definition: A Process Profile that is the rate of change of an object's Momentum, is the product of an object's Mass and Acceleration with respect to an inertial frame of reference, and is measured in units of Newtons (N).
ont00001760: Event Ontology

Sound Production
type: Class
subclass of: Wave Production
alternative label: Sound Production Process
definition: A Wave Production Process that produces a Sound Wave.
ont00001760: Event Ontology

Act of Religious Training Acquisition
type: Class
subclass of: Act of Training Acquisition
definition: An Act of Training Acquisition performed by an Agent by acquiring knowledge of the tenets and/or practices of a religion from an Agent or communication medium that realizes a capacity derived from its affiliation with a Religious Organization.
ont00001760: Event Ontology

Sine Waveform
type: Class
subclass of: Waveform
alternative label: Sinusoidal Waveform
definition: A Waveform that is characterized by a smooth curved shape due to the continuous non-linear transitions between minimum and maximum Amplitudes of the Wave Cycle.
ont00001760: Event Ontology

Act of Position Change
type: Class
subclass of: Act of Motion
definition: An Act of Motion in which the position (i.e. the orientation, alignment, or arrangement) of some Object or of one or more of an Object's parts is changed by some Agent.
example: a top spinning in place
example: adjusting your posture
example: raising your left arm
example: swivelling your office chair to face the window
scope note: An Act of Position Change does not entail a change of location.
ont00001760: Event Ontology

Sawtooth Waveform
type: Class
subclass of: Waveform
definition: A Waveform that is characterized by a sawtooth shape due to the continuous linear transition from minimum to maximum Amplitudes followed by a near-instantaneous transition from the maximum to minimum Amplitudes of the Wave Cycle.
ont00001760: Event Ontology

Act of Mass Media Communication
type: Class
subclass of: Act of Communication
definition: An Act of Communication intended to reach a large audience using a medium such as the internet, television, radio, newspaper, and magazine.
ont00001754: https://en.wikipedia.org/w/index.php
ont00001760: Event Ontology

Ignition Process
type: Class
subclass of: Natural Process
alternative label: Ignition
definition: A Natural Process that initiates a Combustion process.
ont00001760: Event Ontology

Act of Cargo Transportation
type: Class
subclass of: Act of Location Change
definition: An Act of Location Change wherein some Payload is moved from one location to another.
ont00001760: Event Ontology

Gain of Disposition
type: Class
subclass of: Gain of Realizable Entity
subclass of: Restriction
  on property: BFO_0000057
  some values from: Class
    intersection of: BFO_0000004
    intersection of: Restriction
      on property: BFO_0000196
      some values from: BFO_0000016
definition: A Gain of Realizable Entity in which some Independent Continuant becomes the bearer of some Disposition.
scope note: This class should be used to demarcate the start of the temporal interval (through the BFO 'occupies temporal region' property) that the Entity bears the Disposition.
ont00001760: Event Ontology

Ultraviolet Light Frequency
type: Class
subclass of: Electromagnetic Radiation Frequency
definition: An Electromagnetic Radiation Frequency of some Electromagnetic Wave that is between 750 terahertz and 30 petahertz.
ont00001754: https://en.wikipedia.org/w/index.php
ont00001760: Event Ontology

Increase of Realizable Entity
type: Class
subclass of: Increase of Specifically Dependent Continuant
definition: An Increase of Specifically Dependent Continuant in which some Independent Continuant has an increase of some Realizable Entity that it bears.
ont00001760: Event Ontology

Act of Weapon Use
type: Class
subclass of: Act of Artifact Employment
definition: An Act of Artifact Employment in which some Agent uses some Weapon.
ont00001760: Event Ontology

Loss of Role
type: Class
subclass of: Loss of Realizable Entity
definition: A Loss of Realizable Entity in which some Independent Continuant ceases to be the bearer of some Role.
ont00001760: Event Ontology

Act of Encounter
type: Class
subclass of: Act of Association
definition: An Act of Association wherein two or more Persons meet in a casual or unplanned manner.
ont00001754: http://wordnetweb.princeton.edu/perl/webwn?s=encounter (Sense Key: Encounter%2:38:00)
ont00001760: Event Ontology

Inverse Sawtooth Waveform
type: Class
subclass of: Waveform
definition: A Waveform that is characterized by a sawtooth shape due to the continuous linear transition from maximum to minimum Amplitudes followed by a near-instantaneous transition from the minimum to maximum Amplitudes of the Wave Cycle.
ont00001760: Event Ontology

Stasis of Fully Mission Capable
type: Class
subclass of: Stasis of Mission Capability
definition: A Stasis of Mission Capability during which the participating Continuant is capable of performing all of its primary functions for the specified Mission.
ont00001760: Event Ontology

Act of Appraisal
type: Class
subclass of: Act of Measuring
definition: An Act of Measuring that involves evaluating, assessing, estimating, or judging the nature, value, importance, condition, or quality of something or someone.
example: a food critic rating the quality of a restaurant's ambiance, service, and food
example: a mechanic assessing whether a damaged vehicle is repairable
example: an insurance agent appraising the financial value of a building
scope note: In the context of an Act of Appraisal, the terms 'value', 'condition', and 'quality' do not have the same meanings as their counterparts that are defined in the Common Core Ontologies. For example, a knife may be appraised to be of high quality if it is sharp and sturdy or to be of inferior quality if it is dull or fragile.
scope note: Note that, while most if not all Acts of Appraisal involve some estimating and many Acts of Estimation involve some appraising (i.e. these classes are not disjoint), neither class subsumes the other. For example, some Acts of Appraisal (e.g. a tax assessor appraising the value of a building) impart a normative element to the measured value while others (e.g. a gustatory appraisal that fresh green beans taste better than canned green beans) involve complete information. Furthermore, many Acts of Estimation (e.g. estimating the height of a tree) are concerned solely with determining a numerical value (as opposed to the nature, value, importance, condition, or quality).
ont00001760: Event Ontology

Gain of Realizable Entity
type: Class
subclass of: Gain of Specifically Dependent Continuant
subclass of: Restriction
  on property: BFO_0000057
  some values from: Class
    intersection of: BFO_0000004
    intersection of: Restriction
      on property: BFO_0000196
      some values from: BFO_0000017
definition: A Gain of Specifically Dependent Continuant in which some Independent Continuant becomes the bearer of some Realizable Entity.
example: An informant becomes unreliable (disposition), A person begins to speak French (function), a person becomes a welder (role).
ont00001760: Event Ontology

Low Frequency
type: Class
subclass of: Radio Frequency
alternative label: ITU Band Number 5
definition: A Radio Frequency that is between 30 and 300 kHz.
scope note: The corresponding Wavelength range is 10–1 km
ont00001753: LF
ont00001754: International Telecommunication Union (ITU)
ont00001760: Event Ontology

Oscillation Process
type: Class
subclass of: Change
alternative label: Oscillation
definition: A Change in which the dependent entity alternates between two or more stases.
scope note: Oscillation is often thought of in the sense of motion, e.g., a swinging clock pendulum. However, the repetitive variation in location around a central point is technically a process of vibration, sometimes referred to as mechanical oscillation. Use the term Vibration Motion for those cases.
ont00001754: https://en.wikipedia.org/w/index.php
ont00001760: Event Ontology

Act of Terrorism
type: Class
subclass of: Act of Violence
definition: An Act of Violence which creates fear and which is prescribed by religious, political or ideological objectives, and which deliberately target or disregard the safety of civilians and are committed by members of non-government organizations.
ont00001754: https://en.wikipedia.org/w/index.php
ont00001760: Event Ontology

Effect
type: Class
equivalent class: Class
  intersection of: BFO_0000015
  intersection of: Restriction
    on property: ont00001819
    some values from: BFO_0000015
subclass of: BFO_0000015
alternative label: Consequence
definition: A Process that follows and is caused by some previous Process.
ont00001754: http://wordnetweb.princeton.edu/perl/webwn
ont00001760: Event Ontology

Super Low Frequency
type: Class
subclass of: Radio Frequency
alternative label: ITU Band Number 2
definition: A Radio Frequency that is between 30 and 300 Hz.
scope note: The corresponding Wavelength range is 10,000–1,000 km
ont00001753: SLF
ont00001754: International Telecommunication Union (ITU)
ont00001760: Event Ontology

Sound Wave Process
type: Class
subclass of: Mechanical Wave Process
subclass of: Restriction
  on property: ont00001777
  some values from: Longitudinal Wave Profile
definition: A Mechanical Wave Process of Pressure and displacement that is parallel to the propogation direction of the Wave Process through a medium.
ont00001754: https://en.wikipedia.org/w/index.php
ont00001760: Event Ontology

Act of Inhabitancy
type: Class
subclass of: Planned Act
definition: A Planned Act in which a Person lives at a Site for a period of time that may be as short as 1 day/night or as long as the Person's entire life.
ont00001754: http://www.merriam-webster.com/dictionary/inhabit
ont00001760: Event Ontology

Act of Contract Formation
type: Class
subclass of: Act of Promising
definition: An Act of Promising having a lawful object entered into voluntarily by two or more agents with legal capacity, each of whom intends to create one or more legal obligations between them.
ont00001754: https://en.wikipedia.org/w/index.php
ont00001760: Event Ontology

Act of Training Acquisition
type: Class
subclass of: Act of Training
definition: An Act of Training performed by an Agent by acquiring knowledge from another Agent.
ont00001760: Event Ontology

Acceleration
type: Class
subclass of: Process Profile
subclass of: Restriction
  on property: BFO_0000117
  some values from: Velocity
subclass of: Restriction
  on property: BFO_0000132
  some values from: Motion
definition: A Process Profile that is the rate of change of the Velocity of an object.
ont00001754: https://en.wikipedia.org/w/index.php
ont00001760: Event Ontology

Wedding
type: Class
subclass of: Act of Ceremony
alternative label: Act of Wedding Ceremony
definition: An Act of Ceremony in which two Persons are united in Marriage or a similar institution.
ont00001754: https://en.wikipedia.org/w/index.php
ont00001760: Event Ontology

Decrease of Dependent Continuant
type: Class
subclass of: Change
definition: A Change in which some Independent Continuant has a decrease in the level of some Dependent Continuant that it bears.
ont00001760: Event Ontology

Microwave Frequency
type: Class
subclass of: Radio Frequency
definition: A Radio Frequency that is between 300 MHz and 300 GHz.
scope note: The corresponding Wavelength range is 1,000–1 mm
ont00001754: https://en.wikipedia.org/w/index.php
ont00001760: Event Ontology

Act of Sojourn
type: Class
subclass of: Act of Inhabitancy
definition: An Act of Inhabitancy in which a Person lives in a dwelling temporarily, often during stages of an Act of Travel.
ont00001760: Event Ontology

Act of Targeting
type: Class
subclass of: Planned Act
definition: A Planned Act wherein some Agent maintains one or more entities as the objects of potential action given some operational requirement.
ont00001760: Event Ontology

Act of Social Group Membership
type: Class
subclass of: Act of Association
definition: An Act of Association wherein a Person belongs to some Social Group.
ont00001760: Event Ontology

Text Messaging
type: Class
subclass of: Act of Communication by Media
alternative label: Act of Text Messaging
alternative label: Act of Texting
definition: An Act of Communication by Media involving the exchange of brief written messages between fixed-line phone or mobile phone and fixed or portable devices over a network.
ont00001754: https://en.wikipedia.org/w/index.php
ont00001760: Event Ontology

Wave Process Profile
type: Class
equivalent class: Class
  intersection of: Process Profile
  intersection of: Restriction
    on property: BFO_0000132
    some values from: Wave Process
subclass of: Process Profile
definition: A Process Profile of a Wave Process.
scope note: This is a defined class used to group process profiles of Wave Processes. Note that not every relevant process profile can be asserted as a subtype, however, because they (e.g. Frequency and Amplitude) are applicable to other processes as well (e.g. Oscillation Process).
ont00001760: Event Ontology

Ultra Low Frequency
type: Class
subclass of: Radio Frequency
alternative label: ITU Band Number 3
definition: A Radio Frequency that is between 300 Hz and 3 kHz.
scope note: The corresponding Wavelength range is 1,000–100 km
ont00001753: ULF
ont00001754: International Telecommunication Union (ITU)
ont00001760: Event Ontology

Electromagnetic Radiation Frequency
type: Class
subclass of: Frequency
subclass of: Restriction
  on property: BFO_0000132
  some values from: Electromagnetic Wave Process
definition: A Frequency that is characterized by the rate of Oscillations per second of an Electromagnetic Wave.
scope note: Divisions between EM radiation frequencies are fiat and sources vary on where to draw boundaries.
ont00001754: https://en.wikipedia.org/w/index.php
ont00001760: Event Ontology

Surface Wave Profile
type: Class
subclass of: Wave Process Profile
alternative label: Surface Wave
definition: A Wave Process Profile in which the Wave Process propogates along the surface of a medium and which involves both transverse and longitudinal wave profiles such that the motion of the displacement of participating particles is circular or elliptical.
example: the motion of an ocean wave
ont00001760: Event Ontology

Velocity
type: Class
subclass of: Process Profile
subclass of: Restriction
  on property: BFO_0000132
  some values from: Motion
definition: A Process Profile of an object's Motion that is characterized by its Speed and direction with respect to a frame of reference.
ont00001754: https://en.wikipedia.org/w/index.php
ont00001760: Event Ontology

Wave Production
type: Class
subclass of: Natural Process
alternative label: Wave Production Process
definition: A Natural Process in which a Wave Process is generated.
ont00001760: Event Ontology

Act of Requesting
type: Class
subclass of: Act of Directive Communication
definition: An Act of Directive Communication performed by asking for something.
ont00001754: http://www.merriam-webster.com/dictionary/request
ont00001760: Event Ontology

Impulsive Force
type: Class
subclass of: Process Profile
alternative label: Imp
alternative label: Impulse
alternative label: J
definition: A Process Profile that is the integral of a Force that is applied to a portion of matter over a period of time.
scope note: An Impulse changes the Momentum (and potentially also the direction of Motion) of the object it is applied to and is typically measured in Newton meters.
ont00001760: Event Ontology

Curvilinear Motion
type: Class
subclass of: Translational Motion
alternative label: Curved Motion
definition: A Translational Motion process in which an Object moves along a curved path.
ont00001760: Event Ontology

Stasis of Non-Mission Capable Maintenance
type: Class
subclass of: Stasis of Non-Mission Capable
subclass of: Restriction
  on property: ont00001819
  some values from: Act of Maintenance
definition: A Stasis of Non-Mission Capable during which the participating Continuant is not capable of performing its primary functions for the specified Mission due to participating in an Act Of Maintenance.
ont00001760: Event Ontology

Increase of Role
type: Class
subclass of: Increase of Realizable Entity
definition: An Increase of Realizable Entity in which some Independent Continuant has an increase of some Role that it bears.
ont00001760: Event Ontology

Translational Motion
type: Class
subclass of: Motion
subclass of: Restriction
  on property: ont00001777
  some values from: Velocity
definition: A Motion Process in which the participating Object changes its position from one portion of space to another.
ont00001760: Event Ontology

Electromagnetic Pulse
type: Class
subclass of: Electromagnetic Wave Process
alternative label: EMP
alternative label: Transient Electromagnetic Disturbance
definition: An Electromagnetic Wave Process that consists of a short high-energy burst of electromagnetic energy.
ont00001754: https://en.wikipedia.org/w/index.php
ont00001760: Event Ontology

Stasis
type: Class
subclass of: BFO_0000015
definition: A Process in which one or more Independent Continuants endure in an unchanging condition.
ont00001760: Event Ontology

Stasis of Function
type: Class
subclass of: Stasis of Realizable Entity
definition: A Stasis of Realizable Entity in which some Independent Continuant bears some Function that remains unchanged during a Temporal Interval.
ont00001760: Event Ontology

Act of Promising
type: Class
subclass of: Act of Commissive Communication
definition: An Act of Commissive Communication performed by declaring that the promising agent will do, or refrain from doing, the specified action.
ont00001754: http://www.merriam-webster.com/dictionary/promise
ont00001760: Event Ontology

Very Low Frequency
type: Class
subclass of: Radio Frequency
alternative label: ITU Band Number 4
definition: A Radio Frequency that is between 3 and 30 kHz.
scope note: The corresponding Wavelength range is 100–10 km
ont00001753: VLF
ont00001754: International Telecommunication Union (ITU)
ont00001760: Event Ontology

Stasis of Role
type: Class
subclass of: Stasis of Realizable Entity
definition: A Stasis of Realizable Entity in which some Independent Continuant bears some Role that remains unchanged during a Temporal Interval.
ont00001760: Event Ontology

Speed
type: Class
subclass of: Process Profile
subclass of: Restriction
  on property: BFO_0000132
  some values from: Motion
definition: A Process Profile that is characterized by the magnitude of an object's motion with respect to a frame of reference during some time period.
scope note: An object's speed is the scalar absolute value of it's Velocity.
ont00001754: https://en.wikipedia.org/w/index.php
ont00001760: Event Ontology

Mid Infrared Light Frequency
type: Class
subclass of: Infrared Light Frequency
definition: An Infrared Light Frequency that is between 20 and 214 terahertz.
ont00001754: https://en.wikipedia.org/w/index.php
ont00001760: Event Ontology

Act of Financial Instrument Use
type: Class
subclass of: Act of Artifact Employment
definition: An Act of Artifact Employment in which some Agent uses some Financial Instrument.
ont00001760: Event Ontology

Act of Donating
type: Class
subclass of: Act of Financial Instrument Use
definition: An Act of Financial Instrument Use wherein a Financial Instrument is tranfered by an Agent (the Donor) to another Agent (the Recipient) without return consideration.
ont00001754: https://en.wikipedia.org/w/index.php
ont00001760: Event Ontology

Sub-Bass Frequency
type: Class
subclass of: Sonic Frequency
definition: A Sonic Frequency that is between 20 and 60 Hz.
ont00001760: Event Ontology

Active Stasis
type: Class
subclass of: Stasis of Artifact Operationality
disjoint with: Deactivated Stasis
definition: A Stasis of Artifact Operationality that holds during a Temporal Interval when a Material Artifact is realizing one or more of its designed Artifact Functions (especially one of its primary functions).
ont00001760: Event Ontology

Stasis of Quality
type: Class
subclass of: Stasis of Specifically Dependent Continuant
definition: A Stasis of Specifically Dependent Continuant in which some Independent Continuant bears some Quality that remains unchanged during a Temporal Interval.
ont00001760: Event Ontology

Decrease of Realizable Entity
type: Class
subclass of: Decrease of Specifically Dependent Continuant
definition: A Decrease of Specifically Dependent Continuant in which some Independent Continuant has a decrease of some Realizable Entity that it bears.
ont00001760: Event Ontology

Effect of Location Change
type: Class
subclass of: Effect
subclass of: Restriction
  on property: BFO_0000132
  some values from: Act of Location Change
subclass of: Restriction
  on property: ont00001819
  some values from: Act of Location Change
definition: An Effect caused by some Act of Location Change and which results in an Object being located in a different place.
ont00001760: Event Ontology

Television Broadcast
type: Class
subclass of: Act of Communication by Media
alternative label: Act of Television Broadcasting
definition: An Act of Communciation by Media that is transmitted to an audience through a television network.
ont00001754: https://en.wikipedia.org/w/index.php
ont00001760: Event Ontology

Sound Process Profile
type: Class
equivalent class: Class
  intersection of: Process Profile
  intersection of: Restriction
    on property: BFO_0000132
    some values from: Sound Wave Process
subclass of: Process Profile
alternative label: Sound Quality
definition: A Process Profile that is part of a sound reception process and is characterized by properties of incoming sound waves as they are translated by some sensory system.
ont00001754: http://www.animations.physics.unsw.edu.au/waves-sound/quantifying/index.html
ont00001754: https://en.wikipedia.org/w/index.php
ont00001760: Event Ontology

Act of Confessing
type: Class
subclass of: Act of Representative Communication
definition: An Act of Representative Communication in which a person makes an admission of misdeeds or faults.
ont00001760: Event Ontology

Loss of Specifically Dependent Continuant
type: Class
subclass of: Loss of Dependent Continuant
definition: A Loss of Dependent Continuant in which some Independent Continuant ceases to be the bearer of some Specifically Dependent Continuant.
ont00001760: Event Ontology

Radio Broadcast
type: Class
subclass of: Act of Communication by Media
alternative label: Act of Radio Broadcasting
definition: An Act of Communciation by Media that is transmitted to an audience through a radio network.
ont00001754: https://en.wikipedia.org/w/index.php
ont00001760: Event Ontology

Act of Personal Communication
type: Class
subclass of: Act of Communication
definition: An Act of Communication having a small audience.
ont00001760: Event Ontology

Loss of Dependent Continuant
type: Class
subclass of: Change
definition: A Change in which some Independent Continuant ceases to be the bearer or carrier of some Dependent Continuant.
ont00001760: Event Ontology

Act of Religious Group Affiliation
type: Class
subclass of: Act of Association
definition: An Act of Association wherein some Person belongs to some Religious Demonination or sub-Denomination.
ont00001760: Event Ontology

Act of Inviting
type: Class
subclass of: Act of Commissive Communication
definition: An Act of Commissive Communication performed by requesting the presence or participation of the audience, and which may include offering an incentive or inducement.
ont00001754: http://www.merriam-webster.com/dictionary/invite
ont00001760: Event Ontology

Act of Loaning
type: Class
subclass of: Act of Financial Instrument Use
definition: An Act of Financial Instrument Use wherein a Financial Instrument is given by an Agent (the Creditor) to another Agent (the Debtor) in order to receive Repayments from the Debtor which are of greater Financial Value.
ont00001754: https://en.wikipedia.org/w/index.php
ont00001760: Event Ontology

Visible Observation
type: Class
subclass of: Act of Observation
subclass of: Restriction
  on property: ont00001777
  some values from: Visible Light Reflection Process
definition: An Act of Observation that involves visual perception.
ont00001760: Event Ontology

Act of Travel
type: Class
subclass of: Act of Location Change
definition: An Act of Location Change wherein one or more Persons move between relatively distant geographical locations for any purpose and any duration, with or without any means of transport.
ont00001754: https://en.wikipedia.org/w/index.php
ont00001760: Event Ontology

Married
type: Class
subclass of: Stasis of Generically Dependent Continuant
alternative label: Married Stasis
definition: A Stasis of Generically Dependent Continuant that consists of a socially, culturally, or ritually recognized union or legal contract between spouses that establishes rights and obligations between them, between them and their children, and between them and their in-laws.
ont00001754: Haviland, William A.; Prins, Harald E. L.; McBride, Bunny; Walrath, Dana (2011). Cultural Anthropology: The Human Challenge (13th ed.). Cengage Learning. ISBN 978-0-495-81178-7
ont00001754: https://en.wikipedia.org/w/index.php
ont00001760: Event Ontology

Act of Facility Use
type: Class
subclass of: Act of Artifact Employment
definition: An Act of Artifact Employment in which an Agent makes use of some Facility.
ont00001760: Event Ontology

Act of Material Artifact Processing
type: Class
subclass of: Planned Act
definition: A Planned Act of performing a series of physical operations on a material artifact in order to change or preserve the artifact.
ont00001760: Event Ontology

Amplitude
type: Class
subclass of: Process Profile
subclass of: Restriction
  on property: BFO_0000132
  some values from: Oscillation Process
definition: A Process Profile of an Oscillation Process that is the absolute value of the maximum displacement from a zero, equilibrium, or mean value during one cycle of the Oscillation Process.
ont00001760: Event Ontology

Death
type: Class
subclass of: Natural Process
definition: A Natural Process in which all biological functions that sustain a living organism cease.
ont00001754: https://en.wikipedia.org/w/index.php
ont00001760: Event Ontology

Act of Arrival
type: Class
subclass of: Act of Location Change
definition: An Act of Location Change that consists of the participating entity reaching its destination such that the larger Act of Location Change is completed.
ont00001760: Event Ontology

Beginning of Life Stasis
type: Class
subclass of: Operational Stasis
definition: A Operational Stasis that holds during a Temporal Interval when a Material Artifact is first put into operational use such that its designed set of Artifact Functions is capable of operating at or near their designed peak performance levels.
scope note: A Beginning of Life Stasis (BoL) is a relatively brief Operational Stasis that is primarily of interest for the purpose of establishing a baseline for operational parameters to be compared to the designed specifications as well as the Material Artifact's performance throughout its operational life.
ont00001753: BOL
ont00001753: BoL
ont00001760: Event Ontology

Act of Military Training Acquisition
type: Class
subclass of: Act of Training Acquisition
definition: An Act of Training Acquisition performed by an Agent by acquiring knowledge of the tactics, techniques, and/or strategies of Military Operations from an Agent or communication medium that realizes a capacity derived from its affiliation with a Military Organization.
ont00001760: Event Ontology

Act of Apologizing
type: Class
subclass of: Act of Expressive Communication
definition: An Act of Expressive Communication performed by acknowledging and expressing regret for a fault, shortcoming, or failure.
ont00001754: http://wordnetweb.princeton.edu/perl/webwn
ont00001760: Event Ontology

Bass Frequency
type: Class
subclass of: Sonic Frequency
definition: A Sonic Frequency that is between 60 and 250 Hz.
ont00001760: Event Ontology

Act of Legal Instrument Use
type: Class
subclass of: Act of Artifact Employment
definition: An Act of Artifact Employment in which some Agent uses some Legal Instrument.
ont00001760: Event Ontology

Deactivated Stasis
type: Class
subclass of: Stasis of Artifact Operationality
definition: A Stasis of Artifact Operationality that holds during a Temporal Interval when a Material Artifact is not realizing any of its designed Artifact Functions (or at least not realizing any of its primary functions).
ont00001760: Event Ontology

Act of Religious Worship
type: Class
subclass of: Act of Ceremony
definition: An Act of Ceremony wherein there occurs acts of religious devotion usually directed towards a deity.
ont00001754: http://en.wikipedia.org/wiki/Worship (Sense Key: Worship%2:42:00 or Worship%1:04:00::)
ont00001760: Event Ontology

Act of Consumption
type: Class
subclass of: Planned Act
definition: A Planned Act in which a resource is ingested or used up.
ont00001760: Event Ontology

Act of Maintenance
type: Class
subclass of: Act of Artifact Modification
definition: An Act of Artifact Modification in which a Material Artifact is modified in order to preserve or restore one or more of its designed Qualities or Functions.
ont00001760: Event Ontology

Electromagnetic Wave Process
type: Class
subclass of: Wave Process
subclass of: Restriction
  on property: ont00001777
  some values from: Transverse Wave Profile
alternative label: Electromagnetic Radiation
definition: A Wave Process that is produced by charged particles, involves the periodic Oscillation of electric and magnetic fields at right angles to each other and the direction of wave propogation such that it has a Transverse Wave Profile, and which transfers electromagnetic radiant energy through a portion of space or matter.
ont00001760: Event Ontology

Pitch
type: Class
subclass of: Sound Process Profile
definition: A Sound Process Profile that is characterized by the frequency of translated sound waves, typically on a continuum from low to high.
ont00001760: Event Ontology

Angular Momentum
type: Class
subclass of: Momentum
definition: A Momentum that is the product of an object's moment of inertia and its Angular Velocity.
ont00001754: https://en.wikipedia.org/w/index.php
ont00001760: Event Ontology

Fixed Line Network Telephone Call
type: Class
subclass of: Telephone Call
definition: A Telephone Call transmitted over a telephone network where the telephones are wired into a single telephone exchange.
ont00001754: https://en.wikipedia.org/w/index.php
ont00001760: Event Ontology

Medium Frequency
type: Class
subclass of: Radio Frequency
alternative label: ITU Band Number 6
definition: A Radio Frequency that is between 300 kHz and 3 MHz.
scope note: The corresponding Wavelength range is 1,000–100 m
ont00001753: MF
ont00001754: International Telecommunication Union (ITU)
ont00001760: Event Ontology

Act of Artifact Modification
type: Class
subclass of: Act of Material Artifact Processing
definition: An Act of Material Artifact Processing in which an existing Material Artifact is acted upon in a manner that changes, adds, or removes one or more of its Qualities, Dispositions, or Functions.
scope note: Excluded from this class are instances of role change or role creation such as the introduction of an artifact as a piece of evidence in a trial or the loading of artifacts onto a ship for transport.
ont00001760: Event Ontology

Act of Deceptive Communication
type: Class
subclass of: Act of Communication
definition: Ac Act of Communication intended to mislead the audience by distortion or falsification of evidence and induce a reaction that is prejudicial to the interests of the audience.
ont00001754: JC3IEDM-MIRD-DMWG-Edition_3.0.2_20090514
ont00001760: Event Ontology

Act of Publishing Mass Media Documentary
type: Class
subclass of: Act of Mass Media Communication
definition: An Act of Mass Media Communication involving the preparation and public issuance of information that provides a factual record or report.
ont00001754: JC3IEDM-MIRD-DMWG-Edition_3.0.2_20090514
ont00001760: Event Ontology

Cause
type: Class
equivalent class: Class
  intersection of: BFO_0000015
  intersection of: Restriction
    on property: ont00001803
    some values from: BFO_0000015
subclass of: BFO_0000015
definition: A Process that is the cause of or one of the causes of some other Process.
ont00001760: Event Ontology

Act of Portion of Material Consumption
type: Class
subclass of: Act of Artifact Employment
definition: An Act of Artifact Employment in which a Portion of Material is expended.
ont00001760: Event Ontology

Decrease of Function
type: Class
subclass of: Decrease of Disposition
definition: A Decrease of Disposition in which some Independent Continuant has a decrease of some Function that it bears.
ont00001760: Event Ontology

Shear Wave Process
type: Class
equivalent class: Class
  intersection of: Mechanical Wave Process
  intersection of: Restriction
    on property: ont00001777
    some values from: Transverse Wave Profile
subclass of: Mechanical Wave Process
definition: A Mechanical Wave that has a Transverse Wave Profile.
ont00001760: Event Ontology

Super High Frequency
type: Class
subclass of: Microwave Frequency
alternative label: ITU Band Number 10
definition: A Microwave Frequency that is between 3 and 30 GHz.
scope note: The corresponding Wavelength range is 100–10 mm
ont00001753: SHF
ont00001754: International Telecommunication Union (ITU)
ont00001760: Event Ontology

Defunct Stasis
type: Class
subclass of: Stasis of Artifact Operationality
disjoint with: Operational Stasis
definition: A Stasis of Artifact Operationality that holds during a Temporal Interval when a Material Artifact no longer maintains its designed set of Artifact Functions (or at least no longer maintains its primary functions).
ont00001760: Event Ontology

Act of Denying
type: Class
subclass of: Act of Representative Communication
definition: An Act of Representative Communication performed by either asserting that something is not true or real or refusing to satisfy a request or desire.
ont00001754: http://www.merriam-webster.com/dictionary/denial
ont00001760: Event Ontology

Mechanical Wave Process
type: Class
subclass of: Wave Process
definition: A Wave Process that involves Oscillation of a portion of matter such that energy is transferred through the material medium.
ont00001754: https://en.wikipedia.org/w/index.php
ont00001760: Event Ontology

Act of Volunteering
type: Class
subclass of: Act of Commissive Communication
definition: An Act of Commissive Communication performed by voluntarily undertaking or expressing a willingness to undertake a service.
example: entering into military service voluntarily
example: rendering a service voluntarily
ont00001754: http://www.merriam-webster.com/dictionary/volunteer
ont00001760: Event Ontology

Act of Assignment
type: Class
subclass of: Act of Declarative Communication
definition: An Act of Declarative Communication in which rights held by one party (the assignor) are transferred to another party (the assignee) with regard to a particular entity as specified by the details of the assignment, which is often prescribed by a contract.
ont00001754: https://en.wikipedia.org/w/index.php
ont00001760: Event Ontology

Act of Repayment
type: Class
subclass of: Act of Financial Instrument Use
definition: An Act of Financial Instrument Use wherein a Financial Instrument is transferred by an Agent (the Debtor) to another Agent (the Creditor) to decrease the amount the Debtor owes to the Creditor from an earlier Act of Loaning.
ont00001754: https://en.wikipedia.org/w/index.php
ont00001760: Event Ontology

Frequency
type: Class
subclass of: Process Profile
alternative label: Temporal Frequency
definition: A Process Profile that is characterized by the number of repetitive processes during a particular time period.
ont00001754: https://en.wikipedia.org/w/index.php
ont00001760: Event Ontology

Increase of Dependent Continuant
type: Class
subclass of: Change
definition: A Change in which some Independent Continuant has an increase in the level of some Dependent Continuant that it bears.
ont00001760: Event Ontology

Act of Collision
type: Class
subclass of: Act of Location Change
definition: An Act of Location Change involving the movement of one object such that it collides with another object.
ont00001760: Event Ontology

Visible Light Frequency
type: Class
subclass of: Electromagnetic Radiation Frequency
definition: An Electromagnetic Radiation Frequency of some Electromagnetic Wave that is between 400 and 800 terahertz.
scope note: Visible light overlaps with near infrared and near ultraviolet.
ont00001754: https://en.wikipedia.org/w/index.php
ont00001760: Event Ontology

Act of Issuing Mass Media Press Release
type: Class
subclass of: Act of Mass Media Communication
definition: An Act of Mass Media Communication involving sending forth, distributing, or putting into circulation an official statement issued to one or more members of the media for the purpose of announcing newsworthy information.
ont00001754: JC3IEDM-MIRD-DMWG-Edition_3.0.2_20090514
ont00001760: Event Ontology

Loss of Disposition
type: Class
subclass of: Loss of Realizable Entity
definition: A Loss of Realizable Entity in which some Independent Continuant ceases to be the bearer of some Disposition.
ont00001760: Event Ontology

Gain of Quality
type: Class
subclass of: Gain of Specifically Dependent Continuant
subclass of: Restriction
  on property: BFO_0000057
  some values from: Class
    intersection of: BFO_0000004
    intersection of: Restriction
      on property: BFO_0000196
      some values from: BFO_0000019
definition: A Gain of Specifically Dependent Continuant in which an Independent Continuant becomes the bearer of some Quality.
example: A person becoming pregnant.
ont00001760: Event Ontology

FM Radio Broadcast Frequency
type: Class
subclass of: Very High Frequency
alternative label: Frequency Modulation Radio Broadcast Frequency
definition: A Very High Frequency that is between 88 and 108 MHz.
ont00001754: International Telecommunication Union (ITU) Region 2
ont00001760: Event Ontology

Act of Educational Training Acquisition
type: Class
subclass of: Act of Training Acquisition
definition: An Act of Training Acquisition performed by an Agent by acquiring knowledge of a curriculum from an Agent or communication medium that realizes a capacity derived from its affiliation with some Educational Organization.
ont00001760: Event Ontology

Act of Training Instruction
type: Class
subclass of: Act of Training
definition: An Act of Training performed by an Agent by imparting knowledge to another Agent.
ont00001760: Event Ontology

Far Infrared Light Frequency
type: Class
subclass of: Infrared Light Frequency
definition: An Infrared Light Frequency that is between 300 gigahertz and 20 terahertz.
ont00001754: https://en.wikipedia.org/w/index.php
ont00001760: Event Ontology

Act of Espionage
type: Class
subclass of: Act of Intelligence Gathering
definition: An Act of Intelligence Gathering involving the obtaining of information that is considered secret or confidential without the permission of the holder of the information.
ont00001754: https://en.wikipedia.org/w/index.php
ont00001760: Event Ontology

Ultra High Frequency
type: Class
subclass of: Microwave Frequency
alternative label: ITU Band Number 9
definition: A Microwave Frequency that is between 300 MHz and 3 GHz.
scope note: The corresponding Wavelength range is 1–0.1 m. Note that the ITU definition of UHF is broader than the definition given by IEEE 521-2002 - IEEE Standard Letter Designations for Radar-Frequency Bands, which sets the frequency range at 300 MHz to 1 GHz.
ont00001753: UHF
ont00001754: International Telecommunication Union (ITU)
ont00001760: Event Ontology

Counter-Clockwise Rotational Motion
type: Class
subclass of: Rotational Motion
alternative label: Anti-Clockwise Rotation
alternative label: CCW Rotational Motion
alternative label: Counter-Clockwise Rotation
definition: A Rotational Motion in which the direction of rotation is toward the left as seen relative to the designated side of the plane of rotation.
example: the axial rotation of the Earth as seen from above the North Pole
ont00001760: Event Ontology

Low Midrange Frequency
type: Class
subclass of: Sonic Frequency
definition: A Sonic Frequency that is between 250 and 500 Hz.
ont00001760: Event Ontology

Proper Acceleration
type: Class
subclass of: Acceleration
definition: An Acceleration of an object relative to a free-fall, or inertial, observer who is momentarily at rest relative to the object being measured (hence, gravity does not cause Proper Acceleration).
ont00001754: https://en.wikipedia.org/w/index.php
ont00001760: Event Ontology

Private Network Telephone Call
type: Class
subclass of: Telephone Call
definition: A Telephone Call transmitted over a network where a closed group of telephones are connected primarily to each other and use a gateway to reach the outside world, usually used inside companies and call centers (a.k.a. private branch exchange (PBX)).
ont00001754: https://en.wikipedia.org/w/index.php
ont00001760: Event Ontology

Act of Religious Training Instruction
type: Class
subclass of: Act of Training Instruction
definition: An Act of Training Instruction performed by an Agent who realizes a capacity derived from the Agent's affiliation with some Religious Organization by imparting knowledge of the tenets and/or practices of a religion to an Agent either directly or indirectly through some communication medium.
ont00001760: Event Ontology

Radio Interference
type: Class
subclass of: Natural Process
definition: A Natural Process in which a radio signal is disrupted, whether unintentionally or as the result of an Act of Radio Jamming, Act of Radio Spoofing, or similar Planned Act.
ont00001760: Event Ontology

Loss of Quality
type: Class
subclass of: Loss of Specifically Dependent Continuant
definition: A Loss of Specifically Dependent Continuant in which some Independent Continuant ceases to be the bearer of some Quality.
ont00001760: Event Ontology

Act of Residing
type: Class
subclass of: Act of Inhabitancy
definition: An Act of Inhabitancy in which a Person lives in a dwelling permanently or for an extended period of time.
ont00001754: http://www.thefreedictionary.com/reside
ont00001760: Event Ontology

Stasis of Mission Capability
type: Class
subclass of: Stasis of Realizable Entity
definition: A Stasis of Realizable Entity that holds during a temporal interval when a Continuant's capability (or lack thereof) to perform its intended Functions, tasks, or Objectives remains at a relatively constant level.
ont00001760: Event Ontology

Motion
type: Class
subclass of: Natural Process
definition: A Natural Process in which a Continuant changes its Location or Spatial Orientation over some Temporal Interval.
ont00001760: Event Ontology

Ultrasonic Frequency
type: Class
subclass of: Sound Frequency
definition: A Sound Frequency that is greater than 20 kHz.
ont00001760: Event Ontology

Facsimile Transmission
type: Class
subclass of: Act of Communication by Media
alternative label: Act of Facsimile Transmission
alternative label: Act of Faxing
definition: An Act of Communication by Media in which the Information Content Entity that inheres in a Document is transmitted over a Telephone Network.
ont00001754: https://en.wikipedia.org/w/index.php
ont00001760: Event Ontology

Act of Entertainment
type: Class
subclass of: Planned Act
definition: A Planned Act consisting of any activity which provides a diversion or permits people to amuse themselves.
ont00001754: https://en.wikipedia.org/w/index.php
ont00001760: Event Ontology

Act of Violence
type: Class
subclass of: Planned Act
definition: A Planned Act of causing harm to oneself or to another through the use of physical or verbal force.
ont00001754: https://en.wikipedia.org/w/index.php
ont00001760: Event Ontology

Act of Data Transformation
type: Class
subclass of: Act of Information Processing
definition: An Act of Information Processing in which an algorithm is executed to act upon one or more input Information Content Entities into one or more output Information Content Entities.
scope note: It is not a requirement that the output Information Content Entity(ies) be qualitatively distinct from the input(s) as a result of an Act of Data Transformation, though doing so is typically the goal of performing this Act. Consider, for example, selecting a column in an Excel spreadsheet then executing the \"Remove Duplicates\" Algorithm on it. The intent is to remove rows in that column containing duplicate content. If no duplicate values are present, the information in the column remains unchanged but an Act of Data Transformation was nonetheless performed.
ont00001760: Event Ontology

Act of Commissive Communication
type: Class
subclass of: Act of Communication
definition: An Act of Communication in which an Agent commits themselves to doing, or refraining from doing, some future action.
scope note: Examples: agreeing, betting, guaranteeing, inviting, offering, promising, swearing, volunteering
ont00001754: Derived (loosely) from: John Searle's Speech Acts: An Essay in the Philosophy of Language
ont00001760: Event Ontology

Midrange Frequency
type: Class
subclass of: Sonic Frequency
definition: A Sonic Frequency that is between 500 Hz and 2 kHz.
ont00001760: Event Ontology

Hard X-ray Frequency
type: Class
subclass of: X-ray Frequency
definition: An X-Ray Frequency that is between 3 and 30 exahertz.
ont00001760: Event Ontology

Wireless Network Telephone Call
type: Class
subclass of: Telephone Call
definition: A Telephone Call transmitted over a network where the telephones are mobile and can move anywhere within the coverage area.
ont00001754: https://en.wikipedia.org/w/index.php
ont00001760: Event Ontology

Spinning Motion
type: Class
subclass of: Rotational Motion
definition: A Rotational Motion of an Object around an Axis of Rotation that passes through the Object's Center of Mass.
ont00001760: Event Ontology

Telephone Call
type: Class
subclass of: Act of Communication by Media
alternative label: Act of Telephone Calling
definition: An Act of Communciation by Media transmitted over a telephone network to two or more Persons.
ont00001754: https://en.wikipedia.org/w/index.php
ont00001760: Event Ontology

Operational Stasis
type: Class
subclass of: Stasis of Artifact Operationality
definition: A Stasis of Artifact Operationality that holds during a Temporal Interval when a Material Artifact maintains its designed set of Artifact Functions (or at least maintains its primary functions).
ont00001760: Event Ontology

Gain of Role
type: Class
subclass of: Gain of Realizable Entity
subclass of: Restriction
  on property: BFO_0000057
  some values from: Class
    intersection of: BFO_0000004
    intersection of: Restriction
      on property: BFO_0000196
      some values from: BFO_0000023
definition: A Gain of Realizable Entity in which some Independent Continuant becomes bearer of some Role.
scope note: This class should be used to demarcate the start of the temporal interval (through the occupies temporal region property) that the Entity bears the Role.
ont00001760: Event Ontology

Act of Artifact Assembly
type: Class
subclass of: Act of Material Artifact Processing
definition: An Act of Material Artifact Processing wherein a new Material Artifact are created by fitting component parts together.
example: putting together a piece of furniture purchased from Ikea
scope note: Many Acts of Manufacturing and Construction involve one or more Acts of Artifact Assembly, but Acts of Artifact Assembly can also occur in isolation from these activities.
ont00001760: Event Ontology

High Frequency
type: Class
subclass of: Radio Frequency
alternative label: ITU Band Number 7
definition: A Radio Frequency that is between 3 and 30 MHz.
scope note: The corresponding Wavelength range is 100–10 m
ont00001753: HF
ont00001754: International Telecommunication Union (ITU) and IEEE 521-2002 - IEEE Standard Letter Designations for Radar-Frequency Bands
ont00001760: Event Ontology

Stasis of Artifact Operationality
type: Class
subclass of: Stasis of Realizable Entity
definition: A Stasis of Realizable Entity that holds during a Temporal Interval when a Material Artifact's designed set of Artifact Functions (or at least its primary functions) or the realizations of those functions remain unchanged.
ont00001760: Event Ontology

Increase of Specifically Dependent Continuant
type: Class
subclass of: Increase of Dependent Continuant
definition: An Increase of Dependent Continuant in which some Independent Continuant has an increase of some Specifically Dependent Continuant that it bears.
ont00001760: Event Ontology

Funeral
type: Class
subclass of: Act of Ceremony
alternative label: Act of Funeral Ceremony
definition: An Act of Ceremony in which the Life of a Person who has died is celebrated, sanctified, or remembered.
ont00001754: https://en.wikipedia.org/w/index.php
ont00001760: Event Ontology

Delta-v
type: Class
subclass of: Process Profile
subclass of: Restriction
  on property: BFO_0000117
  some values from: Velocity
alternative label: Change in Velocity
alternative label: DeltaV
definition: A Process Profile that is the total change in Velocity of an object's Motion.
scope note: Delta-v is not equivalent to and should not be confused with Acceleration, which is the rate of change of Velocity.
ont00001760: Event Ontology

Act of Employment by an Organization
type: Class
subclass of: Act of Employment
definition: An Act of Employment wherein an Organization assigns a set of activities to some Person to be performed in exchange for financial compensation.
ont00001760: Event Ontology

Longitudinal Wave Profile
type: Class
subclass of: Wave Process Profile
subclass of: Restriction
  on property: BFO_0000132
  some values from: Mechanical Wave Process
alternative label: Compression Wave
alternative label: Longitudinal Wave
definition: A Wave Process Profile in which the displacement of participating particles is parallel to the direction of the Wave Process' propogation such that the particles alternate between participating in processes of compression and rarefaction as they participate in individual Wave Processes.
ont00001754: http://www.acs.psu.edu/drussell/Demos/waves/wavemotion.html
ont00001760: Event Ontology

Brilliance Frequency
type: Class
subclass of: Sonic Frequency
definition: A Sonic Frequency that is between 6 and 20 kHz.
ont00001760: Event Ontology

Act of Possession
type: Class
subclass of: Planned Act
definition: A Planned Act in which an agent intentionally exercises control towards a thing.
scope note: In all cases, to possess something, an agent must have an intention to possess it.
ont00001754: http://en.wikipedia.org/wiki/Possession_(law)
ont00001760: Event Ontology

Act of Suicide
type: Class
subclass of: Act of Violence
subclass of: Restriction
  on property: ont00001803
  some values from: Death
alternative label: Suicide
definition: An Act of Violence in which some Agent intentionally and voluntarily causes their own death.
ont00001754: http://www.merriam-webster.com/dictionary/suicide
ont00001760: Event Ontology

Birth
type: Class
subclass of: Natural Process
definition: A Process of bringing forth offspring.
ont00001754: https://en.wikipedia.org/w/index.php
ont00001760: Event Ontology

Act of Issuing Mass Media Article
type: Class
subclass of: Act of Mass Media Communication
definition: An Act of Mass Media Communication involving sending forth, distributing, or putting into circulation a non-fictional essay, especially one included with others in a newspaper, magazine, or journal.
ont00001754: JC3IEDM-MIRD-DMWG-Edition_3.0.2_20090514
ont00001760: Event Ontology

Under Active Control
type: Class
subclass of: Active Stasis
subclass of: Restriction
  on property: ont00001777
  some values from: Act of Artifact Employment
definition: An Active Stasis during which a Material Artifact participates in an Act of Artifact Employment.
ont00001760: Event Ontology

Act of Intelligence Gathering
type: Class
subclass of: Planned Act
definition: A Planned Act of producing and/or gathering information by a government or other Organization to guide decisions and actions by answering questions or obtaining advance warning of events and movements deemed to be important or otherwise relevant.
ont00001754: http://en.wikipedia.org/wiki/Intelligence_(information_gathering)
ont00001760: Event Ontology

Act of Identifying
type: Class
subclass of: Act of Representative Communication
definition: An Act of Representative Communication performed by asserting who or what a particular person or thing is.
ont00001754: http://www.dictionary.com/browse/identify
ont00001760: Event Ontology

Act of Issuing Mass Media Documentary
type: Class
subclass of: Act of Mass Media Communication
definition: An Act of Mass Media Communication involving sending forth, distributing, or putting into circulation information that provides a factual record or report.
ont00001754: JC3IEDM-MIRD-DMWG-Edition_3.0.2_20090514
ont00001760: Event Ontology

Act of Vocational Training Instruction
type: Class
subclass of: Act of Training Instruction
definition: An Act of Training Instruction performed by an Agent who realizes a capacity derived from the Agent's affiliation with a Vocational School, Technical School, Trade Organization, or Industry Educational Program Provider by imparting skills required for a specific occupation in industry, agriculture or trade to an Agent either directly or indirectly through some communication medium.
ont00001754: http://wordnetweb.princeton.edu/perl/webwn
ont00001760: Event Ontology

Act of Propaganda
type: Class
subclass of: Act of Deceptive Communication
definition: An Act of Deceptive Communication Propaganda intended to influence the attitude of a mass audience toward some cause or position by presenting facts selectively (thus possibly lying by omission) or by using loaded messages to produce an emotional rather than rational response to the information presented.
ont00001754: https://en.wikipedia.org/w/index.php
ont00001760: Event Ontology

Act of Warning
type: Class
subclass of: Act of Directive Communication
definition: An Act of Directive Communication performed by indicating a possible or impending danger, problem, or other unpleasant situation.
ont00001754: http://www.merriam-webster.com/dictionary/warning
ont00001760: Event Ontology

Act of Murder
type: Class
subclass of: Act of Homicide
definition: An Act of Homicide with malice aforethought.
ont00001760: Event Ontology

Infrasonic Frequency
type: Class
subclass of: Sound Frequency
definition: A Sound Frequency that is below 20 Hz.
ont00001760: Event Ontology

Vibration Motion
type: Class
subclass of: Motion
alternative label: Mechanical Oscillation
alternative label: Oscillation Motion
alternative label: Vibration
definition: A Motion wherein some participant repetitively deviates from a central location to two surrounding locations.
ont00001754: https://physicsabout.com/motion/
ont00001760: Event Ontology

Revolving Motion
type: Class
subclass of: Rotational Motion
definition: A Rotational Motion of an Object around an Axis of Rotation that is located externally to the Site occupied by the Object.
ont00001760: Event Ontology

Waveform
type: Class
subclass of: Wave Process Profile
definition: A Wave Process Profile that is the shape of the Wave Cycles of the Wave Process when depicted in a visual graph.
ont00001760: Event Ontology

Damaged Stasis
type: Class
subclass of: Stasis of Specifically Dependent Continuant
alternative label: Compromised
alternative label: Damaged
alternative label: Injured
definition: A Stasis of Specifically Dependent Continuant in which some Independent Continuant bears a Quality or Realizable Entity that has suffered impairment (i.e., a decrease or loss) due to a previous action or event such that the Independent Continuant is now of lesser value, usefulness, or functionality.
scope note: This class can be used to instantiate instances that might otherwise be treated by defined classes such as Damaged Vehicle or Wounded Person. The Independent Continuant and Quality or Realizable Entity are participants of the stasis which can in turn be related to the temporal interval via the occupies temporal region property.
ont00001754: http://www.thefreedictionary.com/damaged
ont00001760: Event Ontology

Loss of Function
type: Class
subclass of: Loss of Disposition
definition: A Loss of Disposition in which some Independent Continuant ceases to be the bearer of some Function.
ont00001760: Event Ontology

Legal System Act
type: Class
subclass of: Planned Act
definition: A Planned Act performed by an Agent that realizes their role within the context of a legal system of some jurisdiction.
ont00001754: http://www.id.uscourts.gov/glossary.htm
ont00001760: Event Ontology

Decrease of Generically Dependent Continuant
type: Class
subclass of: Decrease of Dependent Continuant
definition: A Decrease of Dependent Continuant in which some Independent Continuant has a decrease in the level of a Generically Dependent Continuant that it bears.
scope note: For the most part Generically Dependent Continuants do not inhere in their bearers over some continuous scale. The primary exception is religion and this class allows annotation of those cases where an Agent is described as becoming less religious. Other cases would include the decrease of an organization's bearing of some objective.
ont00001760: Event Ontology

Act of Renting
type: Class
subclass of: Act of Purchasing
definition: An Act of Purchasing wherein a Financial Instrument is used by an Agent (the Renter) as a payment to acquire temporary possession or use of a good or property that is owned or controlled by another Agent (the Seller).
ont00001760: Event Ontology

Social Act
type: Class
subclass of: Planned Act
definition: A Planned Act having an objective that affects, is performed by, or is performed on behalf of, a community or group of Persons.
ont00001754: http://en.wiktionary.org/wiki/commually
ont00001760: Event Ontology

Telemetry Process
type: Class
subclass of: Mechanical Process
subclass of: Restriction
  on property: ont00001777
  some values from: Act of Measuring
subclass of: Restriction
  on property: ont00001777
  some values from: Act of Communication by Media
definition: A Mechanical Process that is highly automated and in which measurements are made or other data is collected and transmitted to receiving equipment to facilitate the monitoring of environmental conditions or equipment parameters at a remote or inaccessible location.
example: using a GPS tag to track a shark's migratory pattern
example: using a portable cardiac monitor to remotely collect data on a patient's heart activity (biotelemetry)
ont00001754: https://en.wikipedia.org/w/index.php
ont00001760: Event Ontology

Extreme Ultraviolet Light Frequency
type: Class
subclass of: Ultraviolet Light Frequency
definition: An Ultraviolet Light Frequency that is between 3 and 30 petahertz.
ont00001754: https://en.wikipedia.org/w/index.php
ont00001760: Event Ontology

Act of Purchasing
type: Class
subclass of: Act of Financial Instrument Use
definition: An Act of Financial Instrument Use wherein a Financial Instrument is used by an Agent (the Purchaser) to acquire a good or service from another Agent (the Provider).
ont00001754: https://en.wikipedia.org/w/index.php
ont00001760: Event Ontology

Act of Ownership
type: Class
subclass of: Act of Possession
definition: An Act of Possession that includes an agent having certain rights and duties over the property owned.
scope note: The relation between the owner and property may be private, collective, or common and the property may be objects, land, real estate, or intellectual property.
ont00001754: https://en.wikipedia.org/w/index.php
ont00001760: Event Ontology

Infrared Light Frequency
type: Class
subclass of: Electromagnetic Radiation Frequency
definition: An Electromagnetic Radiation Frequency of some Electromagnetic Wave that is between 300 gigahertz and 430 tetrahertz.
ont00001754: https://en.wikipedia.org/w/index.php
ont00001760: Event Ontology

Timbre
type: Class
subclass of: Sound Process Profile
definition: A Sound Process Profile that is characterized by the variation, spectrum, or envelope of translated sound waves, typically on a continuum from dull or dark to bright.
ont00001760: Event Ontology

Act of Walking
type: Class
subclass of: Act of Travel
definition: An Act of Travel that proceeds by foot.
ont00001760: Event Ontology

Behavior
type: Class
subclass of: Act
definition: An Act in which an Independent Continuant participates as an Agent in response to external or internal stimuli and following some pattern which is dependent upon some combination of that Independent Continuant's internal state and external conditions.
ont00001754: http://purl.obolibrary.org/obo/GO_0007610
ont00001760: Event Ontology

Increase of Disposition
type: Class
subclass of: Increase of Realizable Entity
definition: An Increase of Realizable Entity in which some Independent Continuant has an increase of some Disposition that it bears.
ont00001760: Event Ontology

Act of Manufacturing
type: Class
subclass of: Act of Material Artifact Processing
definition: An Act of Material Artifact Processing wherein Material Artifacts are mass produced in a Facility for the purpose of being sold or distributed to consumers.
scope note: An Act of Manufacturing typically involves the mass production of goods.
ont00001760: Event Ontology

Act of Declarative Communication
type: Class
subclass of: Act of Communication
definition: An Act of Communication that changes the reality in accord with the proposition of the declaration.
scope note: Examples: Baptism, Sentencing a person to imprisonment, Pronouncing a couple husband and wife, Declaring war
ont00001754: Derived (loosely) from: John Searle's Speech Acts: An Essay in the Philosophy of Language
ont00001760: Event Ontology

Torque
type: Class
subclass of: Force
alternative label: Moment of Force
definition: A Force that is applied to an object in a direction that would tend to cause the object to rotate around an Axis of Rotation and is the rate of change of an object's Angular Momentum.
ont00001754: https://en.wikipedia.org/w/index.php
ont00001760: Event Ontology

Act of Employment
type: Class
subclass of: Act of Association
definition: An Act of Association wherein an Agent assigns a set of activities to some Person to be performed in exchange for financial compensation.
ont00001760: Event Ontology