Artifact Ontology
type: Ontology
version IRI: ArtifactOntology
imports: InformationEntityOntology
license: BSD 3-Clause: https://github.com/CommonCoreOntology/CommonCoreOntologies/blob/master/LICENSE
rights: CUBRC Inc., see full license.
comment: This ontology is designed to represent artifacts that are common to multiple domains along with their models, specifications, and functions.
version info: Version 2.1

Deflecting Prism
type: Class
subclass of: Prism
definition: A Prism designed to deflect a beam of light entering the Prism by a fixed angle.
ont00001760: Artifact Ontology

Cooling Artifact Function
type: Class
subclass of: Artifact Function
definition: An Artifact Function that is realized in a process in which the thermal energy of a system decreases.
ont00001760: Artifact Ontology

Propulsion Control System
type: Class
subclass of: Control System
definition: A Control System that consists of control devices, displays, indicators, or modules designed to control a Propulsion System.
ont00001760: Artifact Ontology

Shotgun
type: Class
subclass of: Long Gun
definition: A Long Gun that fires packets of shot, a single slug, a sabot, or a specialty round (such as tear gas, bolo shell, or a breaching round) over shorter ranges than that of Rifles and with less accuracy.
ont00001754: https://en.wikipedia.org/w/index.php
ont00001760: Artifact Ontology

Title Document
type: Class
subclass of: Legal Instrument
definition: A Legal Instrument that is designed as evidence of ownership.
ont00001754: https://en.wikipedia.org/wiki/Title_(property)
ont00001760: Artifact Ontology

Power Inverting Artifact Function
type: Class
subclass of: Current Conversion Artifact Function
definition: A Current Conversion Artifact Function that is realized by processes in which some Material Artifact is used to convert direct current (DC) to alternating current (AC).
ont00001760: Artifact Ontology

Container
type: Class
subclass of: Material Artifact
definition: A Material Artifact that is designed to contain (wholly or partially) some material entity.
ont00001760: Artifact Ontology

Sensor Platform
type: Class
equivalent class: Class
  intersection of: BFO_0000040
  intersection of: Restriction
    on property: BFO_0000196
    some values from: Class
      union of: Sensor Deployment Artifact Function
      union of: Sensor Platform Role
subclass of: BFO_0000040
definition: A Material Entity that bears a Sensor Platform Artifact Function or Sensor Platform Role.
ont00001760: Artifact Ontology

Radio Communication Reception Artifact Function
type: Class
subclass of: Communication Reception Artifact Function
definition: A Communication Reception Artifact Function that is realized during events in which a Material Artifact receives information transmitted from another Material Artifact, where the transmission of information occurs using radio waves.
ont00001760: Artifact Ontology

Sensor Deployment Artifact Function
type: Class
subclass of: Artifact Function
definition: An Artifact Function that inheres in Material Artifacts that are designed to support or convey one or more Sensors while the Sensors are realizing their own Artifact Functions.
ont00001760: Artifact Ontology

Electronic Stock
type: Class
subclass of: Stock
definition: Stock that consists of Bytes.
ont00001760: Artifact Ontology

Dispersive Prism
type: Class
subclass of: Prism
definition: A Prism designed to break up a beam of light entering the Prism into its constituent spectral colors by leveraging the refractive index of light based on its Frequency.
ont00001760: Artifact Ontology

Nuclear Reactor
type: Class
subclass of: Power Source
definition: A Power Source that is designed to initiate and control a self-sustained nuclear chain reaction to produce power in the form of heat, which can be transferred to a working fluid for further conversion to mechanical or electrical energy.
ont00001754: https://en.wikipedia.org/w/index.php
ont00001760: Artifact Ontology

Conveyance Artifact Function
type: Class
subclass of: Motion Artifact Function
definition: A Motion Artifact Function that is realized in a process in which the bearer of the function conveys entities from one location to another.
ont00001754: https://en.wikipedia.org/w/index.php
ont00001760: Artifact Ontology

Waste Management Artifact Function
type: Class
subclass of: Service Artifact Function
definition: A Service Artifact Function that is realized in processes of collecting, transporting, processing, recycling, monitoring, or disposing of waste materials.
ont00001754: https://en.wikipedia.org/w/index.php
ont00001760: Artifact Ontology

System Role
type: Class
subclass of: BFO_0000023
definition: A Role that inheres in an entity in virtue of its parts or elements being arranged in such a way that they together exhibit behavior or meaning that they do not exhibit individually.
ont00001754: https://www.incose.org/about-systems-engineering/system-and-se-definition/general-system-definition
ont00001760: Artifact Ontology

Portion of Solid Fuel
type: Class
subclass of: Portion of Fuel
definition: A Portion of Fuel that is stored in a solid state.
ont00001760: Artifact Ontology

Portion of Solid Propellant
type: Class
subclass of: Portion of Propellant
definition: A Portion of Propellant that is stored in a solid state.
ont00001760: Artifact Ontology

Flow Control Valve
type: Class
subclass of: Valve
definition: A Valve that is designed to regulate the flow or Pressure of a fluid.
scope note: Flow Control Valves are often more complex than a simple Valve and typically include an Actuator that is capable of automatically adjusting the state of the valve in response to signals from a connected Sensor or Controller.
ont00001754: https://en.wikipedia.org/w/index.php
ont00001760: Artifact Ontology

Random Wire Antenna
type: Class
subclass of: Wire Antenna
definition: A Wire Antenna that consists of a long wire suspended above the ground with a length that does not bear a relation to the wavelength of the radio waves used and which is typically used as a receiving antenna on the long, medium, and short wave bands.
ont00001754: https://en.wikipedia.org/w/index.php
ont00001760: Artifact Ontology

Banknote
type: Class
subclass of: Portion of Cash
definition: A Portion of Cash that consists of a portable slips of paper or fabric designed to bear some specified Financial Value.
ont00001760: Artifact Ontology

Very High Frequency Communication Instrument
type: Class
subclass of: Radio Communication Instrument
definition: A Radio Communication Instrument that is designed to participate in some process that has process part some Very High Frequency.
ont00001760: Artifact Ontology

Ground Motor Vehicle
type: Class
subclass of: Ground Vehicle
definition: A Ground Vehicle that is designed to receive its motive power from an Engine and is not designed to travel on rails.
ont00001754: https://en.wikipedia.org/w/index.php
ont00001760: Artifact Ontology

Stirling Engine
type: Class
subclass of: External Combustion Engine
definition: An External Combusion Engine that is designed to compress and expand some working fluid at different temperatures, such that there is a net conversion of heat energy to mechanical work.
ont00001754: https://en.wikipedia.org/w/index.php
ont00001760: Artifact Ontology

Reaction Engine
type: Class
subclass of: Engine
alternative label: Reaction Motor
definition: An Engine that provides propulsion by expelling Reaction Mass.
ont00001754: https://en.wikipedia.org/w/index.php
ont00001760: Artifact Ontology

Mobile Telephone
type: Class
subclass of: Telephone
definition: A Telephone that is connected to a Telephone Network by radio waves.
ont00001754: https://en.wikipedia.org/w/index.php
ont00001760: Artifact Ontology

Telephone Line
type: Class
subclass of: Telecommunication Network Line
alternative label: Telephone Circuit
definition: A Telecommunication Network Line that consists of a physical wire or other signaling medium that is designed to be part of a Telephone Network.
ont00001754: https://en.wikipedia.org/w/index.php
ont00001760: Artifact Ontology

Frequency Measurement Artifact Function
type: Class
subclass of: Measurement Artifact Function
definition: A Measurement Artifact Function that is realized during events in which a Material Artifact is used to measure the Frequency of a specified object or class of objects.
ont00001760: Artifact Ontology

Material Copy of a Book
type: Class
subclass of: Material Copy of a Document
subclass of: Restriction
  on property: BFO_0000101
  some values from: ont00002040
alternative label: Book
definition: A Material Copy of a Document that is designed to carry some specific Information Content Entity by means of ink, paper, parchment, or other materials fastened together to hinge at one side.
ont00001754: https://en.wikipedia.org/w/index.php
ont00001760: Artifact Ontology

Military Artifact Function
type: Class
subclass of: Service Artifact Function
definition: A Service Artifact Function that is realized in processes related to the armed services.
ont00001754: https://en.wikipedia.org/w/index.php
ont00001760: Artifact Ontology

Material Copy of a Transcript
type: Class
subclass of: Material Copy of a Document
subclass of: Restriction
  on property: BFO_0000101
  some values from: ont00002041
alternative label: Transcript
definition: A Material Copy of a Document that is designed to carry some specific Information Content Entity that was originally recorded in a different medium.
ont00001754: https://en.wikipedia.org/w/index.php
ont00001760: Artifact Ontology

Optical Microscope
type: Class
subclass of: Microscope
alternative label: Light Microscope
definition: A Microscope that is designed to use visible light and a system of Optical Lenses to produce a significantly enlarged image of the Object.
ont00001754: https://en.wikipedia.org/w/index.php
ont00001760: Artifact Ontology

Wired Communication Artifact Function
type: Class
subclass of: Communication Artifact Function
definition: A Communication Artifact Function that is realized in a process that conveys meaningful signs by means of a (usually cylindrical) flexible strand or rod of metal.
ont00001754: https://en.wikipedia.org/w/index.php
ont00001760: Artifact Ontology

Cutting Weapon
type: Class
subclass of: Weapon
definition: A Weapon that is designed to inflict harm, damage, or incapacity by means of separating some portion of its target into two or more portions through the application of acutely directed force.
ont00001754: https://en.wikipedia.org/w/index.php
ont00001760: Artifact Ontology

Autopilot System
type: Class
subclass of: Vehicle Control System
alternative label: Autopilot
definition: A Vehicle Control System that is designed to enable some Agent to control the trajectory of a Vehicle without constant 'hands-on' control.
ont00001754: https://en.wikipedia.org/w/index.php
ont00001760: Artifact Ontology

Firearm
type: Class
subclass of: Projectile Launcher
definition: A Projectile Launcher that is designed to launch Bullets or Cartridges.
ont00001754: https://en.wikipedia.org/w/index.php
ont00001760: Artifact Ontology

Infrared Telescope
type: Class
subclass of: Telescope
definition: A Telescope that is designed to aid in the observation of spatially distant Objects by means of collecting and focusing infrared light to form an enhanced image of the Object.
ont00001754: https://en.wikipedia.org/w/index.php
ont00001760: Artifact Ontology

Portion of Coolant
type: Class
subclass of: Portion of Material
definition: A Portion of Material that is designed to be used in a thermal control system to reduce or maintain the temperature of an object to or at a specified level.
ont00001760: Artifact Ontology

Bidirectional Transducer
type: Class
subclass of: Transducer
definition: A Transducer that is designed to receive a signal in the form of physical phenomena and convert it into an electrical signal, and vice versa.
ont00001754: https://en.wikipedia.org/w/index.php
ont00001760: Artifact Ontology

Preferred Stock
type: Class
subclass of: Stock
definition: Stock that entitles its holder to receive a certain level of dividend payments before any dividends can be issued to other holders.
ont00001760: Artifact Ontology

Control Surface
type: Class
subclass of: Material Artifact
definition: A Material Artifact that is designed to deflect air, water, or another medium around its surface in order to change the Attitude of a Vehicle by rotating the Vehicle on one or more of its Axes of Rotation.
ont00001754: https://en.wikipedia.org/w/index.php
ont00001760: Artifact Ontology

Propulsion System
type: Class
subclass of: Material Artifact
definition: A Material Artifact that is designed to facilitate the movement of material entities from one location to another and which consists of a source of mechanical power and a means of converting this power into propulsive force to generate the movement.
ont00001754: https://en.wikipedia.org/w/index.php
ont00001760: Artifact Ontology

Complex Optical Lens
type: Class
subclass of: Optical Lens
alternative label: Lens System
definition: An Optical Lens consisting of more than one Simple Optical Lenses.
ont00001754: Hecht, Eugene (1987). Optics (2nd ed.). Addison Wesley. ISBN 978-0-201-11609-0. Chapters 5 & 6.
ont00001760: Artifact Ontology

Electrical Artifact Function
type: Class
subclass of: Artifact Function
definition: An Artifact Function that is realized during events in which a Material Artifact is used to perform a process involving electrical power.
ont00001760: Artifact Ontology

Portion of Liquid Oxygen
type: Class
subclass of: Portion of Cryogenic Material
definition: A Portion of Cryogenic Material that is composed (almost) entirely of liquid oxygen.
ont00001760: Artifact Ontology

Vehicle Compartment
type: Class
subclass of: Material Artifact
alternative label: Compartment
definition: A Material Artifact that is designed to partition a Vehicle into subdivisions for various purposes.
ont00001760: Artifact Ontology

Air Inlet
type: Class
subclass of: Fluid Control Artifact
alternative label: Air Intake
definition: A Fluid Control Artifact that consists of an opening that is designed to capture and direct the flow of air into the system it is part of.
ont00001760: Artifact Ontology

Ventilation Control Artifact Function
type: Class
subclass of: Artifact Function
definition: An Artifact Function that is realized in processes in which some Material Artifact is used to control the quality of air in some space.
ont00001760: Artifact Ontology

Pump
type: Class
subclass of: Fluid Control Artifact
definition: A Fluid Control Artifact that is designed to impart motion to a portion of fluid to transport it within a system through the use of mechanical action.
ont00001760: Artifact Ontology

Information Processing Artifact
type: Class
subclass of: Material Artifact
definition: A Material Artifact that is designed to use algorithms to transform some Information Content Entity into another Information Content Entity.
ont00001760: Artifact Ontology

Artifact Function Specification
type: Class
equivalent class: Class
  intersection of: ont00000965
  intersection of: Restriction
    on property: BFO_0000176
    some values from: Artifact Model
  intersection of: Restriction
    on property: ont00001942
    some values from: Artifact Function
subclass of: ont00000965
definition: A Prescriptive Information Content Entity that prescribes some Material Artifact Function and which is part of some Material Artifact Model.
ont00001760: Artifact Ontology

Vehicle Track Point
type: Class
subclass of: ont00000170
subclass of: Restriction
  on property: ont00001944
  some values from: Vehicle Track
definition: An Object Track Point that is where a Vehicle is or was located during some motion.
ont00001760: Artifact Ontology

Portion of Liquid Hydrogen
type: Class
subclass of: Portion of Cryogenic Material
definition: A Portion of Cryogenic Material that is composed (almost) entirely of liquid hydrogen.
ont00001760: Artifact Ontology

Power Transformer
type: Class
subclass of: Material Artifact
definition: A Material Artifact that is designed to transfer electrical energy between two or more circuits through electromagnetic induction.
ont00001754: https://en.wikipedia.org/w/index.php
ont00001760: Artifact Ontology

Recording Device
type: Class
subclass of: Information Processing Artifact
definition: An Information Processing Artifact that is designed to capture some information and store it in some recording format on some storage medium.
ont00001754: https://en.wikipedia.org/w/index.php
ont00001760: Artifact Ontology

Optical Instrument
type: Class
subclass of: Material Artifact
definition: A Material Artifact that is designed to process light waves.
scope note: Light waves can be processed in a variety of ways including via reflection, refraction, diffraction, deflection, focusing, collimation, dispersion, and interference.
scope note: Optical Instruments are typically constructed for the purpose of being used to aid in vision or the analysis of light.
ont00001754: https://en.wikipedia.org/w/index.php
ont00001760: Artifact Ontology

Cargo Cabin
type: Class
subclass of: Vehicle Compartment
definition: A Vehicle Compartment that is used to store goods or materials during transportation.
ont00001760: Artifact Ontology

Incendiary Weapon
type: Class
subclass of: Weapon
definition: A Weapon that is designed to inflict harm, damage, or incapacity by means of starting a fire.
ont00001754: https://en.wikipedia.org/w/index.php
ont00001760: Artifact Ontology

Flight Transponder
type: Class
subclass of: Radio Transponder
definition: A Radio Transponder that is designed to produce a specified response (typically for identification, location, or status update purposes) when it receives a radio-frequency interrogation.
ont00001754: https://en.wikipedia.org/w/index.php
ont00001760: Artifact Ontology

Telephone Network
type: Class
subclass of: Telecommunication Network
definition: A Telecommunication Network that is designed to allow telephone calls to be made between two or more parties connected to the network.
ont00001754: https://en.wikipedia.org/w/index.php
ont00001760: Artifact Ontology

Generator Control Unit
type: Class
subclass of: Control System
definition: A Control System that is designed to regulate the voltage of some Electrical Power Source.
ont00001760: Artifact Ontology

Hand Gun
type: Class
subclass of: Firearm
definition: A Firearm that is designed to have a relatively short barrel and to be held in one or two hands and to be fired without being braced against the shoulder.
ont00001754: https://en.wikipedia.org/w/index.php
ont00001760: Artifact Ontology

Lithium-ion Electric Battery
type: Class
subclass of: Secondary Cell Electric Battery
definition: A Secondary Cell Electric Battery that produces electricity when lithium ions move from anode to cathode.
ont00001754: https://en.wikipedia.org/w/index.php
ont00001760: Artifact Ontology

Material Copy of a Timekeeping Instrument
type: Class
subclass of: Information Bearing Artifact
alternative label: Timekeeping Instrument
definition: An Information Bearing Artifact that is designed to carry some specific Information Content Entity that is about some temporal region.
ont00001754: https://en.wikipedia.org/w/index.php
ont00001760: Artifact Ontology

Manual Tool
type: Class
subclass of: Tool
alternative label: Hand Tool
definition: A Tool that is designed to be powered by manual labor rather than by an engine.
ont00001754: https://en.wikipedia.org/w/index.php
ont00001760: Artifact Ontology

Electrical Connector Artifact Function
type: Class
subclass of: Electrical Conduction Artifact Function
definition: An Electrical Conduction Artifact Function that is realized by processes in which some Material Artifact is used to join electrical terminations to create an electrical circuit.
ont00001760: Artifact Ontology

Large-Scale Rocket Launcher
type: Class
subclass of: Rocket Launcher
definition: A Rocket Launcher that is designed to contain multiple Rocket Launchers.
ont00001760: Artifact Ontology

Detergent Artifact Function
type: Class
subclass of: Surfactant Artifact Function
definition: A Surfactant Artifact Function that is realized in a process that cleans substances in dilute solutions.
ont00001754: https://en.wikipedia.org/w/index.php
ont00001760: Artifact Ontology

Ultraviolet Telescope
type: Class
subclass of: Telescope
alternative label: UV Telescope
definition: A Telescope that is designed to aid in the observation of spatially distant Objects by means of collecting and focusing ultraviolet light to form an enhanced image of the Object.
ont00001760: Artifact Ontology

Arrow
type: Class
subclass of: Portion of Ammunition
definition: A Portion of Ammunition that is designed to be fired from a Bow and consists of a long straight stiff shaft with stabilizers (fletchings) and a slot (the nock) on one end and a weighted tip (the arrowhead) on the other end.
ont00001754: https://en.wikipedia.org/w/index.php
ont00001760: Artifact Ontology

Fragrance Artifact Function
type: Class
subclass of: Artifact Function
definition: An Artifact Function that is realized in processes of emitting a pleasant or sweet odor.
ont00001754: https://en.wikipedia.org/w/index.php
ont00001760: Artifact Ontology

Material Copy of a Certificate
type: Class
subclass of: Information Bearing Artifact
subclass of: Restriction
  on property: BFO_0000101
  some values from: ont00002002
alternative label: Certificate
definition: An Information Bearing Artifact that bears an Information Content Entity which attests to certain demonstrated characteristics of an Object, Person, or Organization.
ont00001754: http://www.dictionary.com/browse/degree
ont00001760: Artifact Ontology

Minimum Speed Artifact Function
type: Class
subclass of: Speed Artifact Function
definition: A Speed Artifact Function that is realized in some process in which the Material Artifact bearing the Artifact Function attains the lowest speed at which that Material Artifact is designed to operate.
ont00001760: Artifact Ontology

Facility
type: Class
subclass of: Material Artifact
subclass of: Restriction
  on property: BFO_0000171
  some values from: ont00001341
definition: A Material Artifact that is designed as a building or campus dedicated to some specific purpose.
ont00001760: Artifact Ontology

Telephone Subscriber Line
type: Class
subclass of: Telephone Line
definition: A Telephone Line that connects a Communication Endpoint to another node in a Telecommunication Network to enable service to a user's Telephone.
ont00001754: https://en.wikipedia.org/w/index.php
ont00001760: Artifact Ontology

Electrical Contact Artifact Function
type: Class
subclass of: Electrical Conduction Artifact Function
definition: An Electrical Conduction Artifact Function that is realized by processes in which some Material Artifact is used as an endpoint of an electrical circuit from which an electrical current is passed via physical contact with the endpoint.
ont00001760: Artifact Ontology

Camera
type: Class
subclass of: Imaging Instrument
definition: An Imaging Instrument that is designed to form and digitally or physically record an image of an entity.
ont00001754: http://www.dictionary.com/browse/camera
ont00001760: Artifact Ontology

Rifle
type: Class
subclass of: Long Gun
definition: A Long Gun that is designed to have a rifled barrel and to fire single Bullets over long ranges with high accuracy.
ont00001754: https://en.wikipedia.org/w/index.php
ont00001760: Artifact Ontology

Friction Reduction Artifact Function
type: Class
subclass of: Artifact Function
definition: An Artifact Function that is realized in processes of reducing the force resisting the relative motion of surfaces in contact.
ont00001754: https://en.wikipedia.org/w/index.php
ont00001760: Artifact Ontology

Engine
type: Class
subclass of: Material Artifact
alternative label: Motor
definition: A Material Artifact that is designed to convert one form of energy into mechanical energy.
ont00001754: https://en.wikipedia.org/w/index.php
ont00001760: Artifact Ontology

Chemical Weapon
type: Class
subclass of: Weapon
definition: A Weapon that is designed to inflict harm, damage, or incapacity by means of releasing toxic chemicals.
ont00001754: https://en.wikipedia.org/w/index.php
ont00001760: Artifact Ontology

Moving Target Indication Artifact Function
type: Class
subclass of: Radar Imaging Artifact Function
definition: A Radar Imaging Artifact Function that inheres in Material Artifacts that are designed to identify and produce visual representations of moving entities by using a radar to emit successive phase coherent pulses, which are sampled and added to the subsequent pulse to cancel out signals from non-moving entities such that only signals from moving entities remain and are displayed.
ont00001760: Artifact Ontology

Radio Telescope
type: Class
subclass of: Telescope
definition: A Telescope that is designed to aid in the observation of spatially distant Objects by means of collecting and focusing radio waves to form an enhanced image of the Object.
scope note: A Radio Telescope consists of a specialized Antenna and a Radio Receiver and is typically used to receive radio waves from sources in outer space.
ont00001754: https://en.wikipedia.org/w/index.php
ont00001760: Artifact Ontology

Shell
type: Class
subclass of: Portion of Ammunition
definition: A Portion of Ammunition that is designed to be a non-self-propelled projectile and to carry a payload (explosive or other) over a relatively short distance.
ont00001754: https://en.wikipedia.org/wiki/Shell_(projectile)
ont00001760: Artifact Ontology

Reflecting Optical Telescope
type: Class
subclass of: Optical Telescope
alternative label: Reflecting Telescope
alternative label: Reflector
definition: An Optical Telescope that is designed to aid in the observation of spatially distant Objects by means of collecting and focusing visible light via reflection through the use of one or more curved Mirrors to form an enhanced image of the Object.
ont00001754: https://en.wikipedia.org/w/index.php
ont00001760: Artifact Ontology

Diffraction Grating
type: Class
subclass of: Optical Instrument
definition: An Optical Instrument with a periodic structure that is designed to split and defract a beam of light into several beams travelling in different directions.
ont00001754: https://en.wikipedia.org/w/index.php
ont00001760: Artifact Ontology

Torpedo Tube
type: Class
subclass of: Projectile Launcher
definition: A Projectile Launcher that is designed to launch Torpedoes.
ont00001754: https://en.wikipedia.org/w/index.php
ont00001760: Artifact Ontology

Stock Certificate
type: Class
subclass of: Stock
definition: Stock that consists of a Certificate.
ont00001760: Artifact Ontology

Lighting System
type: Class
subclass of: Material Artifact
definition: A Material Artifact that is designed to emit light within some area.
ont00001760: Artifact Ontology

Propeller
type: Class
subclass of: Material Artifact
alternative label: Propelling Screw
definition: A Material Artifact that is designed to convert rotary motion from an Engine or other mechanical Power Source into propulsive Force.
ont00001754: https://en.wikipedia.org/wiki/Propeller_(aeronautics)
ont00001760: Artifact Ontology

Heat Sink
type: Class
subclass of: Material Artifact
definition: A Material Artifact that is designed to regulate the temperature of a computer by the passive transfer of heat away from other components in the computer.
ont00001754: https://en.wikipedia.org/w/index.php
ont00001760: Artifact Ontology

Fragmentation Artifact Function
type: Class
subclass of: Damaging Artifact Function
definition: A Damaging Artifact Function that is realized in a process in which the structural integrity of an entity is impaired because of a detonation which causes fragmentation.
ont00001754: http://www.dictionary.com/browse/fragmentation
ont00001760: Artifact Ontology

Road
type: Class
subclass of: Land Transportation Artifact
definition: A Land Transportation Artifact that is designed to enable Ground Vehicles to travel from one location to another.
ont00001754: https://en.wikipedia.org/w/index.php
ont00001760: Artifact Ontology

Shaft
type: Class
subclass of: Material Artifact
definition: A Material Artifact that is designed to rotate and transmit Torque, Power, or Rotational Motion from one machine element to another.
scope note: A Shaft is usually used to connect other components of a drive train that cannot be connected directly either because of the distance between them or the need to allow for relative movement between those components.
ont00001754: https://en.wikipedia.org/w/index.php
ont00001760: Artifact Ontology

Nozzle
type: Class
subclass of: Fluid Control Artifact
definition: A Fluid Control Artifact that is designed to control the speed, direction, rate, shape, or pressure of the flow of fluid exiting it.
ont00001760: Artifact Ontology

Transportation Artifact
type: Class
subclass of: Material Artifact
definition: A Material Artifact that is fixed in place and designed to enable the movement of Vehicles and Agents from one location to another.
ont00001760: Artifact Ontology

Portion of Cryogenic Material
type: Class
subclass of: Portion of Material
definition: A Portion of Material that has been reduced to a very low temperature (below -180 degrees Celcius).
ont00001760: Artifact Ontology

Fluid Control Artifact
type: Class
subclass of: Material Artifact
definition: A Material Artifact that is designed to manipulate the flow of a fluid (i.e. a liquid or a gas).
ont00001760: Artifact Ontology

Hydraulic Fluid Reservoir
type: Class
subclass of: Container
definition: A Container that is designed to store some hydraulic fluid for use in some Hyrdraulic Power Source.
ont00001760: Artifact Ontology

Hearing Aid
type: Class
subclass of: Medical Artifact
definition: A Medical Artifact that is designed to improve hearing for its user.
ont00001754: https://en.wikipedia.org/w/index.php
ont00001760: Artifact Ontology

Catalyst Artifact Function
type: Class
subclass of: Chemical Reaction Artifact Function
definition: A Chemical Reaction Artifact Function that is realized in a process in which the rate of a chemical reaction is increased due to the participation of an additional substance, without that substance being consumed in the reaction.
ont00001754: https://en.wikipedia.org/w/index.php
ont00001760: Artifact Ontology

Cannon
type: Class
subclass of: Projectile Launcher
definition: A Projectile Launcher that is designed to use a controlled explosion to launch a relatively large Portion of Ammunition, such as a Round Shot or a Shell, at a significant Velocity.
ont00001754: https://en.wikipedia.org/w/index.php
ont00001760: Artifact Ontology

Radio Transmitter
type: Class
subclass of: Radio Communication Instrument
definition: A Radio Communication Instrument that is an electronic device that is designed to generate a radio frequency alternating current, which can be applied to a Radio Antenna to be transmitted as radio waves.
ont00001754: https://en.wikipedia.org/w/index.php
ont00001760: Artifact Ontology

Communication Interference Artifact Function
type: Class
subclass of: Artifact Function
definition: An Artifact Function that is realized during events in which a Material Artifact is used to interfere with the transmission of information for the purpose of preventing communication.
ont00001760: Artifact Ontology

Nuclear Weapon
type: Class
subclass of: Weapon
definition: A Weapon that is designed to inflict harm, damage, or incapacity by means of a destructive nuclear reaction, either through fission or through a combination of fission and fusion.
ont00001754: https://en.wikipedia.org/w/index.php
ont00001760: Artifact Ontology

Torpedo
type: Class
subclass of: Precision-Guided Missile
definition: A Precision-Guided Missile that is designed to be fired into a body of water, be self-propelled through the water, and carry an explosive payload.
ont00001754: https://en.wikipedia.org/w/index.php
ont00001760: Artifact Ontology

Counterfeit Financial Instrument
type: Class
subclass of: Counterfeit Instrument
definition: A Counterfeit Instrument that is designed to be a fake replica of some legally sanctioned Financial Instrument.
ont00001754: https://en.wikipedia.org/w/index.php
ont00001760: Artifact Ontology

Emergency Locator Transmitter
type: Class
subclass of: Radio Transmitter
definition: A Radio Transmitter that is designed to signal distress and provide positional data for the entity it is located on.
ont00001754: https://en.wikipedia.org/w/index.php
ont00001760: Artifact Ontology

Inertial Navigation System
type: Class
subclass of: Navigation System
alternative label: INS
definition: A Navigation System that is designed to continuously calculate via dead reckoning the position, orientation, and velocity of a moving object without the need for external references.
ont00001754: https://en.wikipedia.org/w/index.php
ont00001760: Artifact Ontology

Power Source
type: Class
subclass of: Material Artifact
definition: A Material Artifact that is designed to supply power to some other Material Artifact.
ont00001754: https://en.wikipedia.org/w/index.php
ont00001760: Artifact Ontology

Radar Imaging Artifact Function
type: Class
subclass of: Imaging Artifact Function
definition: An Imaging Artifact Function that inheres in Material Artifacts that are designed to produce visual representations of entities using radio waves.
ont00001760: Artifact Ontology

Artifact Identifier
type: Class
equivalent class: Class
  intersection of: ont00000686
  intersection of: Restriction
    on property: ont00001916
    some values from: Material Artifact
subclass of: ont00000686
definition: A Designative Information Content Entity which designates some Material Artifact.
ont00001760: Artifact Ontology

Air-Breathing Jet Engine
type: Class
subclass of: Jet Engine
alternative label: Ducted Jet Engine
definition: A Jet Engine that is propelled by a jet of hot exhaust gases formed from air that is drawn into the Engine via an Air Inlet.
ont00001754: https://en.wikipedia.org/w/index.php
ont00001760: Artifact Ontology

Shoulder-Fired Rocket Launcher
type: Class
subclass of: Rocket Launcher
definition: A Rocket Launcher that is designed to be small enough to be carried by a single person and fired while supported on the person's shoulder.
ont00001760: Artifact Ontology

Prosthetic Leg
type: Class
subclass of: Prosthesis
definition: A Prosthesis that is designed to replace a missing leg.
ont00001754: https://en.wikipedia.org/w/index.php
ont00001760: Artifact Ontology

Vehicle Transmission
type: Class
subclass of: Power Transmission Artifact
alternative label: Gearbox
alternative label: Transmission
definition: A Power Transmission Artifact that is designed to vary the output speed and torque in a rotating power transfer system.
ont00001754: https://en.wikipedia.org/wiki/Transmission_(mechanics)
ont00001760: Artifact Ontology

Alternating Current Power Source
type: Class
subclass of: Electrical Power Source
definition: An Electrical Power Source that is designed to transfer electrical power in the form of alternating current.
ont00001760: Artifact Ontology

Intercommunication System
type: Class
subclass of: Communication System
definition: A Communication System that is designed to enable some Act of Communication between end points within a building, small collection of buildings, or within a small area of service.
ont00001754: https://en.wikipedia.org/w/index.php
ont00001760: Artifact Ontology

Microscope
type: Class
subclass of: Imaging Instrument
definition: An Imaging Instrument that is designed to enable users to see Objects that are otherwise too small to be seen by the naked eye by producing a significantly enlarged image of the Object.
ont00001754: https://en.wikipedia.org/w/index.php
ont00001760: Artifact Ontology

Hinge
type: Class
subclass of: Machine Bearing
definition: A Machine Bearing that is designed to limit the angle of Rotation between two solid objects.
ont00001754: https://en.wikipedia.org/w/index.php
ont00001760: Artifact Ontology

Portion of Food
type: Class
subclass of: Portion of Processed Material
definition: A Portion of Processed Material that is designed to be consumed and ingested for nutrition or taste.
ont00001754: https://en.wikipedia.org/w/index.php
ont00001760: Artifact Ontology

Healthcare Artifact Function
type: Class
subclass of: Service Artifact Function
definition: A Service Artifact Function that is realized in processes of treating and preventing illness.
ont00001754: https://en.wikipedia.org/w/index.php
ont00001760: Artifact Ontology

Grenade
type: Class
subclass of: Explosive Weapon
alternative label: Hand Grenade
definition: An Explosive Weapon that is designed to be relatively small and to be thrown by hand.
ont00001754: https://en.wikipedia.org/w/index.php
ont00001760: Artifact Ontology

Filtration Artifact Function
type: Class
subclass of: Filter Function
definition: A Filter Function that is realized in a process in which some solid entity is prevented from moving along with some quantity of liquid.
ont00001754: https://en.wikipedia.org/w/index.php
ont00001760: Artifact Ontology

Telecommunication Switching Node
type: Class
subclass of: Telecommunication Network Node
definition: A Telecommunication Network Node that is capable of redirecting a communication transmission to another Telecommunication Network Node.
ont00001754: https://en.wikipedia.org/w/index.php
ont00001760: Artifact Ontology

Portion of Liquid Helium
type: Class
subclass of: Portion of Cryogenic Material
definition: A Portion of Cryogenic Material that is composed (almost) entirely of liquid helium.
ont00001760: Artifact Ontology

Electronic Signal Processing Artifact Function
type: Class
subclass of: Signal Processing Artifact Function
definition: A Signal Processing Artifact Function that inheres in Material Artifacts that are designed to process or transfer information contained in electronic signals.
ont00001760: Artifact Ontology

Artifact Design
type: Class
subclass of: ont00000965
subclass of: Restriction
  on property: ont00001942
  some values from: Material Artifact
definition: A Prescriptive Information Content Entity that is a specification of an object, manifested by an agent, intended to accomplish goals, in a particular environment, using a set of primitive components, satisfying a set of requirements, subject to constraints.
ont00001754: https://en.wikipedia.org/w/index.php
ont00001760: Artifact Ontology

Residential Artifact Function
type: Class
subclass of: Service Artifact Function
definition: A Service Artifact Function that is realized in processes of residing in a dwelling or home.
ont00001754: https://en.wikipedia.org/w/index.php
ont00001760: Artifact Ontology

Artifact Function
type: Class
subclass of: BFO_0000034
subclass of: Restriction
  on property: BFO_0000197
  some values from: Material Artifact
definition: A Function that inheres in some Material Artifact in virtue of that Material Artifact being designed to be used in processes that require that Function to be realized.
ont00001760: Artifact Ontology

Radio Transponder
type: Class
subclass of: Radio Communication Instrument
alternative label: Transmitter-Responder
definition: A Radio Communication Instrument that is an electronic device that acts as both a Radio Transmitter and responder and is used to wirelessly receive and transmit electrical signals.
ont00001760: Artifact Ontology

Transportation Infrastructure
type: Class
subclass of: Infrastructure System
definition: An Infrastructure System that has continuant part one or more Transportation Artifacts and bears a function that, if realized, is realized in Acts of Cargo Transportation
ont00001754: http://www.cfr.org/infrastructure/transportation-infrastructure-moving-america/p18611
ont00001760: Artifact Ontology

Gas Turbine
type: Class
subclass of: Internal Combustion Engine
alternative label: Combustion Turbine
definition: An Internal Combustion Engine that has a rotating compressor and a turbine and is designed to operate utilizing continous Combustion to produce Thrust, either directly via exhaust or indirectly via a prop.
ont00001754: https://en.wikipedia.org/w/index.php
ont00001760: Artifact Ontology

Interphone
type: Class
subclass of: Intercommunication System
definition: An Intercommunication System that that is designed to facilitate some Act of Communication between agents by means of audio messages.
ont00001760: Artifact Ontology

Rocket-Propelled Grenade
type: Class
subclass of: Unguided Rocket
definition: An Unguided Rocket that is designed to contain an explosive warhead, be fired from a Shoulder-Fired Rocket Launcher, and be used against Tanks.
ont00001753: RPG
ont00001754: https://en.wikipedia.org/w/index.php
ont00001760: Artifact Ontology

Fan
type: Class
subclass of: Fluid Control Artifact
definition: A Fluid Control Artifact that consists of a rotating arrangement of vanes or blades that are designed to act on a portion of fluid to create flow within it.
ont00001754: https://en.wikipedia.org/wiki/Fan_(machine)
ont00001760: Artifact Ontology

Mortar
type: Class
subclass of: Cannon
definition: A Cannon that is designed to fire projectiles at relatively low velocities over relatively short ranges.
ont00001754: https://en.wikipedia.org/wiki/Mortar_(weapon)
ont00001760: Artifact Ontology

Prosthetic Arm
type: Class
subclass of: Prosthesis
definition: A Prosthesis that is designed to replace a missing arm.
ont00001754: https://en.wikipedia.org/w/index.php
ont00001760: Artifact Ontology

Brake
type: Class
subclass of: Material Artifact
definition: A Material Artifact that is designed to inhibit the Vehicle's Motion by absorbing energy from a moving system.
ont00001754: https://en.wikipedia.org/w/index.php
ont00001760: Artifact Ontology

Reciprocating Steam Engine
type: Class
subclass of: Steam Engine
definition: A Steam Engine that is designed to use one or more reciprocating pistons to convert pressure into a rotating motion.
ont00001754: https://en.wikipedia.org/w/index.php
ont00001760: Artifact Ontology

Surfactant Artifact Function
type: Class
subclass of: Emulsifier Artifact Function
definition: An Emulsifier Artifact Function that is realized in a process that lowers the surface tension between two liquids or between a liquid and a solid.
ont00001754: https://en.wikipedia.org/w/index.php
ont00001760: Artifact Ontology

Communication Instrument
type: Class
subclass of: Material Artifact
definition: A Material Artifact that is designed to facilitate communication between at least two entities.
ont00001760: Artifact Ontology

Electronic Bond
type: Class
subclass of: Bond
definition: A Bond that consists of Bytes.
ont00001760: Artifact Ontology

Filter
type: Class
equivalent class: Class
  intersection of: Material Artifact
  intersection of: Restriction
    on property: BFO_0000196
    some values from: Filter Function
subclass of: Material Artifact
definition: A Material Artifact that bears a Filter Function.
ont00001760: Artifact Ontology

Cooling System
type: Class
subclass of: Environment Control System
definition: An Environment Control System that is designed to cool the air or objects in a Site.
ont00001760: Artifact Ontology

Satellite Artifact
type: Class
subclass of: Spacecraft
definition: A Spacecraft that is designed to Orbit a Space Object (typically Earth).
ont00001760: Artifact Ontology

Research Artifact Function
type: Class
subclass of: Artifact Function
definition: An Artifact Function that is realized during events in which a Material Artifact is used to perform research on a specified entity or class of entities.
ont00001760: Artifact Ontology

Refracting Optical Telescope
type: Class
subclass of: Optical Telescope
alternative label: Refracting Telescope
alternative label: Refractor
definition: An Optical Telescope that is designed to aid in the observation of spatially distant Objects by means of collecting and focusing visible light via refraction through the use of one or more Lenses to form an enhanced image of the Object.
ont00001754: https://en.wikipedia.org/w/index.php
ont00001760: Artifact Ontology

Rocket Engine
type: Class
subclass of: Jet Engine
alternative label: Thruster
definition: A Jet Engine that is designed to use only stored Rocket Propellant to form a high speed propulsive jet in order to generate Thrust.
scope note: Most rocket engines are also Internal Combustion Engines, however non-combusting forms also exist. For example, an untied balloon full of air that is released and allowed to zoom around the room may be both a Rocket Engine and a Physically Powered Engine.
ont00001754: https://en.wikipedia.org/w/index.php
ont00001760: Artifact Ontology

Wireless Telecommunication Network
type: Class
subclass of: Telecommunication Network
alternative label: Wireless Network
definition: A Telecommunication Network that uses wireless connections to connect Telecommunication Network Nodes.
ont00001754: https://en.wikipedia.org/w/index.php
ont00001760: Artifact Ontology

Pneumatic Motor
type: Class
subclass of: Physically Powered Engine
alternative label: Air Motor
alternative label: Compressed Air Engine
definition: A Physically Powered Engine that converts potential energy stored in a portion of compressed air into mechanical energy.
ont00001760: Artifact Ontology

Power Transformer Rectifier Unit
type: Class
subclass of: Material Artifact
alternative label: TRU
definition: A Material Artifact that is designed to perform the functions of both a Rectifier and a Transformer.
ont00001754: http://www.skybrary.aero/index.php/Transformer_Rectifier_Unit_(TRU)
ont00001760: Artifact Ontology

Portion of Gallium Arsenide
type: Class
subclass of: Portion of Material
alternative label: Portion of GaAs
definition: A Portion of Material that is composed of a compound of the elements gallium and arsenic.
ont00001760: Artifact Ontology

Material Copy of a Spreadsheet
type: Class
subclass of: Material Copy of a Document
subclass of: Restriction
  on property: BFO_0000101
  some values from: ont00002042
alternative label: Spreadsheet
definition: A Material Copy of a Document that is designed to carry some Information Content Entity in an interactive, tabular form.
ont00001754: https://en.wikipedia.org/w/index.php
ont00001760: Artifact Ontology

Internal Combustion Engine
type: Class
subclass of: Combustion Engine
definition: A Combustion Engine that is designed to have an internal Combustion Chamber where portions of Fuel and Oxidizer mixture are burned to generate thermal energy that is then converted into mechanical energy.
ont00001754: https://en.wikipedia.org/w/index.php
ont00001760: Artifact Ontology

Combustion Chamber
type: Class
subclass of: Material Artifact
alternative label: Burner
alternative label: Combustor
alternative label: Flame Holder
definition: A Material Artifact that is designed to wholly or partially bound an internal Site where a Combustion process is intended to occur.
ont00001760: Artifact Ontology

Diffraction Artifact Function
type: Class
subclass of: Artifact Function
definition: An Artifact Function that is realized by a Material Artifact participating in a diffraction event in which the Material Artifact forces a wave to bend around the corners of an obstacle or aperture into the region of geometrical shadow of the obstacle.
ont00001760: Artifact Ontology

Electrical Resistance Artifact Function
type: Class
subclass of: Electrical Artifact Function
definition: An Electrical Artifact Function that is realized in processes in which a Material Artifact opposes the flow of an electric current.
ont00001754: https://en.wikipedia.org/w/index.php
ont00001760: Artifact Ontology

Spark Ignition System
type: Class
subclass of: Ignition System
definition: An Ignition System that is designed to produce a spark in order to initiate an Ignition process.
ont00001760: Artifact Ontology

Speed Measurement Artifact Function
type: Class
subclass of: Measurement Artifact Function
definition: A Measurement Artifact Function that is realized during events in which a Material Artifact is used to measure the Speed of a specified object's or class of objects' Motion.
ont00001760: Artifact Ontology

Oxidizer Artifact Function
type: Class
subclass of: Chemical Reaction Artifact Function
definition: A Chemical Reaction Artifact Function that is realized in a process in which electrons are removed from a reactant in a redox reaction.
ont00001754: https://en.wikipedia.org/w/index.php
ont00001760: Artifact Ontology

Electron Microscope
type: Class
subclass of: Microscope
definition: A Microscope that is designed to use a beam of accelerated electrons to illuminate the target and produce a significantly enlarged image of the Object.
ont00001754: https://en.wikipedia.org/w/index.php
ont00001760: Artifact Ontology

Anti-Microbial Artifact Function
type: Class
subclass of: Pesticide Artifact Function
definition: A Pesticide Artifact Function that is realized in a process which causes illness in, or the death of, a microorganism.
ont00001754: https://en.wikipedia.org/w/index.php
ont00001760: Artifact Ontology

Prosthetic Hand
type: Class
subclass of: Prosthesis
definition: A Prosthesis that is designed to replace a missing hand.
ont00001754: https://en.wikipedia.org/w/index.php
ont00001760: Artifact Ontology

Computer
type: Class
subclass of: Information Processing Artifact
definition: An Information Processing Artifact that is designed to execute an arbitrary set of arithmetic or logical operations automatically.
ont00001754: https://en.wikipedia.org/w/index.php
ont00001760: Artifact Ontology

Communication Reception Artifact Function
type: Class
subclass of: Artifact Function
definition: An Artifact Function that is realized during events in which a Material Artifact is used to receive information that has been transmitted for the purpose of communiction.
ont00001760: Artifact Ontology

Armored Fighting Vehicle
type: Class
subclass of: Ground Motor Vehicle
definition: A Ground Motor Vehicle that is designed to be armored and used to transport and support military personal in combat missions.
ont00001754: https://en.wikipedia.org/w/index.php
ont00001760: Artifact Ontology

Railway Junction
type: Class
subclass of: Land Transportation Artifact
definition: A Land Transportation Artifact that is designed to enable a Train to switch between the tracks of two routes.
ont00001754: https://en.wikipedia.org/wiki/Junction_(rail)
ont00001760: Artifact Ontology

External Combustion Engine
type: Class
subclass of: Combustion Engine
definition: A Combustion Engine that is designed to have an external Combustion Chamber where portions of Fuel and Oxidizer mixture are burned to generate thermal energy to heat the working fluid, which transfers energy to the Engine where it is converted into mechanical energy.
ont00001754: https://en.wikipedia.org/w/index.php
ont00001760: Artifact Ontology

Simple Optical Lens
type: Class
subclass of: Optical Lens
definition: An Optical Lens consisting of a single piece of transparent material.
ont00001760: Artifact Ontology

X-ray Microscope
type: Class
subclass of: Microscope
definition: A Microscope that is designed to use Electromagnetic Radiation in the soft X-ray band to produce a significantly enlarged image of the Object.
ont00001754: https://en.wikipedia.org/w/index.php
ont00001760: Artifact Ontology

Enhancing Artifact Function
type: Class
subclass of: Artifact Function
definition: An Artifact Function that is realized in processes of intensifying, increainsg, or further improving the quality, value, or extent of some entity.
ont00001754: https://en.wikipedia.org/w/index.php
ont00001760: Artifact Ontology

Watercraft
type: Class
subclass of: Vehicle
definition: A Vehicle that is designed to convey passengers, cargo, or equipment from one location to another by water travel.
ont00001754: https://en.wikipedia.org/w/index.php
ont00001760: Artifact Ontology

Weapon
type: Class
subclass of: Material Artifact
definition: A Material Artifact that is designed to destroy or inflict damage to structures or systems, or to kill or wound living things by creating specific lethal or nonlethal effects.
scope note: Nonlethal effects include all outcomes short of death or destruction. This is captured by the fact that Damaged Stasis and Wounded Stasis are defined in terms of impairment of the Independent Continuant that participates in them.
ont00001754: https://en.wikipedia.org/w/index.php
ont00001760: Artifact Ontology

Motion Artifact Function
type: Class
subclass of: Artifact Function
definition: An Artifact Function that is realized in a process in which an entity changes its position with respect to time.
ont00001754: https://en.wikipedia.org/wiki/Motion_(physics)
ont00001760: Artifact Ontology

Collimation Artifact Function
type: Class
subclass of: Artifact Function
definition: An Artifact Function that is realized by a Material Artifact participating in a collimation event in which the Material Artifact narrows a beam of particles or waves by either causing the spatial cross-section of the beam to become smaller or by causing the directions of motion of the beam's constituents to be aligned in a specifc direction of Motion.
ont00001760: Artifact Ontology

Timekeeping Artifact Function
type: Class
subclass of: Artifact Function
definition: An Artifact Function that is realized during events in which a Material Artifact is used to keep track of and report the current time.
ont00001760: Artifact Ontology

Environment Control System
type: Class
subclass of: Material Artifact
definition: A Material Artifact that is designed to control the temperature, air quality, or other feature of a Site that is relevant to the comfort or operation of entities located within that Site.
scope note: Controlling air quality typically involves temperature control, oxygen replenishment, and removal of moisture, odor, smoke, heat, dust, airborne bacteria, carbon dioxide, and other undesired gases or particulates.
ont00001760: Artifact Ontology

Compression Ignition System
type: Class
subclass of: Ignition System
definition: An Ignition System that is designed to generate heat by compressing a portion of fuel and oxidizer mixture in order to initiate an Ignition process.
ont00001760: Artifact Ontology

Railway
type: Class
subclass of: Land Transportation Artifact
definition: A Land Transportation Artifact that is designed to enable Trains to transport passengers and goods.
ont00001754: https://en.wikipedia.org/w/index.php
ont00001760: Artifact Ontology

Portion of Material
type: Class
subclass of: Portion of Processed Material
definition: A Portion of Processed Material that was produced to be used as the input for another Act of Material Artifact Processing.
ont00001760: Artifact Ontology

Coupling
type: Class
subclass of: Material Artifact
definition: A Material Artifact that is designed to connect two Shafts together at their ends for the purpose of transmitting power.
ont00001754: https://en.wikipedia.org/w/index.php
ont00001760: Artifact Ontology

Orientation Control Artifact Function
type: Class
subclass of: Artifact Function
definition: An Artifact Function that is realized by processes in which some Material Artifact is used to control the Orientation of some object.
ont00001760: Artifact Ontology

Armored Personnel Carrier
type: Class
subclass of: Armored Fighting Vehicle
definition: An Armored Fighting Vehicle that is designed to transport infantry to the battlefield but which are not usually designed to take part in a direct-fire battle.
ont00001753: APC
ont00001754: https://en.wikipedia.org/w/index.php
ont00001760: Artifact Ontology

Material Copy of a Academic Degree
type: Class
subclass of: Material Copy of a Certificate
subclass of: Restriction
  on property: BFO_0000101
  some values from: ont00002003
alternative label: Academic Degree
definition: A Material Copy of a Certificate that is issued by an Educational Organization to a Person to indicate that the Person has satisfactorily completed a course of study, or as an honorary recognition of the Person's achievement.
ont00001754: http://www.dictionary.com/browse/degree
ont00001760: Artifact Ontology

Material Copy of a Warning Message
type: Class
subclass of: Material Copy of a Notification Message
subclass of: Restriction
  on property: BFO_0000101
  some values from: ont00002011
alternative label: Warning Message
definition: A Material Copy of a Notification Message that is designed to carry an Information Content Entity that describes a possible or impending threat.
ont00001760: Artifact Ontology

Portion of Cash
type: Class
subclass of: Financial Instrument
definition: A Financial Instrument that is designed to be a ready medium of exchange.
ont00001760: Artifact Ontology

Fuel Cell
type: Class
subclass of: Electrical Power Source
definition: An Electrical Power Source that consists in part of an anode, a cathode, and an electrolyte; converts chemical energy from a fuel into electricity through a chemical reaction of positively charged hydrogen ions with an oxidizing agent (typically oxygen); and, if given a continuous source of fuel and oxidizing agent, can continuously produce electricity.
scope note: A Fuel Cell differs from a Battery in that it requires a continuous source of fuel and oxygen to sustain the chemical reaction, whereas a Battery only uses chemicals already stored inside it.
ont00001754: https://en.wikipedia.org/w/index.php
ont00001760: Artifact Ontology

Life Support Artifact Function
type: Class
subclass of: Artifact Function
definition: An Artifact Function that is realized during events in which a Material Artifact materially affects an organism, where this causes that organism to continue living in a situation where death would otherwise occur.
ont00001760: Artifact Ontology

Research and Development Artifact Function
type: Class
subclass of: Service Artifact Function
definition: A Service Artifact Function that is realized in processes of producing new knowledge or of devising new applications of existing knowledge.
ont00001754: https://en.wikipedia.org/w/index.php
ont00001760: Artifact Ontology

Synthetic Aperture Radar Imaging Artifact Function
type: Class
subclass of: Radar Imaging Artifact Function
definition: A Radar Imaging Artifact Function that inheres in Material Artifacts that are designed to produce visual representations of entities using the motion of a radar antenna over a targeted region to create a synthetic aperture.
ont00001760: Artifact Ontology

Tripod
type: Class
subclass of: Material Artifact
definition: A Material Artifact that consists of three legs and a platform that joins them and which is designed to support the weight and maintain the stability of objects that are attached to or rested on the platform.
ont00001754: https://en.wikipedia.org/w/index.php
ont00001760: Artifact Ontology

Detonating Artifact Function
type: Class
subclass of: Artifact Function
definition: An Artifact Function that is realized in processes of combustion involving a supersonic exothermic front accelerating through a medium that eventually drives a shock front propagating directly in front of it.
ont00001754: https://en.wikipedia.org/w/index.php
ont00001760: Artifact Ontology

Material Copy of a Code List
type: Class
subclass of: Material Copy of a List
subclass of: Restriction
  on property: BFO_0000101
  some values from: ont00002008
alternative label: Code List
definition: A Material Copy of a List that contains an ordered sequence of Information Bearing Entities that carry Code Identifiers.
ont00001760: Artifact Ontology

Radio Communication Interference Artifact Function
type: Class
subclass of: Communication Interference Artifact Function
definition: A Communication Interference Artifact Function that is realized during events in which a Material Artifact is used to interfere with the transmission of information via radio waves.
ont00001760: Artifact Ontology

Wire Antenna
type: Class
subclass of: Radio Antenna
definition: A Radio Antenna that consists primarily of a length of wire.
ont00001760: Artifact Ontology

Optical Processing Artifact Function
type: Class
subclass of: Artifact Function
definition: An Artifact Function that is realized by a Material Artifact participating in a visible light processing event.
ont00001760: Artifact Ontology

Pneumatic Power Source
type: Class
subclass of: Power Source
definition: A Power Source that is designed to generate, control, or transmit power by means of compressed air or compressed inert gases.
ont00001760: Artifact Ontology

Pulsejet Engine
type: Class
subclass of: Air-Breathing Jet Engine
alternative label: Pulse Jet
alternative label: Pulsejet
definition: An Air-Breathing Jet Engine that is capable of operating statically and uses intermittent (pulsing) Combustion of the fuel-oxidizer mixture before expelling the exhaust out through the rear Propelling Nozzle to generate Thrust.
ont00001754: https://en.wikipedia.org/w/index.php
ont00001760: Artifact Ontology

Air Conditioning Unit
type: Class
subclass of: Cooling System
alternative label: AC Unit
definition: A Cooling System that is designed to remove excess heat and humidity from the air in an enclosed space.
ont00001754: https://en.wikipedia.org/w/index.php
ont00001760: Artifact Ontology

Gamma-ray Telescope
type: Class
subclass of: Telescope
definition: A Telescope that is designed to aid in the observation of spatially distant Objects by means of collecting and focusing Gamma-rays to form an enhanced image of the Object.
ont00001754: https://en.wikipedia.org/w/index.php
ont00001760: Artifact Ontology

Jet Engine
type: Class
subclass of: Reaction Engine
definition: A Reaction Engine that discharges a fast moving jet that generates Thrust by jet propulsion.
scope note: Some (most) jet engines utilize turbines, but some do not. Most rocket engines do not utilize turbines, but some do.
ont00001754: https://en.wikipedia.org/w/index.php
ont00001760: Artifact Ontology

Cutting Artifact Function
type: Class
subclass of: Damaging Artifact Function
definition: A Damaging Artifact Function that is realized in a process in which the structural integrity of an entity is impaired by being opened or divided.
ont00001754: http://www.dictionary.com/browse/cutting
ont00001760: Artifact Ontology

Bond Certificate
type: Class
subclass of: Bond
definition: A Bond that consists of a Certificate.
ont00001760: Artifact Ontology

Financial Instrument
type: Class
subclass of: Material Artifact
definition: A Material Artifact that is designed to be a tradeable asset and that is legally sanctioned.
ont00001754: https://en.wikipedia.org/w/index.php
ont00001760: Artifact Ontology

Defoliant Artifact Function
type: Class
subclass of: Herbicide Artifact Function
definition: An Herbicide Artifact Function that is realized in a process that causes a plant to lose its leaves.
ont00001754: https://en.wikipedia.org/w/index.php
ont00001760: Artifact Ontology

Telescope
type: Class
subclass of: Imaging Instrument
definition: An Imaging Instrument that is designed to aid in the observation of spatially distant Objects by means of collecting and focusing Electromagnetic Radiation to form an enhanced image of the Object.
ont00001754: https://en.wikipedia.org/w/index.php
ont00001760: Artifact Ontology

Water Transportation Artifact
type: Class
subclass of: Transportation Artifact
definition: A Transportation Artifact that facilitates the movement of Agents and Vehicles via water.
ont00001760: Artifact Ontology

Explosive Weapon
type: Class
subclass of: Weapon
subclass of: Restriction
  on property: BFO_0000196
  some values from: Explosive Artifact Function
definition: A Weapon that is designed to inflict harm, damage, or incapacity by means of a violent release of energy caused by the exothermic reaction of an explosive material.
ont00001754: https://en.wikipedia.org/w/index.php
ont00001760: Artifact Ontology

Payload
type: Class
subclass of: BFO_0000040
definition: A Material Entity that is transported by a Vehicle during an Act of Location Change for the purpose of being delivered to or performing one or more functions at a predefined location.
scope note: Depending on the nature of the Flight or Mission, the Payload of a Vehicle may include cargo, passengers, flight crew, munitions, scientific instruments or experiments, or other equipment. Extra fuel, when optionally carried, is also considered part of the payload.
scope note: In each case, the Payload is what provides the immediate reason for performing the Act of Location Change (e.g. transporting the passengers of a commercial airline flight to their destination; transporting food, fuel, oxygen, research equipment, and spare parts to the International Space Station; or conveying an array of sensors, cameras, and communications systems so they can operate during a Sun-Synchronous Earth Orbit).
ont00001754: https://en.wikipedia.org/w/index.php
ont00001760: Artifact Ontology

Dam
type: Class
subclass of: Material Artifact
definition: A Material Artifact that is designed to impound surface water or underground streams.
ont00001754: https://en.wikipedia.org/w/index.php
ont00001760: Artifact Ontology

Sensor
type: Class
equivalent class: Class
  intersection of: BFO_0000040
  intersection of: Restriction
    on property: BFO_0000196
    some values from: Class
      union of: Sensor Function
      union of: Sensor Role
subclass of: BFO_0000040
definition: A Material Entity that bears a Sensor Function or Sensor Role.
ont00001754: https://en.wikipedia.org/w/index.php
ont00001760: Artifact Ontology

Article of Solid Waste
type: Class
subclass of: Portion of Waste Material
definition: A Portion of Waste Material that has a low liquid content.
ont00001754: https://stats.oecd.org/glossary/detail.asp
ont00001760: Artifact Ontology

Quality Specification
type: Class
equivalent class: Class
  intersection of: ont00000965
  intersection of: Restriction
    on property: ont00001942
    some values from: BFO_0000019
subclass of: ont00000965
definition: A Prescriptive Information Content Entity that prescribes some Quality.
ont00001760: Artifact Ontology

Power Rectifier
type: Class
subclass of: Material Artifact
definition: A Material Artifact that is designed to convert alternating current (AC) to direct current (DC).
ont00001754: https://en.wikipedia.org/w/index.php
ont00001760: Artifact Ontology

Tool
type: Class
subclass of: Material Artifact
definition: A Material Artifact that is designed to assist in the performance of manual or mechanical work and not to be consumed in that process.
ont00001754: https://en.wikipedia.org/w/index.php
ont00001760: Artifact Ontology

Controllable Pitch Propeller
type: Class
subclass of: Propeller
alternative label: Variable-Pitch Propeller
definition: A Propeller whose blades are designed to be alterable by rotating the blades about their vertical axis by means of mechanical or hydraulic arrangement.
ont00001754: https://en.wikipedia.org/w/index.php
ont00001760: Artifact Ontology

Artifact Location
type: Class
equivalent class: Class
  intersection of: BFO_0000029
  intersection of: Restriction
    on property: BFO_0000124
    some values from: Material Artifact
subclass of: BFO_0000029
definition: A Site that is the location of some Material Artifact.
ont00001760: Artifact Ontology

Portion of Propellant
type: Class
subclass of: Portion of Material
definition: A Portion of Material that is designed to be used as an input in a Propulsion Process to produce Thrust.
ont00001760: Artifact Ontology

Material Copy of a Instrument Display Panel
type: Class
subclass of: Information Bearing Artifact
alternative label: Instrument Display Panel
definition: An Information Bearing Artifact that is designed to carry information about some Material Artifact that is derived by the instrumentation Sensors of that Material Artifact.
ont00001754: https://en.wikipedia.org/w/index.php
ont00001760: Artifact Ontology

Valve
type: Class
subclass of: Fluid Control Artifact
definition: A Fluid Control Artifact that is designed to regulate, direct, or control the flow of fluid by opening, closing, or partially obstructing the fluid from moving along a passageway.
ont00001754: https://en.wikipedia.org/w/index.php
ont00001760: Artifact Ontology

Legal Artifact Function
type: Class
subclass of: Service Artifact Function
definition: A Service Artifact Function that is realized in processes of giving legal advice to clients drafting legal documents for clients and representing clients in legal negotiations and court proceedings such as lawsuits.
ont00001754: https://en.wikipedia.org/w/index.php
ont00001760: Artifact Ontology

Imaging Artifact Function
type: Class
subclass of: Artifact Function
definition: An Artifact Function that inheres in Material Artifacts that are designed to create one or more new Images.
ont00001760: Artifact Ontology

Navigation Artifact Function
type: Class
subclass of: Artifact Function
definition: An Artifact Function that is realized during events in which a Material Artifact is used to determine the precise location of itself or another object and plan a route to a specified destination.
ont00001760: Artifact Ontology

Truck
type: Class
subclass of: Ground Motor Vehicle
definition: A Ground Motor Vehicle that is designed to be used to transport cargo.
scope note: Trucks vary greatly in their size and power -- ranging from small ultra-light trucks to enormous heavy trucks. Trucks also vary greatly in their configurations -- ranging from very basic flatbeds or box trucks to highly specialized cargo carriers. Trucks may also be configured to mount specialized equipment, such as in the case of fire trucks, concrete mixers, and suction excavators.
ont00001754: https://en.wikipedia.org/w/index.php
ont00001760: Artifact Ontology

Infrared Camera
type: Class
subclass of: Camera
alternative label: Thermal Imaging Camera
alternative label: Thermographic Camera
definition: A Camera that is designed to form and record an image generated from infrared radiation.
ont00001754: https://en.wikipedia.org/w/index.php
ont00001760: Artifact Ontology

Ground Vehicle
type: Class
subclass of: Vehicle
definition: A Vehicle that is designed to convey passengers, cargo, or equipment from one location to another by some form of ground travel.
ont00001754: https://en.wikipedia.org/w/index.php
ont00001760: Artifact Ontology

Impact Shielding Artifact Function
type: Class
subclass of: Artifact Function
definition: An Artifact Function that is realized during events in which a Material Artifact reduces the damage caused to the shielded object by an impact with another object.
ont00001760: Artifact Ontology

Material Copy of a Report
type: Class
subclass of: Material Copy of a Document
subclass of: Restriction
  on property: BFO_0000101
  some values from: ont00002043
alternative label: Report
definition: A Material Copy of a Document that is designed to carry some specific Information Content Entity that conveys an account of some event, situation, or the result of some observation or inquiry.
ont00001754: https://en.wikipedia.org/w/index.php
ont00001760: Artifact Ontology

Nozzle Throat
type: Class
subclass of: Fluid Control Artifact
definition: A Fluid Control Artifact that consists of the narrowest portion of a Nozzle that is designed to converge the flow of fluid in order to increase the Velocity of the flow.
ont00001760: Artifact Ontology

Infrastructure Element
type: Class
equivalent class: Class
  intersection of: BFO_0000040
  intersection of: Restriction
    on property: BFO_0000196
    some values from: Infrastructure Role
subclass of: BFO_0000040
definition: A Material Entity that bears an Infrastructure Role.
ont00001760: Artifact Ontology

Deception Artifact Function
type: Class
subclass of: Artifact Function
definition: An Artifact Function that is realized in processes which misinform or mislead some other entity.
ont00001754: https://en.wikipedia.org/w/index.php
ont00001760: Artifact Ontology

Steam Engine
type: Class
subclass of: External Combustion Engine
definition: An External Combustion Engine that is designed to use steam as its working fluid.
ont00001754: https://en.wikipedia.org/w/index.php
ont00001760: Artifact Ontology

Refraction Artifact Function
type: Class
subclass of: Artifact Function
definition: An Artifact Function that is realized by a Material Artifact participating in a refraction event in which the Material Artifact causes a change in direction of wave propagation due to a change in its transmission medium.
ont00001760: Artifact Ontology

Portion of Gaseous Propellant
type: Class
subclass of: Portion of Propellant
definition: A Portion of Propellant that is stored in a gaseous state.
ont00001760: Artifact Ontology

Heat Engine
type: Class
subclass of: Engine
definition: An Engine that is designed to convert thermal energy into mechanical energy.
ont00001760: Artifact Ontology

Material Copy of a Email Message
type: Class
subclass of: Material Copy of a Message
subclass of: Restriction
  on property: BFO_0000101
  some values from: ont00002012
alternative label: Email Message
definition: A Material Copy of a Message that is transmitted to the recipient's Email Box.
ont00001754: https://en.wikipedia.org/w/index.php
ont00001760: Artifact Ontology

Highway
type: Class
subclass of: Road
definition: A Road that is designed to enable Ground Vehicles to travel on routes that connect relatively major destinations.
ont00001754: https://en.wikipedia.org/w/index.php
ont00001760: Artifact Ontology

Ground Moving Target Indication Artifact Function
type: Class
subclass of: Moving Target Indication Artifact Function
definition: A Moving Target Indication Artifact Function that inheres in Material Artifacts that are designed to identify and track entities moving on or near the ground.
ont00001760: Artifact Ontology

Containing Artifact Function
type: Class
subclass of: Artifact Function
definition: An Artifact Function that is realized in a process in which one entity contains another.
ont00001754: http://www.dictionary.com/browse/containing
ont00001760: Artifact Ontology

Decoy
type: Class
subclass of: Material Artifact
definition: A Material Artifact that is designed to distract or conceal what an individual or group might be looking for.
ont00001754: https://en.wikipedia.org/w/index.php
ont00001760: Artifact Ontology

Radiological Weapon
type: Class
subclass of: Weapon
definition: A Weapon that is designed to inflict harm, damage, or incapacity by means of releasing radioactive material.
ont00001754: https://en.wikipedia.org/w/index.php
ont00001760: Artifact Ontology

Distance Measurement Artifact Function
type: Class
subclass of: Measurement Artifact Function
definition: A Measurement Artifact Function that is realized during events in which a Material Artifact is used to measure the spatial Distance to a specified object or class of objects.
ont00001760: Artifact Ontology

Missile Launcher
type: Class
subclass of: Projectile Launcher
definition: A Projectile Launcher that is designed to launch one or more Precision-Guided Missiles.
ont00001760: Artifact Ontology

Government Artifact Function
type: Class
subclass of: Service Artifact Function
definition: A Service Artifact Function that is realized in processes in which public policy is administered and the actions of its members are directed.
ont00001754: https://en.wikipedia.org/w/index.php
ont00001760: Artifact Ontology

Power Transmission Artifact
type: Class
subclass of: Material Artifact
definition: A Material Artifact that is designed to transfer and regulate Power flow from a Power Source to an application point.
ont00001760: Artifact Ontology

Cleaning Artifact Function
type: Class
subclass of: Artifact Function
definition: An Artifact Function that is realized in processes in which some Material Artifact is used to remove foreign objects from another object.
ont00001760: Artifact Ontology

Battery Terminal
type: Class
subclass of: Material Artifact
definition: A Material Artifact that is designed to connect a load or charger to a single or multiple-cell Battery.
ont00001754: https://en.wikipedia.org/w/index.php
ont00001760: Artifact Ontology

Anti-Bacterial Artifact Function
type: Class
subclass of: Anti-Microbial Artifact Function
definition: An Anti-Microbial Artifact Function that is realized in a process which causes harm to, or the death of, some bacterium.
ont00001754: https://en.wikipedia.org/w/index.php
ont00001760: Artifact Ontology

Prosthetic Foot
type: Class
subclass of: Prosthesis
definition: A Prosthesis that is designed to replace a missing foot.
ont00001754: https://en.wikipedia.org/w/index.php
ont00001760: Artifact Ontology

Voltage Regulating Artifact Function
type: Class
subclass of: Electrical Artifact Function
definition: An Artifact Function that is realized by processes in which some Material Artifact is used to cause a change in the voltage magnitude between the sending and receiving end of an electrical component.
ont00001754: https://en.wikipedia.org/w/index.php
ont00001760: Artifact Ontology

Attitude Control Artifact Function
type: Class
subclass of: Artifact Function
alternative label: Orientation Control Artifact Function
definition: An Artifact Function that is realized by a Material Artifact participating in an attitude control process.
ont00001760: Artifact Ontology

External Navigation Lighting System
type: Class
subclass of: Lighting System
definition: A Lighting System that is designed to be attached to some Vehicle and to emit colored light in order to signal that Vehicle's position, heading, and status.
ont00001754: https://en.wikipedia.org/w/index.php
ont00001760: Artifact Ontology

Mirror
type: Class
subclass of: Optical Instrument
definition: An Optical Instrument that is designed to reflect light that has a wavelength within a given range and is incident on its relflecting surface such that the reflected light maintains most of the characteristics of the original light.
ont00001754: https://en.wikipedia.org/w/index.php
ont00001760: Artifact Ontology

Turbofan Air-Breathing Jet Engine
type: Class
subclass of: Air-Breathing Jet Engine
definition: An Air-Breathing Jet Engine that uses a Turbofan, which consists of a Turbine and a Fan.
ont00001754: https://en.wikipedia.org/w/index.php
ont00001760: Artifact Ontology

Switch Artifact Function
type: Class
subclass of: Artifact Function
definition: An Artifact Function that is realized in a process of breaking an electric circuit by interrupting the current or diverting it from one conductor to another.
ont00001754: https://en.wikipedia.org/w/index.php
ont00001760: Artifact Ontology

Telecommunication Instrument
type: Class
subclass of: Communication Instrument
definition: A Communication Instrument that is designed for use by some Agent in some Act of Communication where the recipient of that communication is potentially a significant distance away from the Agent.
ont00001760: Artifact Ontology

Fuel Tank
type: Class
subclass of: Container
definition: A Container that is designed to store a Portion of Fuel.
ont00001760: Artifact Ontology

Mass Specification
type: Class
subclass of: Quality Specification
definition: A Quality Specification that prescribes the Amount of Mass that a Material Entity should have.
ont00001760: Artifact Ontology

Nozzle Mouth
type: Class
subclass of: Fluid Control Artifact
definition: A Fluid Control Artifact that consists of the portion of a Nozzle at the end that is designed to be where the flow of fluid exits the Nozzle.
ont00001760: Artifact Ontology

Convergent-Divergent Nozzle
type: Class
subclass of: Nozzle
alternative label: CD Nozzle
alternative label: de Laval Nozzle
definition: A Nozzle that consists of a tube with an asymmetric hourglass shape that is designed to accelerate hot pressurized gas by converting the heat energy of the gas flow into kinetic energy as it passes through the Nozzle Throat to generate increased Exhaust Velocity of the gas as it exits the Nozzle.
scope note: By increasing the Exhaust Velocity of the gas, the Nozzle increases the Thrust generated.
ont00001754: https://en.wikipedia.org/w/index.php
ont00001760: Artifact Ontology

Computer Network
type: Class
subclass of: Telecommunication Network
alternative label: Data Network
definition: A Telecommunication Network that is designed to allow the exchange of data between two or more computers connected to the network.
ont00001754: https://en.wikipedia.org/w/index.php
ont00001760: Artifact Ontology

Wire Receiver
type: Class
subclass of: Radio Receiver
definition: A Radio Receiver that uses a Wire Antenna to intercept radio signals.
ont00001760: Artifact Ontology

Material Copy of an Image
type: Class
subclass of: Information Bearing Artifact
subclass of: Restriction
  on property: BFO_0000101
  some values from: ont00002004
alternative label: Image
definition: An Information Bearing Artifact that is designed to carry an Information Content Entity that represents some entity owing to a visual isomorphism between the carrying artifact and the entity.
ont00001754: https://en.wikipedia.org/w/index.php
ont00001760: Artifact Ontology

Material Copy of a System Clock
type: Class
subclass of: Material Copy of a Timekeeping Instrument
alternative label: System Clock
definition: A Material Copy of a Timekeeping Instrument that is part of a computer and is designed to issue a steady high-frequency signal that is used to synchronize all of the computer's internal components.
ont00001754: http://www.thefreedictionary.com/system+clock
ont00001760: Artifact Ontology

Constructed Tunnel
type: Class
subclass of: Transportation Artifact
definition: A Transportation Artifact that is designed to be substantially enclosed, have access constrained to portals, and to enable travel through surrounding soil, earth, or rock formation.
scope note: This class is not intended to include natural tunnels, such as caves.
ont00001754: Federal Highway Administration. Guidance on Structures Subject to the National Tunnel Inspection Standards (NTIS). United States Department of Transportation, 27 Oct. 2015
ont00001760: Artifact Ontology

Terminal Board
type: Class
subclass of: Material Artifact
definition: A Material Artifact that is designed to join electrical terminations and create an electrical circuit by means of a block which connects individual wires without a splice or physically joining the ends.
ont00001754: https://en.wikipedia.org/w/index.php
ont00001760: Artifact Ontology

Visual Prosthesis
type: Class
subclass of: Artificial Eye
alternative label: Bionic Eye
definition: An Artificial Eye that is designed to replace a missing eye, which performs the function of an eye.
ont00001754: https://en.wikipedia.org/w/index.php
ont00001760: Artifact Ontology

Semi-automatic Pistol
type: Class
subclass of: Hand Gun
definition: A Hand Gun that has a single fixed firing chamber machined into the rear of the barrel and an ammunition magazine capable of holding multiple Cartridges such that the Hand Gun is designed to automatically reload each time it is fired and to fire a Bullet with each successive pull of the trigger until the stored ammunition is depleted.
ont00001754: https://en.wikipedia.org/w/index.php
ont00001760: Artifact Ontology

Vehicle
type: Class
subclass of: Material Artifact
definition: A Material Artifact that is designed to facilitate the movement of material entities from one location to another by conveying them there.
ont00001754: https://en.wikipedia.org/w/index.php
ont00001760: Artifact Ontology

Horn Antenna
type: Class
subclass of: Radio Antenna
alternative label: Microwave Horn
definition: A Radio Antenna that consists of a flaring metal waveguide shaped like a horn to direct radio waves in a beam and can be used on its own or as a feeder for larger antenna structures, such as Parabolic Antennas.
ont00001754: https://en.wikipedia.org/w/index.php
ont00001760: Artifact Ontology

Prosthesis
type: Class
subclass of: Medical Artifact
definition: A Medical Artifact that is designed to replace a missing body part.
ont00001754: https://en.wikipedia.org/w/index.php
ont00001760: Artifact Ontology

Electric Battery
type: Class
subclass of: Electrical Power Source
alternative label: Battery
definition: An Electrical Power Source that is designed to produce electric power by converting chemical energy to electrical energy.
ont00001754: https://en.wikipedia.org/wiki/Battery_(electricity)
ont00001760: Artifact Ontology

Counterfeit Instrument
type: Class
subclass of: Material Artifact
definition: A Material Artifact that is designed to be a fake replica of some genuine Material Artifact.
ont00001754: https://en.wikipedia.org/w/index.php
ont00001760: Artifact Ontology

Cryogenic Storage Dewar
type: Class
subclass of: Container
definition: A Container that is designed to store a Portion of Cryogenic Material (such as liquid helium or liquid oxygen) and which consists of, minimally, walls that are constructed from two or more layers that are separated by a high vacuum to provide thermal insulation between the interior and exterior of the dewar.
ont00001754: https://en.wikipedia.org/w/index.php
ont00001760: Artifact Ontology

Polarizing Prism
type: Class
subclass of: Prism
definition: A Prism designed to split a beam of light entering the Prism into components of varying polarization.
ont00001760: Artifact Ontology

Vehicle Control System
type: Class
subclass of: Control System
definition: A Control System that is designed to enable some Agent to control some Vehicle.
ont00001760: Artifact Ontology

Parabolic Antenna
type: Class
subclass of: Radio Antenna
alternative label: Dish Antenna
alternative label: Parabolic Dish
definition: A Radio Antenna that uses a parabolic reflector to direct or receive radio waves and has a very high gain.
ont00001754: https://en.wikipedia.org/w/index.php
ont00001760: Artifact Ontology

Communication Artifact Function
type: Class
subclass of: Artifact Function
definition: An Artifact Function that is realized in a process in which meaningful signs are conveyed from one entity to another.
ont00001760: Artifact Ontology

Submillimeter Wavelength Radio Telescope
type: Class
subclass of: Radio Telescope
alternative label: Microwave Telescope
definition: A Radio Telescope that is designed to aid in the observation of spatially distant Objects by means of collecting and focusing radio waves from the submillimeter waveband (i.e. microwaves) to form an enhanced image of the Object.
scope note: The submillimeter waveband is between the far-infrared and microwave wavebands and is typically taken to have a wavelength of between a few hundred micrometers and a millimeter.
ont00001754: http://kp12m.as.arizona.edu/docs/what_is_submillimeter.htm, https://en.wikipedia.org/wiki/Submillimetre_astronomy
ont00001760: Artifact Ontology

Hydraulic Power Transfer Unit
type: Class
subclass of: Material Artifact
definition: A Material Artifact that is designed to transfer hydraulic power from one of an Aircraft's hydraulic systems to another in the event that a system has failed or been turned off.
ont00001754: https://en.wikipedia.org/w/index.php
ont00001760: Artifact Ontology

Explosive Land Mine
type: Class
subclass of: Explosive Mine
alternative label: Land Mine
definition: An Explosive Mine that is designed to be concealed under or on the ground.
ont00001754: https://en.wikipedia.org/w/index.php
ont00001760: Artifact Ontology

Transducer
type: Class
subclass of: Material Artifact
definition: A Material Artifact that is designed to convert one form of energy to another.
ont00001754: https://en.wikipedia.org/w/index.php
ont00001760: Artifact Ontology

Resource
type: Class
subclass of: BFO_0000002
definition: A Continuant that is owned by, in the possession of, or is otherwise controlled by an Agent such that it could be used by that Agent.
example: a group of interns
example: a knowledge base
example: a plot of land
example: a software program
example: a sum of money
example: a vehicle
scope note: Resources are Resources for some Agent. If no instance of Agent existed, no instance of Resource would exist either. It is not a requirement that something be valuable in order for it to be a Resource. Thus the value of something can drastically change without altering whether that thing is a Resource.
scope note: This class is designed to group continuants according to a very broad criterion and is not intended to be used as a parent class for entities that can be more specifically represented under another class. Hence, Natural Resource may be an appropriate subtype but Money, Oil, and Gold Mine are not.
ont00001760: Artifact Ontology

Ignition System
type: Class
subclass of: Material Artifact
definition: A Material Artifact that is designed to produce an Ignition process.
ont00001760: Artifact Ontology

Material Copy of a Chart
type: Class
subclass of: Material Copy of an Image
subclass of: Restriction
  on property: BFO_0000101
  some values from: ont00002005
alternative label: Chart
definition: A Material Copy of an Image that is designed to carry some Representational Information Content Entity that is prescribed by some canonical visual format.
ont00001754: Adapted from “Chart.” Merriam-Webster.com Dictionary, Merriam-Webster, https://www.merriam-webster.com/dictionary/chart. Accessed 4 Aug. 2024.
ont00001760: Artifact Ontology

Combustion Engine
type: Class
subclass of: Heat Engine
definition: A Heat Engine that is designed to convert thermal energy that is generated through a local Combustion process into mechanical energy.
ont00001760: Artifact Ontology

Canal
type: Class
subclass of: Water Transportation Artifact
definition: A Water Transportation Artifact that is an artificial Hydrographic Feature designed to convey water or enable Watercraft to travel inland.
ont00001754: https://en.wikipedia.org/w/index.php
ont00001760: Artifact Ontology

Bullet
type: Class
subclass of: Portion of Ammunition
definition: A Portion of Ammunition that is designed to be projected by a Firearm, Sling, Slingshot, or Air Gun, but which does not (typically) contain explosives.
ont00001754: https://en.wikipedia.org/w/index.php
ont00001760: Artifact Ontology

Material Copy of a Database
type: Class
subclass of: Information Bearing Artifact
subclass of: Restriction
  on property: BFO_0000101
  some values from: ont00002006
alternative label: Database
definition: An Information Bearing Artifact that is designed to carry some set of specific Information Content Entities and to be rapidly searchable and retrievable.
ont00001754: https://en.wikipedia.org/w/index.php
ont00001760: Artifact Ontology

Component Role
type: Class
subclass of: BFO_0000023
definition: A Role that inheres in an entity having a discrete structure in virtue of that entity being part of a system considered at a particular level of analysis.
ont00001754: ISO/IEC. 1998. Information Technology ― System and Software Integrity Levels Geneva, Switzerland: International Organization for Standardization (ISO)/International Electrotechnical Commission (IEC). ISO/IEC. 15026:1998. : 3.1
ont00001760: Artifact Ontology

Fungicide Artifact Function
type: Class
subclass of: Anti-Microbial Artifact Function
definition: An Anti-Microbial Artifact Function that is realized in a process which causes harm to, or the death of, some fungus or fungal spore.
ont00001754: https://en.wikipedia.org/w/index.php
ont00001760: Artifact Ontology

Optical Focusing Artifact Function
type: Class
subclass of: Optical Processing Artifact Function
definition: An Optical Processing Artifact Function that is realized by a Material Artifact participating in a light focusing event in which the Material Artifact causes the light beam to converge on a target spatial point.
ont00001760: Artifact Ontology

Lubrication System
type: Class
subclass of: Material Artifact
definition: A Material Artifact that is designed to contain, transfer, and regulate the flow of lubricant to multiple locations in a Material Artifact.
scope note: A Lubrication System typical consists of a reservoir, pump, heat exchanger, filter, regulator, valves, sensors, pipes, and hoses. In some cases it also includes the passageways and openings within the artifact it is designed to lubricate. For example, the oil holes in a bearing and crankshaft.
ont00001760: Artifact Ontology

Imaging Instrument
type: Class
equivalent class: Class
  intersection of: Material Artifact
  intersection of: Restriction
    on property: BFO_0000196
    some values from: Imaging Artifact Function
subclass of: Material Artifact
definition: A Material Artifact that is designed to bear an Imaging Artifact Function.
ont00001760: Artifact Ontology

Video Camera
type: Class
subclass of: Camera
definition: A Camera that is designed to form and digitally or physically record a continuous stream of subsequent images of an entity or scene such that the images can be played back in succession as a video.
ont00001760: Artifact Ontology

Locomotive
type: Class
subclass of: Rail Transport Vehicle
definition: A Rail Transport Vehicle that is designed to provide the motive power for a Train.
ont00001754: https://en.wikipedia.org/w/index.php
ont00001760: Artifact Ontology

Signal Detection Artifact Function
type: Class
subclass of: Artifact Function
definition: An Artifact Function that is realized in the process of discerning between information-bearing patterns and random patterns, or noise, that distract from the information.
ont00001754: https://en.wikipedia.org/w/index.php
ont00001760: Artifact Ontology

Hydraulic Motor
type: Class
subclass of: Physically Powered Engine
definition: A Physically Powered Engine that converts hydraulic pressure and flow into torque and angular displacement.
ont00001754: https://en.wikipedia.org/w/index.php
ont00001760: Artifact Ontology

Control System
type: Class
subclass of: Material Artifact
definition: A Material Artifact that is designed to manage, command, direct, or regulate the behavior of at least one other Material Artifact.
ont00001754: https://en.wikipedia.org/w/index.php
ont00001760: Artifact Ontology

Radio Repeater
type: Class
subclass of: Radio Transceiver
definition: A Radio Transceiver that is designed to receive a radio signal, amplify it, and retransmit it (often on another frequency).
ont00001754: https://en.wikipedia.org/w/index.php
ont00001760: Artifact Ontology

Turbine Steam Engine
type: Class
subclass of: Steam Engine
alternative label: Steam Turbine
definition: A Steam Engine that is designed to extract thermal energy from pressurized steam and use it to do mechanical work on a rotating output shaft.
ont00001754: https://en.wikipedia.org/w/index.php
ont00001760: Artifact Ontology

Direct Current Power Source
type: Class
subclass of: Electrical Power Source
definition: An Electrical Power Source that is designed to transfer electrical power in the form of direct current.
ont00001760: Artifact Ontology

Chemical Reaction Artifact Function
type: Class
subclass of: Artifact Function
definition: An Artifact Function that is realized in a process that leads to the transformation of one set of chemical substances to another.
ont00001754: https://en.wikipedia.org/w/index.php
ont00001760: Artifact Ontology

Catadioptric Optical Telescope
type: Class
subclass of: Optical Telescope
alternative label: Catadioptric Telescope
definition: An Optical Telescope that is designed to aid in the observation of spatially distant Objects by means of collecting and focusing visible light through the use of a combination of Lenses and Mirrors to form an enhanced image of the Object.
ont00001754: https://en.wikipedia.org/w/index.php
ont00001760: Artifact Ontology

Fuel Ventilation System
type: Class
subclass of: Fluid Control Artifact
definition: A Fluid Control Artifact that is designed to allow air into the Fuel Tank to take the place of burned fuel.
ont00001754: https://en.wikipedia.org/w/index.php
ont00001760: Artifact Ontology

Electrical Conduction Artifact Function
type: Class
subclass of: Electrical Artifact Function
definition: An Electrical Artifact Function that is realized by a Material Artifact being used to conduct an electric current.
ont00001760: Artifact Ontology

Rail Transport Vehicle
type: Class
subclass of: Ground Vehicle
definition: A Ground Vehicle that is designed to convey cargo, passengers, or equipment by Railway.
ont00001754: https://en.wikipedia.org/w/index.php
ont00001760: Artifact Ontology

Information Bearing Artifact
type: Class
subclass of: Material Artifact
subclass of: Restriction
  on property: BFO_0000101
  some values from: ont00000958
subclass of: Restriction
  on property: BFO_0000176
  some values from: Information Medium Artifact
alternative label: Information Carrying Artifact
definition: A Material Artifact that carries an Information Content Entity and is designed to do so using a particular format or structure.
scope note: This class continues to use the word ‘bearing’ in its rdfs:label for legacy reasons. It should be understood that all instances of this class are carriers of information content entities and only, strictly speaking, a bearer of their concretizations.
ont00001760: Artifact Ontology

Material Copy of a List
type: Class
subclass of: Information Bearing Artifact
subclass of: Restriction
  on property: BFO_0000101
  some values from: ont00002007
alternative label: List
definition: An Information Bearing Artifact that consists of one or more Information Bearing Artifacts that carry Information Content Entities and are the subjects of some Sequence Position Ordinality.
ont00001754: https://en.wikipedia.org/w/index.php
ont00001760: Artifact Ontology

Prism
type: Class
subclass of: Optical Instrument
definition: An Optical Instrument that is designed to refract light and which consists of a transparent material with flat polished surfaces where at least two of these surfaces have an angle between them.
ont00001754: https://en.wikipedia.org/w/index.php
ont00001760: Artifact Ontology

Power Tool
type: Class
subclass of: Tool
definition: A Tool that is designed to be actuated by a Power Source and mechanism other than or in addition to manual labor.
ont00001754: https://en.wikipedia.org/w/index.php
ont00001760: Artifact Ontology

Compression Ignition Engine
type: Class
subclass of: Internal Combustion Engine
definition: An Internal Combustion Engine that is designed to operate by igniting a portion of Fuel and Oxidizer mixture using heat generated via compression of the mixture.
ont00001760: Artifact Ontology

Reactant Artifact Function
type: Class
subclass of: Chemical Reaction Artifact Function
definition: A Chemical Reaction Artifact Function that is realized in a process in which a substance or compound is added to a system in order to bring about a chemical reaction and is consumed in the course of the reaction.
ont00001754: https://en.wikipedia.org/w/index.php
ont00001760: Artifact Ontology

Submersible Artifact Function
type: Class
subclass of: Artifact Function
definition: An Artifact Function that is realized in processes of operating while submerged in water.
ont00001754: https://en.wikipedia.org/w/index.php
ont00001760: Artifact Ontology

Radio Wave Conversion Artifact Function
type: Class
subclass of: Artifact Function
definition: An Artifact Function that is realized by a Material Artifact being used to convert electric power into radio waves or radio waves into electric power.
ont00001760: Artifact Ontology

Portion of Nuclear Fuel
type: Class
subclass of: Portion of Material
definition: A Portion of Material that is designed to be used in a nuclear fission process to produce energy.
ont00001760: Artifact Ontology

Portion of Liquid Nitrogen
type: Class
subclass of: Portion of Cryogenic Material
definition: A Portion of Cryogenic Material that is composed (almost) entirely of liquid nitrogen.
ont00001760: Artifact Ontology

Optical Communication Artifact Function
type: Class
subclass of: Electromagnetic Communication Artifact Function
definition: An Electromagnetic Communication Artifact Function that is realized in a process that conveys meaningful signs by means of visible light.
ont00001754: https://en.wikipedia.org/w/index.php
ont00001760: Artifact Ontology

Telecommunication Network Line
type: Class
subclass of: Communication Instrument
definition: A Communication Artifact that is designed to be the physical transmission medium that connects two or more Telecommunication Network Nodes within a Telecommunication Network to facilitate communication between the Nodes.
ont00001754: https://en.wikipedia.org/w/index.php
ont00001760: Artifact Ontology

Pesticide Artifact Function
type: Class
subclass of: Poison Artifact Function
definition: A Poison Artifact Function that is realized in a process which causes illness in, or the death of, a living thing that is detrimental to humans or human concerns.
ont00001754: http://www.dictionary.com/browse/pesticide
ont00001760: Artifact Ontology

Herbicide Artifact Function
type: Class
subclass of: Pesticide Artifact Function
definition: A Pesticide Artifact Function that is realized in a process which causes harm to, or the death to, unwanted plants.
ont00001754: https://en.wikipedia.org/w/index.php
ont00001760: Artifact Ontology

Portion of Fuel
type: Class
subclass of: Portion of Material
definition: A Portion of Material that is designed to release thermal energy when reacted with other substances.
ont00001760: Artifact Ontology

Bicycle
type: Class
subclass of: Ground Vehicle
definition: A Ground Vehicle that consists of two wheels, one in front of the other, attached to a frame along with handlebars and pedals such that it is designed to receive its motive power from pedaling.
ont00001754: https://en.wikipedia.org/w/index.php
ont00001760: Artifact Ontology

Explosive Artifact Function
type: Class
subclass of: Damaging Artifact Function
definition: A Damaging Artifact Function that is realized in a process in which the structural integrity of an entity is impaired because of the rapid increase in volume and release of energy in an extreme manner.
ont00001754: http://www.dictionary.com/browse/explosive
ont00001760: Artifact Ontology

Solar Panel
type: Class
subclass of: Electrical Power Source
definition: An Electrical Power Source that consists in part of one or more photovoltaic (i.e. solar) cells that convert light energy (photons) directly into electricity by means of the photovoltaic effect.
ont00001754: https://en.wikipedia.org/w/index.php
ont00001760: Artifact Ontology

Mounted Gun
type: Class
subclass of: Firearm
definition: A Firearm that is designed to be fired while mounted.
ont00001760: Artifact Ontology

Heating System
type: Class
subclass of: Environment Control System
definition: An Environment Control System that is designed to heat the air or objects in a Site.
ont00001760: Artifact Ontology

Light Machine Gun
type: Class
subclass of: Long Gun
definition: A Long Gun that is designed to fire bullets in quick succession from an ammunition belt or magazine and to be employed by an individual soldier, with or without assistance, and typically weighing 9-22 lbs.
ont00001754: https://en.wikipedia.org/w/index.php
ont00001760: Artifact Ontology

Artifact History
type: Class
subclass of: BFO_0000182
definition: A History of a Material Artifact.
ont00001760: Artifact Ontology

Ultra High Frequency Communication Instrument
type: Class
subclass of: Radio Communication Instrument
definition: A Radio Communication Instrument that is designed to participate in some process that has process part some Ultra High Frequency.
ont00001760: Artifact Ontology

Improvised Explosive Device
type: Class
subclass of: Explosive Weapon
definition: An Explosive Weapon that is designed to be used in non-conventional military action.
ont00001753: IED
ont00001754: https://en.wikipedia.org/w/index.php
ont00001760: Artifact Ontology

Public Safety Artifact Function
type: Class
subclass of: Service Artifact Function
definition: A Service Artifact Function that is realized in processes of preventing and responding to events that could endanger the safety of the general public from significant danger, injury/harm, or damage, such as crimes or disasters (natural or man-made).
ont00001754: https://en.wikipedia.org/w/index.php
ont00001760: Artifact Ontology

Rocket Pod
type: Class
subclass of: Rocket Launcher
definition: A Rocket Launcher that is designed to contain several Unguided Rockets held in individual tubes and to be used by Aircraft or Helicopters for close air support.
ont00001760: Artifact Ontology

Optical Camera
type: Class
subclass of: Camera
definition: A Camera that is designed to form and record an image generated from visible light.
ont00001754: https://en.wikipedia.org/w/index.php
ont00001760: Artifact Ontology

Infrastructure System
type: Class
subclass of: BFO_0000040
alternative label: Infrastructure
definition: A Material Entity that is composed of elements bearing Infrastructure Roles and is by itself sufficient to provide a planned service or benefit to some organization that maintains its elements.
ont00001760: Artifact Ontology

Material Copy of a Video
type: Class
subclass of: Information Bearing Artifact
subclass of: Restriction
  on property: BFO_0000101
  some values from: ont00002009
alternative label: Video
definition: An Information Bearing Artifact that is designed to carry some specific Information Content Entity in the form of a sequence of representations that are presented sufficiently rapidly to create the appearance of motion and continuity.
ont00001754: https://en.wikipedia.org/w/index.php
ont00001760: Artifact Ontology

Brake Control System
type: Class
subclass of: Vehicle Control System
definition: A Vehicle Control System that is designed to control the process of braking with the aim of preventing rolling, skidding, and hydroplaning.
ont00001760: Artifact Ontology

Identification Friend or Foe Transponder
type: Class
subclass of: Radio Transponder
alternative label: IFF
definition: A Radio Transponder that is designed to automatically transmit a predefined signal in response to receiving an appropriate interrogation signal such that the entity it is located on can be positively identified as friendly.
ont00001754: https://en.wikipedia.org/w/index.php
ont00001760: Artifact Ontology

Religious Artifact Function
type: Class
subclass of: Service Artifact Function
definition: A Service Artifact Function that is realized in processes related to worship and prayer.
ont00001754: https://en.wikipedia.org/w/index.php
ont00001760: Artifact Ontology

Wired Communication Reception Artifact Function
type: Class
subclass of: Communication Reception Artifact Function
definition: A Communication Reception Artifact Function that is realized during events in which a Material Artifact receives information transmitted from another Material Artifact, where the transmission of information occurs via a direct connection using an electrical conductor.
ont00001760: Artifact Ontology

High Frequency Communication Instrument
type: Class
subclass of: Radio Communication Instrument
definition: A Radio Communication Instrument that is designed to participate in some process that has process part some High Frequency.
ont00001760: Artifact Ontology

Information Medium Artifact
type: Class
subclass of: Material Artifact
definition: A Material Artifact that is designed to have some Information Bearing Artifact as part.
example: A magnetic hard drive
example: A notebook
scope note: An empty notebook, when manufactured, is a medium but not yet a carrier of information content. However, a book, in the sense of a novel or collection of philosophical essays or poems, depends necessarily on it carrying some information content. Thus, there are no empty books. Likewise, there are no empty databases, only portions of digital storage that have not yet been configured to carry some information content according to a database software application.
ont00001760: Artifact Ontology

Portion of Oxidizer
type: Class
subclass of: Portion of Material
alternative label: Portion of Oxidant
alternative label: Portion of Oxidizing Agent
definition: A Portion of Material that is disposed to steal electrons from other substances (i.e. to oxidize other substances) as a participant in a reduction-oxidation process.
example: oxygen, hydrogen peroxide, chlorine, sulfiric acid, potassium nitrate
scope note: Oxidizers are essential participants in many processes including combustion and rusting. Hence, a portion of oxidizer must always be present along with a portion of fuel in order for combustion to occur.
ont00001760: Artifact Ontology

Radio Communication Relay Artifact Function
type: Class
subclass of: Communication Relay Artifact Function
definition: A Communication Relay Artifact Function that is realized during events in which a Material Artifact is used to first receive and then transmit information without the use of wires from one Material Artifact to another for the purpose of communiction.
ont00001760: Artifact Ontology

Radio Communication Instrument
type: Class
subclass of: Communication Instrument
definition: A Communication Instrument that is designed to enable communication between two or more entities via the use of radio waves.
ont00001760: Artifact Ontology

Vehicle Track
type: Class
subclass of: ont00000205
subclass of: Restriction
  on property: ont00001855
  some values from: Vehicle Track Point
definition: An Object Track for a Vehicle during some motion.
ont00001760: Artifact Ontology

Email Box
type: Class
subclass of: Telecommunication Instrument
definition: A Telecommunication Instrument that is designed to be the delivery destination of Email Messages that are addressed to the corresponding Email Address.
ont00001754: https://en.wikipedia.org/w/index.php
ont00001760: Artifact Ontology

Telephone
type: Class
subclass of: Telecommunication Instrument
alternative label: Phone
definition: A Telecommunication Instrument that is designed to provide point-to-point communication between agents by means of audio messages.
ont00001754: https://en.wikipedia.org/w/index.php
ont00001760: Artifact Ontology

Emergency AC/DC Power Source
type: Class
subclass of: Electrical Power Source
definition: An Electrical Power Source that is designed to provide electrical power in an emergency situation by means of both alternating current and direct current.
ont00001760: Artifact Ontology

Telecommunication Network Node
type: Class
subclass of: Communication Instrument
subclass of: Restriction
  on property: BFO_0000176
  some values from: Telecommunication Network
definition: A Communication Artifact that consists of a connection point, redistribution point, or endpoint that is designed to be part of a Telecommunication Network and can be either active or passive.
ont00001754: https://en.wikipedia.org/wiki/Node_(networking)
ont00001760: Artifact Ontology

Parts List
type: Class
subclass of: Quality Specification
definition: A Quality Specification that prescribes the Amount of some type of Material Artifact that are part of or located on another Material Artifact.
ont00001760: Artifact Ontology

Train Car
type: Class
subclass of: Rail Transport Vehicle
alternative label: Railroad Car
definition: A Rail Transport Vehicle that consists of a single Vehicle that is not a Train but is designed to be connected to other Train Cars along with at least one Locomotive to form a Train.
ont00001754: https://en.wikipedia.org/w/index.php
ont00001760: Artifact Ontology

Part Role
type: Class
subclass of: BFO_0000023
definition: A Role that inheres in an entity in virtue of it being part of some other entity without being subject to further subdivision or disassembly without destruction of its designated use.
ont00001754: http://origins.sese.asu.edu/ses405/Class%20Notes/Sys-Hier-WBS_Module_V1.0_PAS.pdf
ont00001760: Artifact Ontology

Nickel-metal Hydride Electric Battery
type: Class
subclass of: Secondary Cell Electric Battery
alternative label: NiMH Battery
definition: A Secondary Cell Electric Battery that has a metal-hydride anode and nickel oxide hydroxide cathode.
ont00001754: https://en.wikipedia.org/w/index.php
ont00001760: Artifact Ontology

Computing Artifact Function
type: Class
subclass of: Artifact Function
definition: An Artifact Function that is realized by a Material Artifact participating in a computation process.
ont00001760: Artifact Ontology

Landline Telephone
type: Class
subclass of: Telephone
definition: A Telephone that is connected to a Telephone Network through a pair of wires.
ont00001754: https://en.wikipedia.org/w/index.php
ont00001760: Artifact Ontology

Inhibiting Motion Artifact Function
type: Class
subclass of: Artifact Function
definition: An Artifact Function that is realized by processes in which some Material Artifact is used to inhibit the motion of some object.
ont00001760: Artifact Ontology

Financial Artifact Function
type: Class
subclass of: Service Artifact Function
definition: A Service Artifact Function that is realized in processes of managing money.
ont00001754: https://en.wikipedia.org/w/index.php
ont00001760: Artifact Ontology

Sniper Rifle
type: Class
subclass of: Rifle
definition: A Rifle that is designed to be highly accurate for long-range precision tactical shooting.
ont00001754: https://en.wikipedia.org/w/index.php
ont00001760: Artifact Ontology

Ocular Prosthesis
type: Class
subclass of: Artificial Eye
definition: An Artificial Eye that is designed to replace a missing eye, but which does not function as an eye.
ont00001754: https://en.wikipedia.org/w/index.php
ont00001760: Artifact Ontology

Thermal Imaging Artifact Function
type: Class
subclass of: Imaging Artifact Function
definition: An Imaging Artifact Function that is realized during events in which a Material Artifact is used to create a visual representation of an entity using radiation from the far infrared region of the electromagnetic spectrum that the entity emits
ont00001760: Artifact Ontology

X-ray Telescope
type: Class
subclass of: Telescope
definition: A Telescope that is designed to aid in the observation of spatially distant Objects by means of collecting and focusing X-rays to form an enhanced image of the Object.
ont00001754: https://en.wikipedia.org/w/index.php
ont00001760: Artifact Ontology

Temperature Measurement Artifact Function
type: Class
subclass of: Measurement Artifact Function
definition: A Measurement Artifact Function that is realized during events in which a Material Artifact is used to measure the Temperature of a specified object or class of objects.
ont00001760: Artifact Ontology

Electric Motor
type: Class
subclass of: Engine
alternative label: Electric Engine
definition: An Engine that is designed to convert electrical energy into mechanical energy.
ont00001754: https://en.wikipedia.org/w/index.php
ont00001760: Artifact Ontology

Telecommunication Infrastructure
type: Class
subclass of: Infrastructure System
definition: An Infrastructure System that is designed to support the use of Telecommunication Instruments to communicate.
ont00001754: https://en.wikipedia.org/w/index.php
ont00001760: Artifact Ontology

Highway Interchange
type: Class
subclass of: Road Junction
definition: A Road Junction that is designed to enable Ground Vehicles to exit one or more Highways and enter another Highway without directly crossing any other traffic stream.
ont00001754: https://en.wikipedia.org/wiki/Interchange_(road)
ont00001760: Artifact Ontology

Current Conversion Artifact Function
type: Class
subclass of: Electrical Artifact Function
definition: An Electrical Artifact Function that is realized by processes in which some Material Artifact is used to convert some electrical current.
ont00001760: Artifact Ontology

Portion of Liquid Propellant
type: Class
subclass of: Portion of Propellant
definition: A Portion of Propellant that is stored in a liquid state.
ont00001760: Artifact Ontology

Fuel Transfer System
type: Class
subclass of: Fluid Control Artifact
definition: A Fluid Control Artifact that is designed to facilitate the transfer of some Portion of Fuel from the Fuel Tank for use in some Engine.
ont00001760: Artifact Ontology

Assault Rifle
type: Class
subclass of: Rifle
definition: A Rifle that is designed to have selective-fire functionality and use an intermediate Cartridge and a detachable magazine.
ont00001754: https://en.wikipedia.org/w/index.php
ont00001760: Artifact Ontology

Portion of Waste Material
type: Class
subclass of: Portion of Processed Material
definition: A Portion of Processed Material that serves no further use in terms of the initial user's own purposes of production, transformation, or consumption such that the Agent wants to dispose of it.
ont00001760: Artifact Ontology

Thermal Insulation Artifact Function
type: Class
subclass of: Thermal Control Artifact Function
definition: A Thermal Control Artifact Function that is realized during events in which a Material Artifact prevents or reduces the transfer of heat between objects that are in thermal contact or in range of radiative influence.
ont00001754: https://en.wikipedia.org/w/index.php
ont00001760: Artifact Ontology

Reflective Prism
type: Class
subclass of: Prism
definition: A Prism designed to reflect light in order to flip, invert, rotate, deviate, or displace a beam of light entering the Prism.
ont00001760: Artifact Ontology

Power Rectifying Artifact Function
type: Class
subclass of: Current Conversion Artifact Function
definition: A Current Conversion Artifact Function that is realized by processes in which some Material Artifact is used to convert alternating current (AC) to direct current (DC).
ont00001760: Artifact Ontology

Electrical Power Production Artifact Function
type: Class
subclass of: Electrical Artifact Function
definition: An Electrical Artifact Function that is realized during events in which a Material Artifact is used to generate electrical power.
ont00001760: Artifact Ontology

Material Artifact
type: Class
subclass of: BFO_0000040
definition: A Material Entity that was designed by some Agent to realize a certain Function.
ont00001760: Artifact Ontology

Ramjet Engine
type: Class
subclass of: Air-Breathing Jet Engine
alternative label: Ramjet
definition: An Air-Breathing Jet Engine that uses the forward motion of the Engine to compress incoming air (without the use of an axial compressor) and decelerate it to subsonic speeds before adding the fuel and constantly combusting the mixture then expelling the exhaust out through the rear Propelling Nozzle to generate Thrust.
ont00001754: https://en.wikipedia.org/w/index.php
ont00001760: Artifact Ontology

Telecommunication Network
type: Class
subclass of: Communication System
definition: A Communication System that is designed to enable the transmission of information over significant distances between Telecommunication Endpoints via Telecommunication Network Nodes and Lines.
ont00001754: https://en.wikipedia.org/w/index.php
ont00001760: Artifact Ontology

Spray Nozzle
type: Class
subclass of: Nozzle
definition: A Nozzle that is designed to facilitate a conversion of the flow of a portion of liquid into a dynamic collection of drops dispersed in a portion of gas.
ont00001760: Artifact Ontology

Material Copy of a Message
type: Class
subclass of: Information Bearing Artifact
subclass of: Restriction
  on property: BFO_0000101
  some values from: ont00002010
alternative label: Message
definition: An Information Bearing Artifact that is designed to carry some specific Information Content Entity that is relatively brief and to be transmitted from a sender to a recipient.
ont00001754: https://en.wikipedia.org/w/index.php
ont00001760: Artifact Ontology

Cartridge
type: Class
subclass of: Portion of Ammunition
definition: A Portion of Ammunition that is designed to package a Bullet, a propellant substance, and a primer within a case that is designed to fit within the firing chamber of a Firearm.
ont00001754: https://en.wikipedia.org/wiki/Cartridge_(firearms)
ont00001760: Artifact Ontology

Turbojet Air-Breathing Jet Engine
type: Class
subclass of: Air-Breathing Jet Engine
definition: An Air-Breathing Jet Engine that uses a Turbojet, which consists of a Turbine with a Propelling Nozzle.
ont00001754: https://en.wikipedia.org/w/index.php
ont00001760: Artifact Ontology

Passenger Train Car
type: Class
subclass of: Train Car
definition: A Train Car that is designed to transport passengers.
ont00001754: https://en.wikipedia.org/wiki/Passenger_car_(rail)
ont00001760: Artifact Ontology

Biological Weapon
type: Class
subclass of: Weapon
definition: A Weapon that is designed to inflict harm, incapacity, or death by means of releasing disease-producing agents—such as bacteria, viruses, or fungi.
ont00001754: https://en.wikipedia.org/w/index.php
ont00001760: Artifact Ontology

Optical Telescope
type: Class
subclass of: Telescope
definition: A Telescope that is designed to aid in the observation of spatially distant Objects by means of collecting and focusing visible light to form an enhanced image of the Object.
ont00001754: https://en.wikipedia.org/w/index.php
ont00001760: Artifact Ontology

Automobile
type: Class
subclass of: Ground Motor Vehicle
definition: A Ground Motor Vehicle that is designed to transport a small number of passengers while traveling on four tired wheels.
ont00001754: https://en.wikipedia.org/w/index.php
ont00001760: Artifact Ontology

Heating Artifact Function
type: Class
subclass of: Artifact Function
definition: An Artifact Function that is realized in a process in which the thermal energy of a system increases.
ont00001760: Artifact Ontology

Controlled-Access Highway
type: Class
subclass of: Highway
alternative label: Expressway
alternative label: Freeway
alternative label: Motorway
definition: A Highway that is designed for high-speed vehicular traffic, with traffic flow and ingress/egress regulated.
ont00001754: https://en.wikipedia.org/w/index.php
ont00001760: Artifact Ontology

Equipment Cooling System
type: Class
subclass of: Cooling System
definition: A Cooling System that is designed to cool some piece of equipment.
ont00001760: Artifact Ontology

Steering Control System
type: Class
subclass of: Vehicle Control System
definition: A Vehicle Control System that is designed to control the direction some Vehicle is traveling.
ont00001760: Artifact Ontology

Portion of Gaseous Fuel
type: Class
subclass of: Portion of Fuel
definition: A Portion of Fuel that is stored in a gaseous state.
ont00001760: Artifact Ontology

Spark Ignition Engine
type: Class
subclass of: Internal Combustion Engine
definition: An Internal Combustion Engine that is designed to operate by generating a spark to ignite a portion of Fuel and Oxidizer mixture.
ont00001760: Artifact Ontology

Electric Generator
type: Class
subclass of: Electrical Power Source
definition: An Electrical Power Source that is designed to convert mechanical energy to electrical energy for use in an external circuit.
ont00001754: https://en.wikipedia.org/w/index.php
ont00001760: Artifact Ontology

Trim Tab
type: Class
subclass of: Control Surface
definition: A Control Surface that is designed to counteract hydro-, aerodynamic, or other forces in order to stabilize the Vehicle it is part of in the desired Attitude.
ont00001754: https://en.wikipedia.org/w/index.php
ont00001760: Artifact Ontology

Unguided Rocket
type: Class
subclass of: Portion of Ammunition
alternative label: Rocket
definition: A Portion of Ammunition that is designed to be a self-propelled, but unguided, projectile that delivers some payload (explosive or other) over relatively long distances through the use of a Rocket Engine.
ont00001754: https://en.wikipedia.org/wiki/Rocket_(weapon)
ont00001760: Artifact Ontology

Train
type: Class
subclass of: Rail Transport Vehicle
alternative label: Railroad Train
alternative label: Railway Train
definition: A Rail Transport Vehicle that consists of a series of connected Train Cars or Railcars.
ont00001754: https://en.wikipedia.org/w/index.php
ont00001760: Artifact Ontology

Full Motion Video Camera
type: Class
subclass of: Video Camera
definition: A Video Camera that is designed to capture and record images of sufficiently high quality and in rapid enough succession that the resulting video supports smooth playback.
ont00001760: Artifact Ontology

Communication System
type: Class
subclass of: Material Artifact
definition: A Material Artifact that is designed to enable some Act of Communication by means of transmission systems, relay stations, tributary stations, and data terminal equipment, usually capable of interconnection and interoperation to form an integrated whole.
ont00001754: https://en.wikipedia.org/w/index.php
ont00001760: Artifact Ontology

Nickel Cadmium Electric Battery
type: Class
subclass of: Secondary Cell Electric Battery
alternative label: NiCad Battery
definition: A Secondary Cell Electric Battery that has a cadmium anode and nickel oxide hydroxide cathode.
ont00001754: https://en.wikipedia.org/w/index.php
ont00001760: Artifact Ontology

Equipment Mount
type: Class
subclass of: Material Artifact
definition: A Material Artifact that is designed to support a Material Artifact.
ont00001760: Artifact Ontology

Aircraft
type: Class
subclass of: Vehicle
definition: A Vehicle that is designed to convey passengers, cargo, or equipment from one location to another by air travel.
ont00001754: https://en.wikipedia.org/w/index.php
ont00001760: Artifact Ontology

Nuclear Radiation Detection Artifact Function
type: Class
subclass of: Artifact Function
definition: An Artifact Function that is realized during events in which a Material Artifact is used to detect the presence of nuclear radiation particles.
ont00001760: Artifact Ontology

Artifact Model
type: Class
subclass of: Artifact Design
definition: A Prescriptive Information Content Entity that prescribes a common set of Functions and Qualities to inhere in a set of artifact instances.
ont00001760: Artifact Ontology

Material Copy of a Notification Message
type: Class
subclass of: Material Copy of a Message
subclass of: Restriction
  on property: BFO_0000101
  some values from: ont00002013
alternative label: Notification Message
definition: A Material Copy of a Message that is designed to carry an Information Content Entity that describes a scenario that has been determined to merit attention by the recipient.
ont00001760: Artifact Ontology

Electrical Power Source
type: Class
subclass of: Power Source
definition: A Power Source that is designed to generate, control, and transfer power in the form of electrical energy.
ont00001760: Artifact Ontology

Primary Cell Electric Battery
type: Class
subclass of: Electric Battery
alternative label: Primary Cell Battery
definition: A Electric Battery that is designed for one-time use and not to be recharged.
ont00001754: https://en.wikipedia.org/w/index.php
ont00001760: Artifact Ontology

Projectile Launcher
type: Class
subclass of: Weapon
definition: A Weapon that is designed to inflict damage or harm by means of launching a high-velocity projectile at a target.
ont00001754: https://en.wikipedia.org/w/index.php
ont00001760: Artifact Ontology

Helical Antenna
type: Class
subclass of: Wire Antenna
definition: A Wire Antenna that consists of a conducting wire wound in the form of a helix that is typically mounted over a ground plane with a feed line connected between the bottom of the helix and the ground plane.
ont00001754: https://en.wikipedia.org/w/index.php
ont00001760: Artifact Ontology

Fuel System
type: Class
subclass of: Material Artifact
definition: A Material Artifact that is designed to pump, manage, and deliver some Portion of Fuel to the Propulsion System and Auxiliary Power Unit of some Vehicle.
ont00001754: https://en.wikipedia.org/w/index.php
ont00001760: Artifact Ontology

Motorcycle
type: Class
subclass of: Ground Motor Vehicle
alternative label: Motorbike
definition: A Ground Motor Vehicle that is designed to transport a very small number of passengers (usually 1 or 2) while traveling on two or three tired wheels.
ont00001754: https://en.wikipedia.org/w/index.php
ont00001760: Artifact Ontology

Material Copy of a Barcode
type: Class
subclass of: Information Bearing Artifact
subclass of: Restriction
  on property: BFO_0000101
  some values from: ont00002014
alternative label: Barcode
definition: An Information Bearing Artifact that is designed to carry one or more geometric shapes that concretize some Prescriptive Information Content Entity.
scope note: For information on types of barcodes, see: https://www.scandit.com/types-barcodes-choosing-right-barcode/
ont00001754: https://en.wikipedia.org/w/index.php
ont00001760: Artifact Ontology

Laser
type: Class
subclass of: Material Artifact
definition: A Material Artifact that is designed to emit light coherently through a process of optical amplification based on the stimulated emission of electromagnetic radiation.
ont00001754: https://en.wikipedia.org/w/index.php
ont00001760: Artifact Ontology

Fluid Control Artifact Function
type: Class
subclass of: Artifact Function
definition: An Artifact Function that is realized in processes in which some Material Artifact is used to control the direction or flow of some fluid.
ont00001760: Artifact Ontology

Payload Capacity
type: Class
subclass of: Artifact Function
subclass of: Restriction
  on property: BFO_0000197
  some values from: Vehicle
definition: An Artifact Function that inheres in a Vehicle that is designed to transport Payload, and which is typically characterized by the maximum Weight, Mass, or Volume of Payload that the Vehicle can transport.
ont00001754: https://en.wikipedia.org/w/index.php
ont00001760: Artifact Ontology

Heavy Machine Gun
type: Class
subclass of: Mounted Gun
definition: A Mounted Gun that is designed to fire ammunition greater than .50 caliber or 12.7mm ammunition in quick succession from an ammunition belt, and which typically weighs more than 30lbs.
ont00001754: https://en.wikipedia.org/w/index.php
ont00001760: Artifact Ontology

Patch Receiver
type: Class
subclass of: Radio Receiver
definition: A Radio Receiver that uses a Patch Antenna to intercept radio signals.
ont00001760: Artifact Ontology

Air-Breathing Combustion Engine
type: Class
subclass of: Reaction Engine
definition: A Reaction Engine that functions by drawing a continuous stream of air into and through the Engine where it is compressed, mixed with a Portion of Fuel, ignited, and then expelled as exhaust gas.
ont00001754: https://en.wikipedia.org/w/index.php
ont00001760: Artifact Ontology

Portion of Processed Material
type: Class
subclass of: Material Artifact
definition: A Material Artifact that is the output of an Act of Material Artifact Processing.
ont00001760: Artifact Ontology

Reflection Artifact Function
type: Class
subclass of: Artifact Function
definition: An Artifact Function that is realized by a Material Artifact participating in a reflection event in which the Material Artifact causes a change in a wavefront at an interface between the reflecting medium and the transmission medium such that the wavefront returns into the transmission medium.
ont00001760: Artifact Ontology

Road Junction
type: Class
subclass of: Land Transportation Artifact
definition: A Land Transportation Artifact that is designed to enable Ground Vehicles to exit one Road and enter another.
ont00001754: https://en.wikipedia.org/wiki/Junction_(road)
ont00001760: Artifact Ontology

Orientation Observation Artifact Function
type: Class
subclass of: Observation Artifact Function
alternative label: Attitude Observation Artifact Function
definition: An Observation Artifact Function that is realized during events in which a Material Artifact is used to collect information about the Orientation of a specified object or class of objects.
ont00001760: Artifact Ontology

Electrical Power Storage Artifact Function
type: Class
subclass of: Electrical Artifact Function
alternative label: Capacitance
definition: An Electrical Artifact Function that is realized during events in which a Material Artifact is used to store electrical power to be released at a later time.
ont00001760: Artifact Ontology

Coin
type: Class
subclass of: Portion of Cash
definition: A Portion of Cash that consists of a flat, portable, round pieces of metal designed to bear some specified Financial Value.
ont00001760: Artifact Ontology

Cellular Telecommunication Network
type: Class
subclass of: Wireless Telecommunication Network
alternative label: Cellular Network
alternative label: Mobile Telecommunication Network
definition: A Wireless Telecommunication Network where the last link between the network and the end user is wireless and is distributed over service areas called cells.
ont00001754: https://en.wikipedia.org/w/index.php
ont00001760: Artifact Ontology

Submachine Gun
type: Class
subclass of: Long Gun
definition: An Long Gun that is designed to be have automatic-fire functionality, fire pistol-caliber ammunition that is magazine-fed, and which is usually smaller than other automatic firearms.
ont00001754: https://en.wikipedia.org/w/index.php
ont00001760: Artifact Ontology

Common Stock
type: Class
subclass of: Stock
definition: Stock that entitles its holder to voting on corporate decisions.
ont00001760: Artifact Ontology

Bridge
type: Class
subclass of: Land Transportation Artifact
definition: A Land Transportation Artifact that is designed to span physical obstacles without closing the way underneath to enable Persons or Ground Vehicles to pass over the obstacles.
ont00001754: https://en.wikipedia.org/w/index.php
ont00001760: Artifact Ontology

Measurement Artifact Function
type: Class
subclass of: Artifact Function
definition: An Artifact Function that is realized during events in which a Material Artifact is used to measure one or more features of a specified object or class of objects.
ont00001760: Artifact Ontology

Artifact Model Name
type: Class
equivalent class: Class
  intersection of: ont00000686
  intersection of: Restriction
    on property: ont00001916
    some values from: Artifact Model
subclass of: ont00000686
definition: A Designative Information Content Entity that designates some Material Artifact Model.
ont00001760: Artifact Ontology

Long Gun
type: Class
subclass of: Firearm
definition: A Firearm that is designed to have a longer barrel than a Hand Gun and to be fired while braced against the shoulder.
ont00001754: https://en.wikipedia.org/w/index.php
ont00001760: Artifact Ontology

Secondary Cell Electric Battery
type: Class
subclass of: Electric Battery
alternative label: Rechargeable Battery
alternative label: Secondary Cell Battery
definition: An Electric Battery that is designed to be recharged.
ont00001754: https://en.wikipedia.org/w/index.php
ont00001760: Artifact Ontology

Propelling Nozzle
type: Class
subclass of: Nozzle
alternative label: Jet Nozzle
definition: A Nozzle that is used to convert a propulsion Engine into a Jet Engine and functions by using its narrowest part, the throat, to increase Pressure within the Engine by constricting flow, usually until the flow chokes, then expanding the exhaust stream to, or near to, atmospheric pressure, while forming it into a high speed jet to propel the Vehicle.
ont00001754: https://en.wikipedia.org/w/index.php
ont00001760: Artifact Ontology

Material Copy of a Form Document
type: Class
subclass of: Material Copy of a Document
subclass of: Restriction
  on property: BFO_0000101
  some values from: ont00002044
alternative label: Document Form
definition: A Material Copy of a Document that has one or more Material Copy of a Document Field as parts in which to write or select prescribed content.
example: A spreadsheet template
example: A survey
ont00001754: https://en.wikipedia.org/wiki/Form_(document)
ont00001760: Artifact Ontology

Scramjet Engine
type: Class
subclass of: Air-Breathing Jet Engine
alternative label: Scramjet
alternative label: Supersonic Combusting Ramjet
definition: An Air-Breathing Jet Engine that uses the forward motion of the Engine to compress incoming air at supersonic speeds before adding the fuel and constantly combusting the mixture then expelling the exhaust out through the rear Propelling Nozzle to generate Thrust.
ont00001754: https://en.wikipedia.org/w/index.php
ont00001760: Artifact Ontology

Poison Artifact Function
type: Class
subclass of: Damaging Artifact Function
definition: A Damaging Artifact Function that is realized in a process which causes illness in, or the death of, a living thing.
ont00001754: http://www.dictionary.com/browse/poison
ont00001760: Artifact Ontology

Precision-Guided Missile
type: Class
subclass of: Portion of Ammunition
definition: A Portion of Ammunition that is designed to be a self-propelled and precision-guided projectile that delivers some payload (explosive or other) over relatively long distances.
ont00001754: https://en.wikipedia.org/w/index.php
ont00001760: Artifact Ontology

Pressurization Control Artifact Function
type: Class
subclass of: Ventilation Control Artifact Function
definition: A Ventilation Control Artifact Function that is realized by processes in which some Material Artifact is used to control the partial pressure of air in some space.
ont00001760: Artifact Ontology

Vehicle Frame
type: Class
subclass of: Material Artifact
definition: A Material Artifact that is designed to be the main supporting structure of some Vehicle.
ont00001754: https://en.wikipedia.org/w/index.php
ont00001760: Artifact Ontology

Portion of Liquid Fuel
type: Class
subclass of: Portion of Fuel
definition: A Portion of Fuel that is stored in a liquid state.
ont00001760: Artifact Ontology

Beverage Antenna
type: Class
subclass of: Wire Antenna
definition: A Wire Antenna that consists of a horizontal wire one-half to two wavelengths long that is suspended above the ground with one end attached to the receiver feedline and the other grounded and which is typically used in the low and medium frequency radio bands.
ont00001754: Adapted from: https://en.wikipedia.org/wiki/Beverage_antenna
ont00001760: Artifact Ontology

Spacecraft
type: Class
subclass of: Vehicle
definition: A Vehicle that is designed to convey passengers, cargo, or equipment from one location to another by Spaceflight.
ont00001754: https://en.wikipedia.org/w/index.php
ont00001760: Artifact Ontology

Flywheel
type: Class
subclass of: Material Artifact
definition: A Material Artifact that is designed to store rotational energy such that it has a significant moment of inertia which enables it to resist changes in rotational speed.
ont00001754: https://en.wikipedia.org/w/index.php
ont00001760: Artifact Ontology

Infrastructure Role
type: Class
subclass of: BFO_0000023
definition: A Role that inheres in the bearer of a Disposition and has been assigned to an Infrastructure System such that the realization of that Disposition is sometimes part of the functioning of the Infrastructure System.
scope note: The disposition will typically be a function of an artifact, which is often designed to be part of some Infrastructure system. But not always. In some cases an entity may be repurposed to be an element of some Infrastructure. In those cases it is a capability of that entity that supports the functioning of the system.
ont00001754: https://archive.org/details/economicsprincip00osul/page/n489/mode/2up
ont00001760: Artifact Ontology

Radio Receiver
type: Class
subclass of: Radio Communication Instrument
definition: A Radio Communication Instrument that is an electronic device that is designed to extract information from radio waves intercepted by a Radio Antenna by using electronic filters to separate the desired radio frequency signal from other signals, an electronic amplifier to increase the power of the signal, and demodulation to recover the desired information.
ont00001754: https://en.wikipedia.org/w/index.php
ont00001760: Artifact Ontology

Electromagnetic Communication Artifact Function
type: Class
subclass of: Communication Artifact Function
definition: A Communication Artifact Function that is realized in a process that conveys meaningful signs by means of electromagnetic radiation.
ont00001754: https://en.wikipedia.org/w/index.php
ont00001760: Artifact Ontology

Portion of Ammunition
type: Class
subclass of: Weapon
definition: A Weapon that is designed to inflict harm, damage, or incapacity by being projected toward its target at a significant Velocity.
ont00001754: https://en.wikipedia.org/w/index.php
ont00001760: Artifact Ontology

Portion of Paper
type: Class
subclass of: Information Medium Artifact
definition: An Information Medium Artifact that is designed to bear some Information Content Entity by means of pressing together moist fibres of cellulose pulp derived from wood, rags, or grasses, and drying them into flexible sheets.
ont00001754: https://en.wikipedia.org/w/index.php
ont00001760: Artifact Ontology

Damaging Artifact Function
type: Class
subclass of: Artifact Function
definition: An Artifact Function that is realized in a process in which the structural integrity of an entity is impaired.
ont00001760: Artifact Ontology

Full Motion Video Imaging Artifact Function
type: Class
subclass of: Imaging Artifact Function
definition: An Imaging Artifact Function that inheres in Material Artifacts that are designed to produce video of entities that is of high enough quality to make the represented motion appear continuous to human viewers.
ont00001760: Artifact Ontology

Material Copy of a Information Line
type: Class
subclass of: Information Bearing Artifact
subclass of: Restriction
  on property: BFO_0000101
  some values from: ont00002037
alternative label: Information Line
definition: An Information Bearing Artifact that consists of a single line or row of some larger Information Bearing Artifact of which it is a part.
example: a line in a computer file that bears a portion of code for some computer program
example: a line of data in a database
example: a line of text in a book
ont00001760: Artifact Ontology

Hydraulic Power Source
type: Class
subclass of: Power Source
definition: A Power Source that is designed to generate, control, or transmit power by means of pressurized liquid.
ont00001760: Artifact Ontology

Bond
type: Class
subclass of: Financial Instrument
definition: A Financial Instrument that is designed to secure an Agent's debt for the holders of that debt.
ont00001754: https://en.wikipedia.org/wiki/Bond_(finance)
ont00001760: Artifact Ontology

Solvent Artifact Function
type: Class
subclass of: Chemical Reaction Artifact Function
definition: A Chemical Reaction Artifact Function that is realized in the dissolving of other substances (namely, solutes) without change in the former's chemical structure.
ont00001754: https://en.wikipedia.org/w/index.php
ont00001760: Artifact Ontology

Counterfeit Legal Instrument
type: Class
subclass of: Counterfeit Instrument
definition: A Counterfeit Instrument that is designed to be a fake replica of some genuine Legal Instrument.
ont00001754: https://en.wikipedia.org/w/index.php
ont00001760: Artifact Ontology

Reaction Mass
type: Class
subclass of: BFO_0000040
alternative label: Working Mass
definition: A Material Entity against which a Propulsion System operates in order to produce Acceleration.
ont00001754: https://en.wikipedia.org/w/index.php
ont00001760: Artifact Ontology

Communication Relay Artifact Function
type: Class
subclass of: Artifact Function
definition: An Artifact Function that is realized during events in which a Material Artifact is used to first receive and then transmit information from one Material Artifact to another for the purpose of communiction.
ont00001760: Artifact Ontology

Portion of Gelatinous Propellant
type: Class
subclass of: Portion of Propellant
definition: A Portion of Propellant that is stored in a gelatinous state.
ont00001760: Artifact Ontology

Rocket Launcher
type: Class
subclass of: Projectile Launcher
definition: A Projectile Launcher that is designed to launch one or more Unguided Rockets.
ont00001754: https://en.wikipedia.org/w/index.php
ont00001760: Artifact Ontology

Electromagnetic Shielding Artifact Function
type: Class
subclass of: Artifact Function
definition: An Artifact Function that is realized in a process in which an electromagnetic field is blocked by barriers made of conductive or magnetic materials.
ont00001754: https://en.wikipedia.org/w/index.php
ont00001760: Artifact Ontology

Railway Crossing
type: Class
subclass of: Land Transportation Artifact
alternative label: Level Crossing
definition: A Land Transportation Artifact that is designed to enable Persons or Ground Vehicles to cross a Railway when traveling along a road or path that is perpendicular to and at the same elevation as the Railway at the point where they overlap.
ont00001760: Artifact Ontology

Digital Storage Device
type: Class
subclass of: Information Medium Artifact
definition: An Information Medium Artifact that is designed to bear some Information Content Entity by means of recording that information in digital (binary) format.
example: A computer's Hard Disk Drive
example: A portable USB Drive
ont00001754: https://en.wikipedia.org/w/index.php
ont00001760: Artifact Ontology

Triple Inertial Navigation System
type: Class
subclass of: Inertial Navigation System
alternative label: Triple INS
definition: An Inertial Navigation System that is designed to use three redundant computers to continuously calculate via dead reckoning the position, orientation, and velocity of a moving object without the need for external references, in such a way that eliminates the need for a navigator.
ont00001760: Artifact Ontology

Rocket
type: Class
subclass of: Vehicle
definition: A Vehicle that is designed to travel through air or space and which obtains Thrust from a Rocket Engine.
ont00001754: https://en.wikipedia.org/w/index.php
ont00001760: Artifact Ontology

Navigation System
type: Class
subclass of: Material Artifact
definition: A Material Artifact that is designed to enable an Agent or Material Artifact to determine the position or direction of some object, usually for the purpose of monitoring or controlling the movement of some Vehicle from one place to another.
ont00001754: https://en.wikipedia.org/w/index.php
ont00001760: Artifact Ontology

Denture
type: Class
subclass of: Prosthesis
definition: A Prosthesis that is designed to replace missing teeth.
ont00001754: https://en.wikipedia.org/w/index.php
ont00001760: Artifact Ontology

Radio Antenna
type: Class
subclass of: Bidirectional Transducer
definition: A Bidirectional Transducer that is designed to convert electric power into radio waves, and radio waves into electric power.
ont00001754: https://en.wikipedia.org/wiki/Antenna_(radio)
ont00001760: Artifact Ontology

Railcar
type: Class
subclass of: Rail Transport Vehicle
definition: A Rail Transport Vehicle that consists of a single self-propelled Vehicle that is not a Train, is designed to transport passengers, and which may also be designed to connect to other Railcars to form a Train.
scope note: In American-English, the term 'Railcar' is often used in a broader sense that is interchangeable with 'Railroad Car'.
ont00001754: https://en.wikipedia.org/w/index.php
ont00001760: Artifact Ontology

Structural Support Artifact Function
type: Class
subclass of: Artifact Function
definition: An Artifact Function that is realized by a Material Artifact providing physical support to another object.
ont00001760: Artifact Ontology

Trail
type: Class
subclass of: Land Transportation Artifact
definition: A Land Transportation Artifact that is designed to enable transport through rough country, such as a forest or moor.
ont00001754: https://en.wikipedia.org/w/index.php
ont00001760: Artifact Ontology

Optical Lens
type: Class
subclass of: Optical Instrument
alternative label: Lens
definition: An Optical Instrument that is designed to focus or disperse a beam of light entering the lens by means of refraction.
ont00001754: https://en.wikipedia.org/wiki/Lens_(optics)
ont00001760: Artifact Ontology

Retail Artifact Function
type: Class
subclass of: Service Artifact Function
definition: A Service Artifact Function that is realized in processes of selling goods or merchandise in small or individual lots for direct consumption by persons or organizations.
ont00001754: https://en.wikipedia.org/w/index.php
ont00001760: Artifact Ontology

Lifting Artifact Function
type: Class
subclass of: Artifact Function
definition: An Artifact Function that is realized by processes in which some Material Artifact is used to lift some object.
ont00001760: Artifact Ontology

Periscope
type: Class
subclass of: Optical Instrument
definition: An Optical Instrument that is designed to enable observation of an object that is located over, around, or through another object, obstacle, or condition that prevents direct line-of-sight observation from the observer's current position.
ont00001754: https://en.wikipedia.org/w/index.php
ont00001760: Artifact Ontology

Medium Machine Gun
type: Class
subclass of: Mounted Gun
definition: A Mounted Gun that is designed to fire full-power rifle Cartridges (less than .50 caliber or 12.7mm) in quick succession from an ammunition belt, and which typically weighs 22-30 lbs.
ont00001754: https://en.wikipedia.org/w/index.php
ont00001760: Artifact Ontology

Signal Processing Artifact Function
type: Class
subclass of: Artifact Function
definition: An Artifact Function that is realized in the process of transferring or processing information contained in signals.
ont00001754: https://en.wikipedia.org/w/index.php
ont00001760: Artifact Ontology

Physically Powered Engine
type: Class
subclass of: Engine
alternative label: Physical Engine
definition: An Engine that is designed to convert potential or kinetic energy into mechanical energy.
ont00001760: Artifact Ontology

Solar Panel System
type: Class
subclass of: Electrical Power Source
alternative label: Photovoltaic System
alternative label: Solar Array
definition: An Electrical Power Source that consists in part of one or more Solar Panels, a power inverter, electrical wiring between the components, a mounting and support structure, and may also include a battery and/or a solar tracking system and is the bearer of functions realized in processes of deriving, transferring, and storing electrical energy derived from light energy.
ont00001754: https://en.wikipedia.org/w/index.php
ont00001760: Artifact Ontology

Dish Receiver
type: Class
subclass of: Radio Receiver
definition: A Radio Receiver that uses a Parabolic (or Dish) Antenna to intercept radio signals.
ont00001760: Artifact Ontology

Material Copy of a Journal Article
type: Class
subclass of: Material Copy of a Document
subclass of: Restriction
  on property: BFO_0000101
  some values from: ont00002045
alternative label: Journal Article
definition: A Material Copy of a Document that is designed to carry a specific brief composition on a specific topic as part of a Journal Issue.
ont00001754: https://en.wikipedia.org/w/index.php
ont00001760: Artifact Ontology

Alkaline Electric Battery
type: Class
subclass of: Primary Cell Electric Battery
definition: A Primary Cell Electric Battery that has a Zinc anode and Manganese (IV) oxide cathode.
ont00001754: https://en.wikipedia.org/w/index.php
ont00001760: Artifact Ontology

Rhombic Antenna
type: Class
subclass of: Wire Antenna
definition: A Wire Antenna that consists of one to three parallel wires suspended above the ground by poles or towers at each vertex in a rhombic shape with each of the four sides being the same length (typically at least one wavelength or longer).
ont00001754: https://en.wikipedia.org/w/index.php
ont00001760: Artifact Ontology

Crushing Artifact Function
type: Class
subclass of: Damaging Artifact Function
definition: A Damaging Artifact Function that is realized in a process in which the structural integrity of an entity is impaired because of significant pressure.
ont00001754: http://www.dictionary.com/browse/crushing
ont00001760: Artifact Ontology

Neutralization Artifact Function
type: Class
subclass of: Chemical Reaction Artifact Function
definition: A Chemical Reaction Artifact Function that is realized in a process in which an acid and a base react quantitatively with each other.
ont00001754: https://en.wikipedia.org/wiki/Neutralization_(chemistry)
ont00001760: Artifact Ontology

Radio Communication Artifact Function
type: Class
subclass of: Electromagnetic Communication Artifact Function
definition: An Electromagnetic Communication Artifact Function that is realized in a process that conveys meaningful signs by means of radio waves.
ont00001754: https://en.wikipedia.org/w/index.php
ont00001760: Artifact Ontology

Sensor Function
type: Class
subclass of: BFO_0000034
definition: A Function that is realized in processes wherein an attribute of its bearer is a proxy for some aspect of its sensing environment.
scope note: A proxy in the sense used here is a stand-in used in place of something else, often because the original is unavailable or not directly accessible.
scope note: Subtypes of Sensor Function should be differentiated based on the type of modality they sense. Where a modality is a specific type of energy, phenomenon, or information input that the Sensor is designed to detect, measure, or otherwise respond to.
ont00001754: https://en.wikipedia.org/w/index.php
ont00001760: Artifact Ontology

Actuator
type: Class
subclass of: Transducer
definition: A Transducer that is designed to convert some control signal into mechanical motion.
ont00001754: https://en.wikipedia.org/w/index.php
ont00001760: Artifact Ontology

Material Copy of a Document Field
type: Class
subclass of: Information Bearing Artifact
subclass of: Restriction
  on property: BFO_0000101
  some values from: ont00002038
definition: An Information Bearing Entity that is a part of some document into which carriers of prescribed information can be written or selected.
ont00001760: Artifact Ontology

Telecommunication Endpoint
type: Class
subclass of: Telecommunication Network Node
definition: A Telecommunication Network Node that connects a Telecommunication Terminal to a Telecommunication Network.
scope note: A Telecommunication Terminal is an end user device such as a Telephone, fax machine, or Computer.
ont00001754: https://en.wikipedia.org/w/index.php
ont00001760: Artifact Ontology

Artificial Eye
type: Class
subclass of: Prosthesis
definition: A Prosthesis that is designed to replace a missing eye.
ont00001754: https://en.wikipedia.org/w/index.php
ont00001760: Artifact Ontology

Cabin Pressurization Control System
type: Class
subclass of: Environment Control System
definition: An Environment Control System that is designed to control the process in which conditioned air is pumped into the Cabin of some Aircraft or Spacecraft in order to create a safe and comfortable environment for passengers and crew flying at high altitudes.
ont00001754: https://en.wikipedia.org/w/index.php
ont00001760: Artifact Ontology

Interior Lighting System
type: Class
subclass of: Lighting System
definition: A Lighting System that is designed to emit light within the interior of some area.
ont00001760: Artifact Ontology

Propulsion Artifact Function
type: Class
subclass of: Motion Artifact Function
definition: A Motion Artifact Function that is realized in a process in which the bearer of the function creates force leading to an entity's movement.
ont00001754: https://en.wikipedia.org/w/index.php
ont00001760: Artifact Ontology

Fuel Artifact Function
type: Class
subclass of: Artifact Function
definition: An Artifact Function that is realized in processes in which a Portion of Fuel is reacted with other substances in order to release chemical or nuclear energy to be used for heat or for work.
ont00001754: https://en.wikipedia.org/w/index.php
ont00001760: Artifact Ontology

Revolver
type: Class
subclass of: Hand Gun
definition: A Hand Gun having a number of firing chambers in a revolving cylinder, where each chamber in the cylinder can be loaded with a single Cartridge.
ont00001754: https://en.wikipedia.org/w/index.php
ont00001760: Artifact Ontology

Insecticide Artifact Function
type: Class
subclass of: Pesticide Artifact Function
definition: A Pesticide Artifact Function that is realized in a process that causes harm to, or the death of, an insect.
ont00001754: https://en.wikipedia.org/w/index.php
ont00001760: Artifact Ontology

Public Address System
type: Class
subclass of: Communication System
alternative label: PA System
definition: A Communication System that is designed to allow a Person to speak to a large audience.
ont00001754: https://en.wikipedia.org/w/index.php
ont00001760: Artifact Ontology

Howitzer
type: Class
subclass of: Cannon
definition: A Cannon that is designed to have a relatively short barrel and to use relatively small propellant charges to propel projectiles in relatively high trajectories with a steep angle of descent.
ont00001754: https://en.wikipedia.org/w/index.php
ont00001760: Artifact Ontology

Wired Communication Relay Artifact Function
type: Class
subclass of: Communication Relay Artifact Function
definition: A Communication Relay Artifact Function that is realized during events in which a Material Artifact is used to first receive and then transmit information by means of wires from one Material Artifact to another for the purpose of communiction.
ont00001760: Artifact Ontology

Nominal Speed Artifact Function
type: Class
subclass of: Speed Artifact Function
definition: A Speed Artifact Function that is realized in some process in which the Artifact bearing the Artifact Function attains a speed that does not exceed some specified tolerance of that Material Artifact.
ont00001760: Artifact Ontology

Stock
type: Class
subclass of: Financial Instrument
definition: A Financial Instrument that entitles holders to an ownership interest (equity) in the specified Incorporated Organization.
ont00001754: https://en.wikipedia.org/w/index.php
ont00001760: Artifact Ontology

Emulsifier Artifact Function
type: Class
subclass of: Chemical Reaction Artifact Function
definition: A Chemical Reaction Artifact Function that is realized in a process in which two or more liquids that are normally immiscible are mixed.
ont00001754: https://en.wikipedia.org/w/index.php
ont00001760: Artifact Ontology

Hydraulic Valve
type: Class
subclass of: Valve
definition: A Valve that is designed to regulate, direct, or control the flow of a liquid by opening, closing, or partially obstructing various passageways.
ont00001754: https://en.wikipedia.org/w/index.php
ont00001760: Artifact Ontology

Round Shot
type: Class
subclass of: Portion of Ammunition
definition: A Portion of Ammunition that is designed to be a solid projectile without explosive charge and to be fired from a cannon.
ont00001754: https://en.wikipedia.org/w/index.php
ont00001760: Artifact Ontology

Bus
type: Class
subclass of: Ground Motor Vehicle
definition: A Ground Motor Vehicle that is designed to transport a large number of people and to travel on six or more tired wheels.
ont00001754: https://en.wikipedia.org/w/index.php
ont00001760: Artifact Ontology

Material Copy of a Document
type: Class
subclass of: Information Bearing Artifact
subclass of: Restriction
  on property: BFO_0000101
  some values from: ont00002039
alternative label: Document
definition: An Information Bearing Artifact that is designed to carry some specific Information Content Entity in a series of paragraphs of text or diagrams in the form of physical pieces of paper or an electronic word processor file.
ont00001754: https://en.wikipedia.org/w/index.php
ont00001760: Artifact Ontology

Wetting Agent Artifact Function
type: Class
subclass of: Surfactant Artifact Function
definition: A Surfactant Artifact Function that is realized in a process that reduces the water repellent tendency of a substance thereby allowing it to become wet.
ont00001754: https://en.wikipedia.org/w/index.php
ont00001760: Artifact Ontology

Patch Antenna
type: Class
subclass of: Radio Antenna
alternative label: Microstrip Patch Antenna
alternative label: Rectangular Microstrip Antenna
definition: A Radio Antenna that consists of a flat rectangular sheet (or patch) of metal mounted over a larger sheet of metal called a ground plane which is typically contained inside a plastic radome for protection and is small enough that it can be mounted on a flat surface.
ont00001754: https://en.wikipedia.org/w/index.php
ont00001760: Artifact Ontology

Service Artifact Function
type: Class
subclass of: Artifact Function
definition: An Artifact Function that is realized in a process of providing intangible goods to consumers.
ont00001754: https://en.wikipedia.org/w/index.php
ont00001760: Artifact Ontology

Position Observation Artifact Function
type: Class
subclass of: Observation Artifact Function
definition: An Observation Artifact Function that is realized during events in which a Material Artifact is used to collect information about the position of a specified object or class of objects.
ont00001760: Artifact Ontology

Dimension Specification
type: Class
subclass of: Quality Specification
definition: An Quality Specification that prescribes some Size Quality.
ont00001760: Artifact Ontology

Observation Artifact Function
type: Class
subclass of: Artifact Function
definition: An Artifact Function that is realized during events in which a Material Artifact is used to collect information about a specified object or class of objects.
ont00001760: Artifact Ontology

Covering Artifact Function
type: Class
subclass of: Artifact Function
definition: An Artifact Function that is realized in a process in which an entity is covered.
ont00001754: http://www.dictionary.com/browse/covering
ont00001760: Artifact Ontology

Article of Clothing
type: Class
subclass of: Material Artifact
definition: A Material Artifact that is designed to cover some portion of a body.
ont00001754: https://en.wikipedia.org/w/index.php
ont00001760: Artifact Ontology

Gimbal
type: Class
subclass of: Equipment Mount
definition: An Equipment Mount that consists of a pivoted support that allows a Material Artifact to Rotate about one or more Axes.
ont00001754: https://en.wikipedia.org/w/index.php
ont00001760: Artifact Ontology

Tank
type: Class
subclass of: Armored Fighting Vehicle
definition: An Armored Fighting Vehicle that is designed to carry heavy firepower, have a powerful Engine, and travel on one or more continuous tracks such that it is suitable for front-line combat and can provide operational maneuverability as well as tactical offensive and defensive capabilities.
scope note: Tank firepower is normally provided by a large-caliber main gun mounted in a rotating turret, which is supported by secondary machine guns. A tank's heavy armour and all-terrain mobility provide protection for both the tank and its crew, allowing it to perform all primary tasks of the armoured troops on the battlefield.
ont00001754: https://en.wikipedia.org/w/index.php
ont00001760: Artifact Ontology

Radio Transceiver
type: Class
subclass of: Radio Communication Instrument
definition: A Radio Communication Instrument that is an electronic device composed of both a Radio Transmitter and a Radio Receiver that share common circuitry or a single housing.
ont00001754: https://en.wikipedia.org/w/index.php
ont00001760: Artifact Ontology

Lead Acid Electric Battery
type: Class
subclass of: Secondary Cell Electric Battery
definition: A Secondary Cell Electric Battery that has a lead anode and lead oxide cathode.
ont00001754: https://en.wikipedia.org/w/index.php
ont00001760: Artifact Ontology

Bearing Artifact Function
type: Class
subclass of: Artifact Function
definition: An Artifact Function that is realized in processes in which the Material Artifact constrains relative motion to only the desired motion, and reduces friction between moving parts.
ont00001754: https://en.wikipedia.org/wiki/Bearing_(mechanical)
ont00001760: Artifact Ontology

Land Transportation Artifact
type: Class
subclass of: Transportation Artifact
definition: A Transportation Artifact that facilitates the movement of Agents and Vehicles via land
ont00001760: Artifact Ontology

Education Artifact Function
type: Class
subclass of: Service Artifact Function
definition: A Service Artifact Function that is realized in processes of transmiting accumulated knowledge skills and values from one generation to another.
ont00001754: https://en.wikipedia.org/w/index.php
ont00001760: Artifact Ontology

Infantry Fighting Vehicle
type: Class
subclass of: Armored Fighting Vehicle
definition: An Armored Fighting Vehicle that is designed to carry infantry into battle and to provide fire support for them.
scope note: Infantry Fighting Vehicles (IFVs) are differentiated from Armored Personnel Carriers (APCs) because they are designed to give direct fire support to the dismounted infantry and so usually have significantly enhanced armament. IFVs also often have improved armour and firing ports (allowing the infantry to fire personal weapons while mounted).
ont00001753: IFV
ont00001754: https://en.wikipedia.org/w/index.php
ont00001760: Artifact Ontology

Circuit Breaker
type: Class
subclass of: Material Artifact
definition: A Material Artifact that is designed to protect an electrical circuit from damage caused by excess current from an overload or short circuit.
ont00001754: https://en.wikipedia.org/w/index.php
ont00001760: Artifact Ontology

Legal Instrument
type: Class
subclass of: Material Artifact
definition: A Material Artifact that is designed as a formally executed written document that can be formally attributed to its author, records and formally expresses a legally enforceable act, process, or contractual duty, obligation, or right, and therefore evidences that act, process, or agreement.
ont00001754: https://en.wikipedia.org/w/index.php
ont00001760: Artifact Ontology

Thermal Control Artifact Function
type: Class
subclass of: Artifact Function
definition: An Artifact Function that is realized by a Material Artifact increasing, decreasing, or maintaining the temperature of itself, a part of itself, or another object.
ont00001760: Artifact Ontology

Speed Artifact Function
type: Class
subclass of: Motion Artifact Function
definition: A Motion Artifact Function that is realized in some process in which its bearer has some speed.
ont00001760: Artifact Ontology

Freight Train Car
type: Class
subclass of: Train Car
alternative label: Freight Car
definition: A Train Car that is designed to transport cargo.
ont00001754: https://en.wikipedia.org/w/index.php
ont00001760: Artifact Ontology

Healing Artifact Function
type: Class
subclass of: Artifact Function
definition: An Artifact Function that is realized in a process in which health is restored to an unbalanced, diseased, or damaged organism.
ont00001754: https://en.wikipedia.org/w/index.php
ont00001760: Artifact Ontology

Maximum Speed Artifact Function
type: Class
subclass of: Speed Artifact Function
definition: A Speed Artifact Function that is realized in some process in which the Material Artifact bearing the Artifact Function attains the highest speed at which that Material Artifact is designed to operate.
ont00001760: Artifact Ontology

Powering Artifact Function
type: Class
subclass of: Artifact Function
definition: An Artifact Function that is realized by processes in which some Material Artifact is used to supply power to some Material Artifact.
ont00001760: Artifact Ontology

Motion Observation Artifact Function
type: Class
subclass of: Observation Artifact Function
definition: An Observation Artifact Function that is realized during events in which a Material Artifact is used to collect information about the Motion of a specified object or class of objects.
ont00001760: Artifact Ontology

Machine Bearing
type: Class
subclass of: Material Artifact
definition: A Material Artifact that is designed to constrain relative motion to only desired motion and reduces friction between moving parts.
ont00001754: https://en.wikipedia.org/wiki/Bearing_(mechanical)
ont00001760: Artifact Ontology

Electromagnetic Induction Artifact Function
type: Class
subclass of: Artifact Function
definition: An Artifact Function that is realized by processes in which some Material Artifact that is used to produce electromotive force across an electrical conductor due to its dynamic interaction with a magnetic field.
ont00001754: https://en.wikipedia.org/w/index.php
ont00001760: Artifact Ontology

Fertilizer Artifact Function
type: Class
subclass of: Enhancing Artifact Function
definition: An Enhancing Artifact Function that is realized in processes of supplying soilds or plant tissues with one or more plant nutrients essential to growth.
ont00001754: https://en.wikipedia.org/w/index.php
ont00001760: Artifact Ontology

Bow
type: Class
subclass of: Projectile Launcher
definition: A Projectile Launcher that is designed to launch Arrows.
ont00001754: https://en.wikipedia.org/w/index.php
ont00001760: Artifact Ontology

Hospitality Artifact Function
type: Class
subclass of: Service Artifact Function
definition: A Service Artifact Function that is realized in processes of accommodation food and beverage meeting and events gaming entertainment and recreation tourism services and visitor information.
ont00001754: https://en.wikipedia.org/w/index.php
ont00001760: Artifact Ontology

Medical Artifact
type: Class
subclass of: Material Artifact
definition: A Material Artifact that is designed for diagnosing, treating, or preventing disease, disability, or death.
ont00001760: Artifact Ontology

Electronic Cash
type: Class
subclass of: Portion of Cash
definition: A Portion of Cash that consists of Bytes.
ont00001760: Artifact Ontology

Filter Function
type: Class
subclass of: Artifact Function
definition: An Artifact Function that is realized in a process where entities of a specific type or which have specified properties enter it or pass through it.
scope note: Although its basic function remains the same, a Filter can be used in 2 different ways: (1) to allow only the desired entities to pass through (e.g. removing dirt from engine oil); or (2) to allow everything except the desired entities to pass through (e.g. panning for gold).
ont00001760: Artifact Ontology

Explosive Mine
type: Class
subclass of: Explosive Weapon
alternative label: Mine
alternative label: Mine Weapon
definition: An Explosive Weapon that is designed to be concealed and to detonate as its target passes near it.
scope note: Being (relatively) stationary is a common but not necessary feature of explosive mines.
ont00001754: https://en.wikipedia.org/w/index.php
ont00001760: Artifact Ontology

Explosive Naval Mine
type: Class
subclass of: Explosive Mine
alternative label: Naval Mine
alternative label: Sea Mine
definition: An Explosive Mine that is designed to be concealed on or under water.
ont00001754: https://en.wikipedia.org/w/index.php
ont00001760: Artifact Ontology

Display Instrument
type: Class
equivalent class: Class
  intersection of: Material Artifact
  intersection of: Restriction
    on property: BFO_0000196
    some values from: Image Display Artifact Function
subclass of: Material Artifact
definition: A Material Artifact that is designed to bear an Image Display Artifact Function.
ont00001760: Artifact Ontology

Image Display Artifact Function
type: Class
subclass of: Artifact Function
definition: An Artifact Function that inheres in Material Artifacts that are designed to display an Image.
ont00001760: Artifact Ontology

Sensor Role
type: Class
subclass of: BFO_0000023
definition: A Role that inheres in an entity in virtue of it being used in a process wherein an attribute of its bearer acts as a proxy for some aspect of its sensing environment.
ont00001760: Artifact Ontology

Sensor Platform Role
type: Class
subclass of: BFO_0000023
definition: A Role that inheres in an entity in virtue of it being used to support or convey a Sensor during its deployment and functioning.
ont00001760: Artifact Ontology

Sensing Process
type: Class
equivalent class: Class
  intersection of: BFO_0000015
  intersection of: Restriction
    on property: BFO_0000055
    some values from: Class
      union of: Sensor Function
      union of: Sensor Role
subclass of: BFO_0000015
definition: A Process that realizes a Sensor Function or Sensor Role.
ont00001760: Artifact Ontology